truck_part.id,truck_part.ts,truck_part.title,truck_part.assembly,truck_part.certification,truck_part.color_finish,truck_part.deals,truck_part.light_source,truck_part.location,truck_part.notes,truck_part.replaces_o_e_number,truck_part.replaces_partslink_number,truck_part.type,truck_part.manufacturer,truck_part.item,truck_part.price,truck_part.quantity_sold,truck_part.by
101,"2017-12-07 21:52:15","48 State Legal Catalytic Converter (No CA and NY Shipments)— REPK960304 Evan Fischer",,,,,,,"Manifold Converter",,,,REPK960304,REPK960304,$234.03,Assembly,"Evan Fischer"
102,"2017-12-07 21:52:15","48 State Legal Catalytic Converter (No CA and NY Shipments)(Firewall And Radiator Side) — SET-REPT960313 EvanFischer",,,,,,"Firewall And Radiator Side","Manifold Converter",,,,SET-REPT960313,SET-REPT960313,$300.20,"Set Of 2","Evan Fischer"
103,"2017-12-07 21:52:15","48 State Legal Catalytic Converter (No CA and NY Shipments)(Front) — REPH960311 Evan Fischer",,,,,,Front,"Manifold Converter",,,,REPH960311,REPH960311,$215.19,Assembly,"Evan Fischer"
104,"2017-12-07 21:52:15","48 State Legal Catalytic Converter (No CA and NY Shipments)(Radiator Side) — REPH960324 Evan Fischer",,,,,,"Radiator Side","Manifold Converter",,,,REPH960324,REPH960324,$240.12,Assembly,"Evan Fischer"
105,"2017-12-07 21:52:15","48 State Legal Catalytic Converter (No CA and NY Shipments)(Front And Rear, Driver Side) — SET-REPN960317 EvanFischer",,,,,,"Front And Rear, Driver Side","Manifold Converter",,,,SET-REPN960317,SET-REPN960317,$305.27,Assembly,"Evan Fischer"
106,"2017-12-07 21:52:15","48 State Legal Catalytic Converter (No CA and NY Shipments)(Radiator Side) — REPT960314 Evan Fischer",,,,,,"Radiator Side","Manifold Converter",,,,REPT960314,REPT960314,$158.00,Assembly,"Evan Fischer"
107,"2017-12-07 21:52:15","48 State Legal Catalytic Converter (No CA and NY Shipments)(Front) — REPT960310 Evan Fischer",,,,,,Front,"Manifold Converter",,,,REPT960310,REPT960310,$186.67,Assembly,"Evan Fischer"
108,"2017-12-07 21:52:15","48 State Legal Catalytic Converter (No CA and NY Shipments)(Firewall Side) — REPF960343 Evan Fischer",,,,,,"Firewall Side",,,,,REPF960343,REPF960343,$134.39,Assembly,"Evan Fischer"
109,"2017-12-07 21:52:15","48 State Legal Catalytic Converter (No CA and NY Shipments)(Front) — REPS960307 Evan Fischer",,,,,,Front,,,,,REPS960307,REPS960307,$169.19,Assembly,"Evan Fischer"
110,"2017-12-07 21:52:15","48 State Legal Catalytic Converter (No CA and NY Shipments)(Front) — REPK960304 Evan Fischer",,,,,,Front,"Manifold Converter",,,,REPK960304,REPK960304,$234.03,Assembly,"Evan Fischer"
111,"2017-12-07 21:52:15","48 State Legal Catalytic Converter (No CA and NY Shipments)— REPA960305 Evan Fischer",,,,,,,,,,,REPA960305,REPA960305,$121.11,Assembly,"Evan Fischer"
112,"2017-12-07 21:52:15","48 State Legal Catalytic Converter (No CA and NY Shipments)(Front And Rear) — REPS960301 Evan Fischer",,,,,,"Front And Rear","Complete with 1 Flat and 1Wire Mesh Gaskets, 2 SpringBolt Assembly and 2 Hex boltswith nuts",,,,REPS960301,REPS960301,$175.21,Assembly,"Evan Fischer"
113,"2017-12-07 21:52:15","48 State Legal Catalytic Converter (No CA and NY Shipments)(Driver And Passenger Side) — SET-REPF960351 EvanFischer",,,,,,"Driver And Passenger Side",,,,,SET-REPF960351,SET-REPF960351,$435.20,"Set Of 2","Evan Fischer"
114,"2017-12-07 21:52:15","48 State Legal Catalytic Converter (No CA and NY Shipments)(Rear) — REPI960307 Evan Fischer",,,,,,Rear,,,,,REPI960307,REPI960307,$274.02,Assembly,"Evan Fischer"
115,"2017-12-07 21:52:15","48 State Legal Catalytic Converter (No CA and NY Shipments)— SET-REPN960308-3 Evan Fischer",,,,,,,"(1) Firewall Side CatalyticConverter, (1) Radiator SideCatalytic Converter, (1) RearCatalytic Converter",,,,SET-REPN960308-3,SET-REPN960308-3,$459.98,"Set Of 3","Evan Fischer"
116,"2017-12-07 21:52:15","48 State Legal Catalytic Converter (No CA and NY Shipments)(Passenger Side) — REPG960305 Evan Fischer",,,,,,"Passenger Side",,,,,REPG960305,REPG960305,$159.05,Assembly,"Evan Fischer"
117,"2017-12-07 21:52:15","48 State Legal Catalytic Converter (No CA and NY Shipments)(Center) — KIT1-082316-01-A Evan Fischer",,,,,,Center,"(1) Center CatalyticConverter, (1) BeforeCatalytic Converter OxygenSensor, (1) After CatalyticConverter Oxygen Sensor",,,,KIT1-082316-01-A,KIT1-082316-01-A,$192.11,Kit,"Evan Fischer"
118,"2017-12-07 21:52:15","48 State Legal Catalytic Converter (No CA and NY Shipments)(Front, Driver And Passenger Side) — SET-REPT960313Evan Fischer",,,,,,"Front, Driver And PassengerSide","Manifold Converter",,,,SET-REPT960313,SET-REPT960313,$300.20,"Set Of 2","Evan Fischer"
119,"2017-12-07 21:52:15","48 State Legal Catalytic Converter (No CA and NY Shipments)(Front) — REPK960303 Evan Fischer",,,,,,Front,,,,,REPK960303,REPK960303,$105.05,Assembly,"Evan Fischer"
120,"2017-12-07 21:52:15","48 State Legal Catalytic Converter (No CA and NY Shipments)(Firewall And Radiator Side) — SET-REPC960316-2 EvanFischer",,,,,,"Firewall And Radiator Side",,,,,SET-REPC960316-2,SET-REPC960316-2,$226.12,Kit,"Evan Fischer"
121,"2017-12-07 21:52:22","Direct Fit Step Bumper — REPT823701 Replacement","With mounting bracket(s)",,Chrome,,,,"Includes reinforcement bar,black pad(s), bolt kit,license plate lights, andbracket(s)",521510C021-PFM,TO1103107,,REPT823701,REPT823701,$322.91,"Sold Individually",Replacement
122,"2017-12-07 21:52:22","Direct Fit Step Bumper — REPF760705 Replacement","Without mounting bracket(s)",,Chrome,,,,"With parking aid sensor holes",9L3Z17906B,FO1102372,,REPF760705,REPF760705,$315.57,"Set Of 2",Replacement
123,"2017-12-07 21:52:22","Direct Fit Step Bumper — REPF823914 Replacement","With mounting bracket(s)",,"Powdercoated Black",,,,"Includes reinforcement bar,black pad(s), bolt kit,license plate lights, andbracket(s); Hitch Style",F1TZ17906G,FO1102257,,REPF823914,REPF823914,$221.01,"Sold Individually",Replacement
124,"2017-12-07 21:52:22","Direct Fit Step Bumper — T823703 Replacement","With mounting bracket(s)",,Chrome,,,,"Includes reinforcement bar,black pad(s), bolt kit,license plate lights, andbracket(s)",002283598113,TO1102215,,T823703,T823703,$209.33,"Sold Individually",Replacement
125,"2017-12-07 21:52:22","Direct Fit Step Bumper — REPC760501 Replacement","Without mounting bracket(s)",,"Powdercoated Black",,,,"Without parking aid sensorholes",9L3Z17906CPTM,FO1102375,,REPC760501,REPC760501,$191.62,"Set Of 2",Replacement
126,"2017-12-07 21:52:22","Direct Fit Step Bumper — REPF760715 Replacement","Without mounting bracket(s)",,Chrome,,,,"Includes reinforcement bar,black pad(s), bolt kit, andlicense plate lights; Withstep pad provision and licenseplate lights holes; Withouttow hook holes",9L3Z17906A-PFM,FO1103160,,REPF760715,REPF760715,$374.98,"Sold Individually",Replacement
127,"2017-12-07 21:52:22","Direct Fit Step Bumper — CV13140 Replacement","Without mounting bracket(s)",,"Powdercoated Black",,,,"Includes reinforcement bar;With step pad provision andlicense plate lights holes",15007519,GM1102406,,CV13140,CV13140,$167.24,"Sold Individually",Replacement
128,"2017-12-07 21:52:22","Direct Fit Step Bumper — REPF760704 Replacement","Without mounting bracket(s)",,Chrome,,,,"Without parking aid sensorholes",9L3Z17906A,FO1102374,,REPF760704,REPF760704,$367.93,"Sold Individually",Replacement
129,"2017-12-07 21:52:22","Direct Fit Step Bumper — KIT1-50915-18-B Replacement","Without mounting bracket(s)",,Chrome,,,,"Kit Includes 3 Bumper StepPads and 1 Step Bumper",,,,KIT1-50915-18-B,KIT1-50915-18-B,$295.80,Kit,Replacement
130,"2017-12-07 21:52:22","Direct Fit Step Bumper — REPC762101 Replacement","With mounting bracket(s)",,"Powdercoated Black",,,,"Includes face bar,reinforcement bar, bolt kit,and bracket(s)",88937342,GM1106559,,REPC762101,REPC762101,$265.72,"Sold Individually",Replacement
131,"2017-12-07 21:52:22","Direct Fit Step Bumper — REPF823716 Replacement","With mounting bracket(s)",,Chrome,,,,"Includes reinforcement bar,black pad(s), bolt kit,license plate lights, andbracket(s); Hitch Style",,FO1102306,,REPF823716,REPF823716,$262.69,"Sold Individually",Replacement
132,"2017-12-07 21:52:22","Direct Fit Step Bumper — 349 Replacement","Without mounting bracket(s)",,Chrome,,,,"Step Bumper only; With steppad provision",8971270801,IZ1102119,,349,349,$100.04,"Sold Individually",Replacement
133,"2017-12-07 21:52:22","Direct Fit Step Bumper — REPC824701 Replacement","Without mounting bracket(s)",,Chrome,,,,"Includes reinforcement bar;With step pad provision",15007517,GM1102415,,REPC824701,REPC824701,$208.63,"Sold Individually",Replacement
134,"2017-12-07 21:52:22","Direct Fit Step Bumper — T823901 Replacement","With mounting bracket(s)",,"Powdercoated Black",,,,"Includes reinforcement bar,black pad(s), bolt kit,license plate lights, andbracket(s)",002283598201,TO1102214,,T823901,T823901,$143.57,"Sold Individually",Replacement
135,"2017-12-07 21:52:22","Direct Fit Step Bumper — REPC760902 Replacement","With mounting bracket(s)",,"Powdercoated Black",,,,"Includes black pad(s), boltkit, and bracket(s)",25962250,GM1103143,,REPC760902,REPC760902,$299.03,"Sold Individually",Replacement
136,"2017-12-07 21:52:22","Direct Fit Step Bumper — REPF760716 Replacement","Without mounting bracket(s)",,"Powdercoated Black",,,,"Includes reinforcement bar,black pad(s), bolt kit, andlicense plate lights; Withstep pad provision and licenseplate lights holes; Withouttow hook holes",9L3Z17906CPTM-PFM,FO1103161,,REPF760716,REPF760716,$447.44,"Sold Individually",Replacement
137,"2017-12-07 21:52:22","Direct Fit Step Bumper — REPF823735 Replacement","Without mounting bracket(s)",,Chrome,,,,"Includes reinforcement bar,black pad(s), bolt kit, andlicense plate lights; Pull barstyle",8L3Z17906C-PFM,FO1103142,,REPF823735,REPF823735,$317.80,"Sold Individually",Replacement
138,"2017-12-07 21:52:22","Direct Fit Step Bumper — REPF823922 Replacement","Without mounting bracket(s)",,"Powdercoated Black",,,,"Includes black pad(s) andlicense plate lights; Hitchstyle",,FO1103120,,REPF823922,REPF823922,$274.55,"Sold Individually",Replacement
139,"2017-12-07 21:52:22","Direct Fit Step Bumper — REPF760728 Replacement","Without mounting bracket(s)",,Chrome,,,,"Step Bumper only; With steppad provision",4L3Z17906AB,FO1102349,,REPF760728,REPF760728,$252.34,"Sold Individually",Replacement
140,"2017-12-07 21:52:22","Direct Fit Step Bumper — KIT1-50915-19-B Replacement","Without mounting bracket(s)",,"Painted Black",,,,"Kit Includes 3 Bumper StepPads and 1 Step Bumper","850627S200, 850637S200,850747S200","NI1197100, NI1196100,NI1191100",,KIT1-50915-19-B,KIT1-50915-19-B,$246.63,Kit,Replacement
141,"2017-12-07 21:52:22","Direct Fit Step Bumper — REPC823703 Replacement","With mounting bracket(s)",,Chrome,,,,"Includes reinforcement bar,black pad(s), bolt kit,license plate lights, andbracket(s)",20899360-PFM,GM1103148,,REPC823703,REPC823703,$307.23,"Sold Individually",Replacement
142,"2017-12-07 21:52:22","Direct Fit Step Bumper — REPF760505NSF Replacement","Without mounting bracket(s)","NSF Certified","Painted Black",Clearance,,,"Step Bumper only; With steppad provision",7T1Z17906AA,FO1102377N,,REPF760505NSF,REPF760505NSF,$188.74,"Sold Individually",Replacement
143,"2017-12-07 21:52:22","Direct Fit Step Bumper — C760501S Replacement","Without mounting bracket(s)",,"Painted Silver",,,,"Step Bumper only; With steppad provision and licenseplate lights holes",12473000-PFM,GM1102412,,C760501S,C760501S,$107.97,"Sold Individually",Replacement
144,"2017-12-07 21:52:22","Direct Fit Step Bumper — REPC823705 Replacement","With mounting bracket(s)",,Chrome,,,,"Includes reinforcement bar,black pad(s), bolt kit,license plate lights, andbracket(s)",20899361-PFM,GM1103151,,REPC823705,REPC823705,$316.42,"Sold Individually",Replacement
145,"2017-12-07 21:52:24","Direct Fit Bumper (Front) — KIT1-050317-23-AReplacement","Without mounting bracket(s)",,Chrome,,,Front,"Kit Includes (1) Bumper, (1)Grille Assembly and (1)Valance","15836961, 15915504, 25810707","GM1002830, GM1092192,GM1200572",,KIT1-050317-23-A,KIT1-050317-23-A,$312.69,Kit,Replacement
146,"2017-12-07 21:52:24","Direct Fit Bumper (Front) — KIT1-050317-24-AReplacement","Without mounting bracket(s)",,Chrome,,,Front,"Kit Includes (1) Bumper, (1)Grille Assembly and (1)Valance","15915504, 15941850, 25810707","GM1002831, GM1092192,GM1200572",,KIT1-050317-24-A,KIT1-050317-24-A,$314.83,Kit,Replacement
147,"2017-12-07 21:52:24","Direct Fit Bumper (Front) — KIT1-061417-71-BReplacement","With mounting bracket(s)",,"Painted Black",,,Front,"Kit Includes (1) Bumper, (1)Grille Assembly, (2) BumperBracket, (2) Bumper Filler and(2) Turn Signal Light","52011AD010, 52012AD010,5210104050, 5251235010,5251335010, 5310035290,8151035100, 8152035100","TO1002153, TO1066115,TO1067115, TO1088101,TO1089101, TO1200194,TO2530119, TO2531119",,KIT1-061417-71-B,KIT1-061417-71-B,$188.05,Kit,Replacement
148,"2017-12-07 21:52:24","Direct Fit Bumper (Front) — KIT1-050317-26-AReplacement","Without mounting bracket(s)",,"Painted Black",,,Front,"Kit Includes (1) Bumper, (1)Grille Assembly and (1)Valance","15915504, 15941837, 25810707","GM1002836, GM1092192,GM1200572",,KIT1-050317-26-A,KIT1-050317-26-A,$242.02,Kit,Replacement
149,"2017-12-07 21:52:24","Direct Fit Bumper (Rear) — KIT1-090717-65-AReplacement","With mounting bracket(s)",,Chrome,,,Rear,"Kit Includes (1) BumperBracket and (1) Bumper","55026265, 55234619","CH1102168, CH1166102",,KIT1-090717-65-A,KIT1-090717-65-A,$158.49,Kit,Replacement
150,"2017-12-07 21:52:24","Direct Fit Bumper (Front) — KIT1-061417-72-AReplacement","With mounting bracket(s)",,"Painted Black",,,Front,"Kit Includes (1) Bumper, (1)Valance, (2) Bumper Bracket,(2) Bumper Filler and (2) TurnSignal Light","52011AD010, 52012AD010,5210104050, 5251235010,5251335010, 5391104041,8151035100, 8152035100","TO1002153, TO1066115,TO1067115, TO1088101,TO1089101, TO1095169,TO2530119, TO2531119",,KIT1-061417-72-A,KIT1-061417-72-A,$187.91,Kit,Replacement
151,"2017-12-07 21:52:24","Direct Fit Bumper (Front) — C010705 Replacement","Without mounting bracket(s)",,"Painted Gray",,,Front,,22872781,GM1002425,,C010705,C010705,$170.35,"Sold Individually",Replacement
152,"2017-12-07 21:52:24","Direct Fit Bumper (Front) — 6741 Replacement","Without mounting bracket(s)",,Chrome,,,Front,"Without Molding Holes",6272560,GM1002257,,6741,6741,$171.16,"Sold Individually",Replacement
153,"2017-12-07 21:52:24","Direct Fit Bumper (Front) — KIT1-050317-64-AReplacement","Without mounting bracket(s)",,Chrome,,,Front,"Kit Includes (1) Bumper, (1)Grille Assembly, (2) Headlightand (2) Valance","15915504, 15941850, 22849840,22853027, 22853028, 25821880","GM1002831, GM1092191,GM1092192, GM1200655,GM2502280, GM2503280",,KIT1-050317-64-A,KIT1-050317-64-A,$689.85,Kit,Replacement
154,"2017-12-07 21:52:24","Direct Fit Bumper (Front) — KIT1-062417-84-AReplacement","With mounting bracket(s)",,Chrome,,,Front,"Kit Includes (1) Bumper Cover,(1) Bumper, (1) Fender, (1)Grille Assembly, (1)Headlight, (1) Hood, (1) TurnSignal Light and (2) Valance","10386198, 10396913, 10397998,15199556, 19150310-PFM,88944302, 88944420, 88968933,89025820","GM1002822, GM1051112,GM1092200, GM1092206,GM1200474, GM1230274,GM1240305, GM2502257,GM2520185",,KIT1-062417-84-A,KIT1-062417-84-A,"$1,091.80",Kit,Replacement
155,"2017-12-07 21:52:24","Direct Fit Bumper (Front) — KIT1-050317-31-AReplacement","Without mounting bracket(s)",,Chrome,,,Front,"Kit Includes (1) Bumper, (1)Grille Assembly and (2)Valance","15836961, 15915504, 25810707,25821880","GM1002830, GM1092191,GM1092192, GM1200572",,KIT1-050317-31-A,KIT1-050317-31-A,$360.70,Kit,Replacement
156,"2017-12-07 21:52:24","Direct Fit Bumper (Front) — KIT1-061217-76-AReplacement","With mounting bracket(s)",,Chrome,,,Front,"Kit Includes (1) Bumper Cover,(1) Bumper Filler, (1) Bumper,(1) Grille Assembly, (1)Headlight, (1) Turn SignalLight, (1) Valance and (2)Grille Trim","10396912, 10397972, 10397973,10397998, 15102065, 15199557,19150310-PFM, 88968933-PFM,89025820","GM1002822, GM1051112,GM1089169, GM1092206,GM1212105, GM1213105,GM2503257, GM2521185",,KIT1-061217-76-A,KIT1-061217-76-A,$721.38,Kit,Replacement
157,"2017-12-07 21:52:24","Direct Fit Bumper (Front) — KIT1-050417-23-AReplacement","Without mounting bracket(s)",,"Painted Black",,,Front,"Kit Includes (1) Bumper, (1)Grille Assembly, (1) Hood, (1)Valance and (2) Headlight","15915504, 15941837, 20863101,22853027, 22853028, 25810707","GM1002836, GM1092192,GM1200572, GM1230365,GM2502280, GM2503280",,KIT1-050417-23-A,KIT1-050417-23-A,$735.46,Kit,Replacement
158,"2017-12-07 21:52:24","Direct Fit Bumper (Front) — KIT1-061217-69-AReplacement","With mounting bracket(s)",,Chrome,,,Front,"Kit Includes (1) Bumper Cover,(1) Bumper, (1) GrilleAssembly, (1) License PlateBracket, (1) Valance, (2)Headlight and (2) Turn SignalLight","10396912, 10396913, 10397998,15197277, 15199556, 15199557,19150310-PFM, 88968933,89025820","GM1002822, GM1051112,GM1068116, GM1092206,GM1200474, GM2502257,GM2503257, GM2520185,GM2521185",,KIT1-061217-69-A,KIT1-061217-69-A,$797.57,Kit,Replacement
159,"2017-12-07 21:52:24","Direct Fit Bumper (Front) — KIT1-090717-69-AReplacement","Without mounting bracket(s)",,Chrome,,,Front,"Kit Includes (1) Bumper and(2) Turn Signal Light","5210135320, 8151035120,8152035120","TO1002172, TO2530125,TO2531125",,KIT1-090717-69-A,KIT1-090717-69-A,$188.69,Kit,Replacement
160,"2017-12-07 21:52:24","Direct Fit Bumper (Front) — KIT1-092517-01-BReplacement","With mounting bracket(s)",,"Painted Black",,,Front,"Includes (4) Bumper Bracketsand (1) Bumper","89025748, 15059654, 15059655,15059688, 15059687","GM1002818, GM1067167,GM1066167, GM1067175,GM1066175",,KIT1-092517-01-B,KIT1-092517-01-B,$314.59,Kit,Replacement
161,"2017-12-07 21:52:24","Direct Fit Bumper (Front) — C010901 Replacement","Without mounting bracket(s)",,Chrome,,,Front,"Without pad holes",Performance,GM1002815,,C010901,C010901,$180.28,"Sold Individually",Replacement
162,"2017-12-07 21:52:24","Direct Fit Bumper (Front) — KIT1-50915-06-BReplacement","Without mounting bracket(s)",,"Painted Black",,,Front,"Kit Includes 2 Bumper Ends and1 Bumper",,,,KIT1-50915-06-B,KIT1-50915-06-B,$158.69,Kit,Replacement
163,"2017-12-07 21:52:24","Direct Fit Bumper (Front) — KIT1-050217-40-AReplacement","Without mounting bracket(s)",,Chrome,,,Front,"Kit Includes (1) Bumper End,(1) Bumper and (2) Valance","15915504, 15941850, 20985757,25821880","GM1002831, GM1004156,GM1092191, GM1092192",,KIT1-050217-40-A,KIT1-050217-40-A,$429.25,Kit,Replacement
164,"2017-12-07 21:52:24","Direct Fit Bumper (Front) — KIT1-050517-04-AReplacement","Without mounting bracket(s)",,"Painted Black",,,Front,"Kit Includes (1) Bumper, (1)Grille Assembly, (1)Headlight, (1) Hood and (1)Valance","15915504, 15941837, 20863101,22849840, 22853027","GM1002836, GM1092192,GM1200655, GM1230365,GM2502280",,KIT1-050517-04-A,KIT1-050517-04-A,$747.03,Kit,Replacement
165,"2017-12-07 21:52:24","Direct Fit Bumper (Front) — KIT1-110916-44-AReplacement","Without mounting bracket(s)",,"Painted Black",,,Front,"Kit Includes 1 Bumper and 2Bumper Ends","5211189140, 5210289106,5210389106","TO1002117, TO1005116,TO1004157",,KIT1-110916-44-A,KIT1-110916-44-A,$79.78,Kit,Replacement
166,"2017-12-07 21:52:24","Direct Fit Bumper (Front) — 5078-1 Replacement","Without mounting bracket(s)",,Chrome,,,Front,,55234550,CH1002168,,5078-1,5078-1,$91.99,"Sold Individually",Replacement
167,"2017-12-07 21:52:24","Direct Fit Bumper (Front) — REPF010503P Replacement","Without mounting bracket(s)",,"Painted Black",,,Front,"Without impact strip holes",C4TZ17757C,FO1002101,,REPF010503P,REPF010503P,$90.82,"Sold Individually",Replacement
168,"2017-12-07 21:52:24","Direct Fit Bumper (Front) — KIT1-050317-32-AReplacement","Without mounting bracket(s)",,Chrome,,,Front,"Kit Includes (1) Bumper, (1)Grille Assembly and (2)Valance","15915504, 15941850, 25810707,25821880","GM1002831, GM1092191,GM1092192, GM1200572",,KIT1-050317-32-A,KIT1-050317-32-A,$362.85,Kit,Replacement
169,"2017-12-07 21:52:26","Grille Assembly — KIT1-012717-06-D Replacement",,,"Textured Black",,,,"Includes 2 Grille Assemblies,Bumper Cover, Grille Trim, 2Fog Light Covers, Hood, and 2Fenders","71103TZ5A00, 75101TZ5A01,04711TZ5A80ZZ, 75105TZ5A01,71102TZ5A00, 71107TZ5A00,60100TZ5A90ZZ-PFM,60210TZ5A90ZZ, 60260TZ5A90ZZ","AC1036100, AC1200121,AC1000184, AC1202103,AC1039105, AC1038105,AC1230127, AC1241124,AC1240124","Bumper Grille",KIT1-012717-06-D,KIT1-012717-06-D,"$1,385.11",Kit,Replacement
170,"2017-12-07 21:52:26","Grille Assembly — REPT070113 Replacement",,,"Textured Black Shell w/ ChromeInsert",,,,"With chrome molding and emblemprovision",531000C070C1,TO1200322,Grille,REPT070113,REPT070113,$150.53,"Sold Individually",Replacement
171,"2017-12-07 21:52:26","Grille Assembly — ARBC070108 Replacement",,,Silver,Clearance,,,"With emblem provision",,,Grille,ARBC070108,ARBC070108,$224.81,"Sold Individually",Replacement
172,"2017-12-07 21:52:26","Grille Assembly — REPJ070121C Replacement",,,Chrome,,,,"With holes for headlight andturn signal; Without emblemprovision",68046306AA-PFM,CH1200328,Grille,REPJ070121C,REPJ070121C,$147.74,"Sold Individually",Replacement
173,"2017-12-07 21:52:26","Grille Assembly — REPH070189Q Replacement",,"CAPA Certified","Textured Black",,,,,71121T7WA00,HO1200226C,Grille,REPH070189Q,REPH070189Q,$125.49,"Sold Individually",Replacement
174,"2017-12-07 21:52:26","Grille Assembly (Driver And Passenger Side) —SET-ARBS070301 Replacement",,,"Chrome Shell w/ Black Insert",,,"Driver And Passenger Side","Without emblem provision","12797997, 12797999",,Grille,SET-ARBS070301,SET-ARBS070301,$78.97,"Set Of 2",Replacement
175,"2017-12-07 21:52:26","Grille Assembly — KIT1-50915-09-B Replacement",,,"Chrome Shell w/ Black Insert",,,,"Kit Includes 1 GrilleAssembly, 2 Corner Lights and2 Headlights","5310004070, 8161004050,8162004050, 8111004090,8115004090","TO1200205, TO2521155,TO2520155, TO2503120,TO2502120",Grille,KIT1-50915-09-B,KIT1-50915-09-B,$139.75,Kit,Replacement
176,"2017-12-07 21:52:26","Grille Assembly — H070148 Replacement",,,Black,,,,"With emblem provision",71121S5PA02,HO1200165,Grille,H070148,H070148,$40.44,"Sold Individually",Replacement
177,"2017-12-07 21:52:26","Grille Assembly — REPTY070123 Replacement",,,"Textured Black",,,,"With chrome molding and emblemprovision",5310106441,TO1200387,Grille,REPTY070123,REPTY070123,$161.25,"Sold Individually",Replacement
178,"2017-12-07 21:52:26","Grille Assembly — REPI070101 Replacement",,,Chrome,,,,"With emblem provision",62310EH200,IN1200112,Grille,REPI070101,REPI070101,$162.05,"Sold Individually",Replacement
179,"2017-12-07 21:52:26","Grille Assembly — ARBG070102 Replacement",,,"Chrome Shell w/ Primed Insert",,,,"With emblem provision",22785560,GM1200585,Grille,ARBG070102,ARBG070102,$118.73,"Sold Individually",Replacement
180,"2017-12-07 21:52:26","Grille Assembly — RBC070102 Replacement",,,"Chrome Shell w/ Textured BlackInsert",,,,"Without center bar; Withemblem provision",19122337,GM1200589,Grille,RBC070102,RBC070102,$121.26,"Sold Individually",Replacement
181,"2017-12-07 21:52:26","Grille Assembly — 9754 Replacement",,,Silver,,,,"With headlight holes andemblem provision",623100W001,NI1200175,Grille,9754,9754,$94.26,"Sold Individually",Replacement
182,"2017-12-07 21:52:26","Grille Assembly — 9549 Replacement",,,"Textured Gray",,,,"With emblem provision",623108B725,NI1200182,Grille,9549,9549,$16.48,"Sold Individually",Replacement
183,"2017-12-07 21:52:26","Grille Assembly — REPM070124 Replacement",,,Gray,,,,"With emblem provision",20488014837246,MB1200145,Grille,REPM070124,REPM070124,$91.67,"Sold Individually",Replacement
184,"2017-12-07 21:52:26","Grille Assembly — KIT1-70815-46-B Replacement",,,Black,,,,"Kit Includes 1 GrilleAssembly, 2 Headlights, 1 Hoodand 2 Fenders","5311152070C1, 8113052440,8117052440, 5330152190,5380152050, 5380252050","SC1200101, SC2519101,SC2518101, SC1230102,SC1241102, SC1240102",Grille,KIT1-70815-46-B,KIT1-70815-46-B,$439.11,Kit,Replacement