truck_part.id,truck_part.ts,truck_part.title,truck_part.assembly,truck_part.certification,truck_part.color_finish,truck_part.deals,truck_part.light_source,truck_part.location,truck_part.notes,truck_part.replaces_o_e_number,truck_part.replaces_partslink_number,truck_part.type,truck_part.manufacturer,truck_part.item,truck_part.price,truck_part.quantity_sold,truck_part.by
201,"2017-12-07 21:52:34","Direct Fit Power Window Regulator Brand New (Rear, DriverSide) — REPL491710 Replacement",,,,,,"Rear, Driver Side",,3W4Z5427009AA,FO1550124,,REPL491710,REPL491710,$55.81,"Sold Individually",Replacement
202,"2017-12-07 21:52:34","Direct Fit Power Window Regulator Brand New (Rear, DriverSide) — REPF491702 Replacement",,,,,,"Rear, Driver Side",,6L2Z7827001BA,FO1550118,,REPF491702,REPF491702,$62.61,"Sold Individually",Replacement
203,"2017-12-07 21:52:34","Direct Fit Power Window Regulator Brand New (Front,Driver And Passenger Side) — SET-D462929 Replacement",,,,,,"Front, Driver And PassengerSide",,"96247389, 96247388","DA1351100, DA1350100",,SET-D462929,SET-D462929,$126.57,"Set Of 2",Replacement
204,"2017-12-07 21:52:34","Direct Fit Power Window Regulator Brand New (Front,Passenger Side) — REPV462906 Replacement",,,,,,"Front, Passenger Side","This is repair kit only",,,,REPV462906,REPV462906,$30.35,"Sold Individually",Replacement
205,"2017-12-07 21:52:34","Direct Fit Power Window Regulator Brand New (Front,Passenger Side) — T462931 Replacement",,,,,,"Front, Passenger Side",,"6980135100, 6980135100-PFM",TO1351132,,T462931,T462931,$44.43,"Sold Individually",Replacement
206,"2017-12-07 21:52:34","Direct Fit Power Window Regulator Brand New (Front AndRear, Driver And Passenger Side) — SET-REPT491747-4Replacement",,,,Overstock,,"Front And Rear, Driver AndPassenger Side",,"69801AC020-PFM, 69802AC020-PFM","TO1351191, TO1350191,TO1551160, TO1550160",,SET-REPT491747-4,SET-REPT491747-4,$147.06,"Set Of 4",Replacement
207,"2017-12-07 21:52:34","Direct Fit Power Window Regulator Brand New (Rear,Passenger Side) — REPM491741 Replacement",,,,Overstock,,"Rear, Passenger Side",,BBM472590,MA1551114,,REPM491741,REPM491741,$27.29,"Sold Individually",Replacement
208,"2017-12-07 21:52:34","Direct Fit Power Window Regulator Brand New (Front,Driver And Passenger Side) — SET-REPV462937Replacement",,,,,,"Front, Driver And PassengerSide",,"7L0837462, 7L0837461",,,SET-REPV462937,SET-REPV462937,$68.10,"Set Of 2",Replacement
209,"2017-12-07 21:52:34","Direct Fit Power Window Regulator Brand New (Rear, DriverSide) — RBH491708 Replacement",,,,Overstock,,"Rear, Driver Side",,8340325010-PFM,,,RBH491708,RBH491708,$52.24,"Sold Individually",Replacement
210,"2017-12-07 21:52:34","Direct Fit Power Window Regulator Brand New (Front,Passenger Side) — H462929 Replacement",,,,Clearance,,"Front, Passenger Side",,8240422011,HY1351103,,H462929,H462929,$14.89,"Sold Individually",Replacement
211,"2017-12-07 21:52:34","Direct Fit Power Window Regulator Brand New (Front,Passenger Side) — REPF462915 Replacement",,,,,,"Front, Passenger Side",,6L3Z1823200BA,FO1351152,,REPF462915,REPF462915,$69.79,"Sold Individually",Replacement
212,"2017-12-07 21:52:34","Direct Fit Power Window Regulator Brand New (Rear,Passenger Side) — REPS491703 Replacement",,,,Overstock,,"Rear, Passenger Side",,5333422,SB1551100,,REPS491703,REPS491703,$51.20,"Sold Individually",Replacement
213,"2017-12-07 21:52:34","Direct Fit Power Window Regulator Brand New (Front,Passenger Side) — REPT462995 Replacement",,,,Overstock,,"Front, Passenger Side",,6980108020,TO1351210,,REPT462995,REPT462995,$14.18,"Sold Individually",Replacement
214,"2017-12-07 21:52:34","Direct Fit Power Window Regulator Brand New (Front,Driver Side) — T462932 Replacement",,,,,,"Front, Driver Side",,6980235090-PFM,TO1350132,,T462932,T462932,$40.02,"Sold Individually",Replacement
215,"2017-12-07 21:52:34","Direct Fit Power Window Regulator Brand New (Rear, DriverSide) — REPC491712 Replacement",,,,Clearance,,"Rear, Driver Side",,19301979,GM1550116,,REPC491712,REPC491712,$25.71,"Sold Individually",Replacement
216,"2017-12-07 21:52:34","Direct Fit Power Window Regulator Brand New (Front,Driver And Passenger Side) — SET-S462915 Replacement",,,,,,"Front, Driver And PassengerSide",,"8340157B00, 8340257B00","SZ1351103, SZ1350103",,SET-S462915,SET-S462915,$95.27,"Set Of 2",Replacement
217,"2017-12-07 21:52:39","Direct Fit Fuel Pump Brand New — REPC314516Replacement",,,,,,,"Fuel pump module assembly;With module code GFN",19177231,,,REPC314516,REPC314516,$122.63,"Sold Individually",Replacement
218,"2017-12-07 21:52:39","Direct Fit Fuel Pump Brand New — REPC314517Replacement",,,,,,,"Fuel pump module assembly;Without fuel fitting forauxiliary power units","19179492, 19179593, 19177264",,,REPC314517,REPC314517,$52.00,"Sold Individually",Replacement
219,"2017-12-07 21:52:39","Direct Fit Fuel Pump Brand New — REPF314587Replacement",,,,,,,"Fuel pump and sender assembly",,,,REPF314587,REPF314587,$102.88,"Sold Individually",Replacement
220,"2017-12-07 21:52:39","Direct Fit Fuel Pump Brand New — REPC314518Replacement",,,,,,,"Fuel pump module assembly","19179597, 25314327",,,REPC314518,REPC314518,$54.45,"Sold Individually",Replacement
221,"2017-12-07 21:52:39","Direct Fit Fuel Pump Brand New — REPC314519Replacement",,,,,,,"Fuel pump module assembly",4897420AB,,,REPC314519,REPC314519,$63.90,"Sold Individually",Replacement
222,"2017-12-07 21:52:39","Direct Fit Fuel Pump Brand New — REPL314512Replacement",,,,,,,"Fuel pump module assembly; Forvehicles with secondary airinjection; Without fuel tankpressure sensor",WFX101060,,,REPL314512,REPL314512,$58.00,"Sold Individually",Replacement
223,"2017-12-07 21:52:39","Direct Fit Fuel Pump Brand New — REPF314501Replacement",,,,,,,"Fuel pump motor","E7TZ-9C407-BA, E7UZ-9C407-AA",,,REPF314501,REPF314501,$34.61,"Sold Individually",Replacement
224,"2017-12-07 21:52:39","Direct Fit Fuel Pump Brand New — REPA314516Replacement",,,,,,,"Fuel pump module assembly",,,,REPA314516,REPA314516,$135.46,"Sold Individually",Replacement
225,"2017-12-07 21:52:39","Direct Fit Fuel Pump Brand New — REPT314518Replacement",,,,,,,"Fuel pump module assembly",,,,REPT314518,REPT314518,$85.00,"Sold Individually",Replacement
226,"2017-12-07 21:52:39","Direct Fit Fuel Pump Brand New — REPN314515Replacement",,,,,,,"Fuel pump module assembly",,,,REPN314515,REPN314515,$106.31,"Sold Individually",Replacement
227,"2017-12-07 21:52:39","Direct Fit Fuel Pump Brand New — REPF314502Replacement",,,,,,,"Fuel pump motor","F2VZ9A407EA, F69Z9H307AA,ZZM513350A",,,REPF314502,REPF314502,$21.62,"Sold Individually",Replacement
228,"2017-12-07 21:52:39","Direct Fit Fuel Pump Brand New — REPF314581Replacement",,,,,,,"Fuel pump motor",,,,REPF314581,REPF314581,$32.00,"Sold Individually",Replacement
229,"2017-12-07 21:52:39","Direct Fit Fuel Pump Brand New — REPH314504Replacement",,,,,,,"Fuel pump and hanger assembly",17040SM4A30,,,REPH314504,REPH314504,$84.15,"Sold Individually",Replacement
230,"2017-12-07 21:52:39","Direct Fit Fuel Pump Brand New — RC31450002Replacement",,,,,,,"Fuel pump module assembly",,,,RC31450002,RC31450002,$52.00,"Sold Individually",Replacement
231,"2017-12-07 21:52:39","Direct Fit Fuel Pump Brand New — REPG314518Replacement",,,,,,,"Fuel pump module assembly",,,,REPG314518,REPG314518,$84.96,"Sold Individually",Replacement
232,"2017-12-07 21:52:39","Direct Fit Fuel Pump Brand New — REPN314517Replacement",,,,,,,"Fuel pump and sender assembly","170403S505, 170405S105",,,REPN314517,REPN314517,$89.45,"Sold Individually",Replacement
233,"2017-12-07 21:52:39","Direct Fit Fuel Pump Brand New — RF31450002Replacement",,,,,,,"Fuel pump module assembly",6C3Z9H307AA,,,RF31450002,RF31450002,$73.01,"Sold Individually",Replacement
234,"2017-12-07 21:52:39","Direct Fit Fuel Pump Brand New (Passenger Side) —REPB314524 Replacement",,,,,,"Passenger Side","Fuel pump module assembly",16116755043,,,REPB314524,REPB314524,$85.00,"Sold Individually",Replacement
235,"2017-12-07 21:52:39","Direct Fit Fuel Pump Brand New — REPC314581Replacement",,,,,,,"Fuel pump module assembly;Must use original pressuresensor",19177256,,,REPC314581,REPC314581,$42.00,"Sold Individually",Replacement
236,"2017-12-07 21:52:39","Direct Fit Fuel Pump Brand New — REPF314506Replacement",,,,,,,"Fuel pump motor","E9TZ9H307D, F57Z9H307B,F6PZ9H307EB, F6PZ9H307EC,F6TZ9A407BA",,,REPF314506,REPF314506,$27.00,"Sold Individually",Replacement
237,"2017-12-07 21:52:39","Direct Fit Fuel Pump Brand New — REPF314542Replacement",,,,,,,"Fuel pump module assembly","YL8Z9H307A, YL8Z9H307BC",,,REPF314542,REPF314542,$68.90,"Sold Individually",Replacement
238,"2017-12-07 21:52:39","Direct Fit Fuel Pump Brand New — REPF314580Replacement",,,,,,,"Fuel pump and sender assembly",,,,REPF314580,REPF314580,$78.78,"Sold Individually",Replacement
239,"2017-12-07 21:52:39","Direct Fit Fuel Pump Brand New — REPB314514Replacement",,,,,,,"Fuel pump module assembly",1HM919051M,,,REPB314514,REPB314514,$71.40,"Sold Individually",Replacement
240,"2017-12-07 21:52:39","Direct Fit Fuel Pump Brand New — REPM314519Replacement",,,,,,,"Fuel pump module assembly","1F1Z9H307GA, 1F1Z9H307BD,1F1Z9H307GB",,,REPM314519,REPM314519,$47.50,"Sold Individually",Replacement
241,"2017-12-07 21:52:47","Factory Type Hood — KIT1-111216-59-B Replacement",,,Primed,,,,"Kit Includes 1 Hood and 1Fender","F51005Y7CM, 631004Y935","NI1230152, NI1241166",,KIT1-111216-59-B,KIT1-111216-59-B,$304.86,Kit,Replacement
242,"2017-12-07 21:52:47","Factory Type Hood — N130102 Replacement",,,Primed,,,,"With windshield washer nozzleholes",F5A002W6MA,NI1230158,,N130102,N130102,$151.37,"Sold Individually",Replacement
243,"2017-12-07 21:52:47","Factory Type Hood — KIT1-111316-95-C Replacement",,,Primed,,,,"Kit Includes 1 Hood, 1 BumperCover and 2 Fenders","60100S5DA80ZZ, 04711S5AA91ZZ,60211S5AA80ZZ, 60261S5AA80ZZ","HO1230145, HO1000216,HO1241162, HO1240162",,KIT1-111316-95-C,KIT1-111316-95-C,$364.67,Kit,Replacement
244,"2017-12-07 21:52:47","Factory Type Hood — N130103 Replacement",,,Primed,,,,"With emblem provision; Withwindshield washer nozzle holes",651009Z435,NI1230156,,N130103,N130103,$148.71,"Sold Individually",Replacement
245,"2017-12-07 21:52:47","Factory Type Hood — KIT1-012717-95-I Replacement",,,Primed,,,,"Includes Hood, Bumper Cover, 2Bumper Retainers, 2 SideMarkers, 2 Fenders, 2 FenderLiners, Hood Molding, BumperAbsorber, BumperReinforcement, 3 GrilleAssemblies, Grille Trim, 2Headlights, 2 Hood Hinges,Lift Support, Hood Latch, andRadiator Suppor","60100SEPA90ZZ, 04711SEPA90ZZ,71140SEPA00ZZ, 71190SEPA00ZZ,33800SEPA01, 33850SEPA01,04620SEPA91ZZ, 04630SEPA90ZZ,74100SEPA10, 74150SEPA10,75120SEPA00, 71170SEPA02,71130SEPA12ZZ, 71130SEPA11ZZ,71102SEPA00, 71107SEPA00,71120SEPA00, 75705SEPA00,33101","AC1230112, AC1000149,AC1027101, AC1026101,AC2551104, AC2550104,AC1241114, AC1240114,AC1249117, AC1248116,AC1235101, AC1070120,AC1006140, AC1006142,AC1039103, AC1038103,AC1200109, AC1203100,AC2519109, AC2518109,AC1236103, AC1236104,AC1234100",,KIT1-012717-95-I,KIT1-012717-95-I,"$1,947.67",Kit,Replacement
246,"2017-12-07 21:52:47","Factory Type Hood — KIT1-111016-74-D Replacement",,,Primed,,,,"Kit Includes 1 Hood, 1Headlight, 1 Fender and 1Bumper Cover","53301AA040, 81110AA010,53811AA020, 52119AA901","TO1230167, TO2503117,TO1241162, TO1000187",,KIT1-111016-74-D,KIT1-111016-74-D,$379.10,Kit,Replacement
247,"2017-12-07 21:52:47","Factory Type Hood — KIT1-012717-14-A Replacement",,,Primed,,,,"Includes Hood and 2 HoodHinges","60100STKA91ZZ, 60120SHJA00ZZ,60170SHJA00ZZ","AC1230122, HO1236125,HO1236126",,KIT1-012717-14-A,KIT1-012717-14-A,$366.37,Kit,Replacement
248,"2017-12-07 21:52:47","Factory Type Hood — 9753 Replacement",,,Primed,,,,"With windshield washer nozzleholes",F51000W0CM,NI1230148,,9753,9753,$185.72,"Sold Individually",Replacement
249,"2017-12-07 21:52:47","Factory Type Hood — KIT1-022716-26-D Replacement",,,Primed,,,,"Kit Includes 1 Hood, 1Valance, 1 Bumper Cover, 3Grille Assemblies and 2Headlights","5330152190, 7685152070,5211952915, 5311452020,5311252100, 5311152070C1,8113052440, 8117052440","SC1230102, SC1093101,SC1000102, SC1036100,SC1036101, SC1200101,SC2519101, SC2518101",,KIT1-022716-26-D,KIT1-022716-26-D,$560.77,Kit,Replacement
250,"2017-12-07 21:52:47","Factory Type Hood — L130105 Replacement",,,Primed,,,,"With grille provision; Withwindshield washer nozzle holes",5330133091,LX1230103,,L130105,L130105,$179.55,"Sold Individually",Replacement
251,"2017-12-07 21:52:47","Factory Type Hood — KIT1-111216-60-B Replacement",,,Primed,,,,"Kit Includes 1 Hood and 1Fender","F51005Y7CM, 631014Y935","NI1230152, NI1240166",,KIT1-111216-60-B,KIT1-111216-60-B,$304.86,Kit,Replacement
252,"2017-12-07 21:52:47","Factory Type Hood — REPH130118Q Replacement",,"CAPA Certified",Primed,,,,,664002M000,HY1230145C,,REPH130118Q,REPH130118Q,$198.78,"Sold Individually",Replacement
253,"2017-12-07 21:52:47","Factory Type Hood — N130105 Replacement",,,Primed,,,,,F51007Z830,NI1230159,,N130105,N130105,$204.90,"Sold Individually",Replacement
254,"2017-12-07 21:52:47","Factory Type Hood — K130104 Replacement",,,Primed,,,,"With windshield washer nozzleholes",0K2AA52310B,KI1230110,,K130104,K130104,$210.31,"Sold Individually",Replacement
255,"2017-12-07 21:52:47","Factory Type Hood — C130132 Replacement",,,Primed,,,,,15258957,GM1230340,,C130132,C130132,$141.09,"Sold Individually",Replacement
256,"2017-12-07 21:52:47","Factory Type Hood — REPF130106 Replacement",,,Primed,,,,"With windshield washer nozzleholes",7T1Z16612A,FO1230288,,REPF130106,REPF130106,$132.47,"Sold Individually",Replacement
257,"2017-12-07 21:52:47","Factory Type Hood — KIT1-012717-06-F Replacement",,,Primed,,,,"Includes Hood, Bumper Cover, 2Grille Assemblies, GrilleTrim, 2 Fog Light Covers, and2 Fenders","60100TZ5A90ZZ-PFM,04711TZ5A80ZZ, 71103TZ5A00,75101TZ5A01, 75105TZ5A01,71102TZ5A00, 71107TZ5A00,60210TZ5A90ZZ, 60260TZ5A90ZZ","AC1230127, AC1000184,AC1036100, AC1200121,AC1202103, AC1039105,AC1038105, AC1241124,AC1240124",,KIT1-012717-06-F,KIT1-012717-06-F,"$1,385.11",Kit,Replacement
258,"2017-12-07 21:52:47","Factory Type Hood — 9063 Replacement",,,Primed,,,,"With windshield washer nozzleholes",6510065Y30,NI1230112,,9063,9063,$153.08,"Sold Individually",Replacement
259,"2017-12-07 21:52:47","Factory Type Hood — ME9107 Replacement",,,Primed,,,,,XF5Z16612AA,FO1230183,,ME9107,ME9107,$120.80,"Sold Individually",Replacement
260,"2017-12-07 21:52:47","Factory Type Hood — F130134 Replacement",,,Primed,,,,"Without scoop provision",7R3Z16612B,FO1230254,,F130134,F130134,$526.50,"Sold Individually",Replacement
261,"2017-12-07 21:52:47","Factory Type Hood — REPF130122Q Replacement",,"CAPA Certified",Primed,,,,,68070524AA,FI1230100C,,REPF130122Q,REPF130122Q,$144.03,"Sold Individually",Replacement
262,"2017-12-07 21:52:47","Factory Type Hood — C130119Q Replacement",,"CAPA Certified",Primed,,,,"Fits models without bodycladding",88944302,GM1230274C,,C130119Q,C130119Q,$208.39,"Sold Individually",Replacement
263,"2017-12-07 21:52:47","Factory Type Hood — KIT1-012417-13-E Replacement",,,Primed,,,,"Includes Hood, Bumper Cover, 2Fender Liners, BumperReinforcement, Bumper Trim,Valance, 2 Headlights, 2 FogLights, 2 Hood Hinges, and 2Fenders","60100STXA91ZZ-PFM,04711STXA90ZZ, 74101STXA00,74151STXA00, 71130STXA01ZZ,71110STXA00ZB, 71110STXA00ZA,33101STXA02, 33151STXA02,33901STXA01, 33901STXA11,33951STXA01, 33951STXA11,60120STXA00ZZ, 60170STXA00ZZ,60210STXA90ZZ, 60260STXA90ZZ","AC1230124, AC1000157,AC1249123, AC1248123,AC1006144, AC1044101,AC1015102, AC2519111,AC2518111, AC2593107,AC2595101, AC2592107,AC2594101, AC1236105,AC1236106, AC1241119,AC1240119",,KIT1-012417-13-E,KIT1-012417-13-E,"$1,921.54",Kit,Replacement
264,"2017-12-07 21:52:47","Factory Type Hood — L130106 Replacement",,,Gelcoat,Clearance,,,"With grille provision; Withwindshield washer nozzle holes",XW4Z16612AA,FO1230236,,L130106,L130106,$226.97,"Sold Individually",Replacement
265,"2017-12-07 21:52:55","Direct Fit Radiator — P2928 Replacement",,,"Factory Finish",,,,"Automatic Transmission (willfit Manual Transmission,transmission coolant line doesnot need to be plugged)",253102H050,HY3010158,,P2928,P2928,$78.58,"Sold Individually",Replacement
266,"2017-12-07 21:52:55","Direct Fit Radiator — P2758 Replacement",,,"Factory Finish",,,,,1604121281,TO3010278,,P2758,P2758,$96.55,"Sold Individually",Replacement
267,"2017-12-07 21:52:55","Direct Fit Radiator — P2101 Replacement",,,"Factory Finish",,,,,55037653AB,CH3010331,,P2101,P2101,$87.84,"Sold Individually",Replacement
268,"2017-12-07 21:52:55","Direct Fit Radiator — P2989 Replacement",,,"Factory Finish",,,,,19010R70A53,HO3010216,,P2989,P2989,$96.42,"Sold Individually",Replacement
269,"2017-12-07 21:52:55","Direct Fit Radiator — P2437 Replacement",,,"Factory Finish",,,,,164000H200,TO3010302,,P2437,P2437,$63.09,"Sold Individually",Replacement
270,"2017-12-07 21:52:55","Direct Fit Radiator — P2852 Replacement",,,"Factory Finish",,,,,8W7Z8005A,FO3010271,,P2852,P2852,$65.22,"Sold Individually",Replacement
271,"2017-12-07 21:52:55","Direct Fit Radiator — P2136 Replacement",,,"Factory Finish",,,,,F75Z8005JA,FO3010144,,P2136,P2136,$107.96,"Sold Individually",Replacement
272,"2017-12-07 21:52:55","Direct Fit Radiator — P2990 Replacement",,,"Factory Finish",,,,,19010R40A52,HO3010217,,P2990,P2990,$65.28,"Sold Individually",Replacement
273,"2017-12-07 21:52:55","Direct Fit Radiator — P13576 Replacement",,,Natural,,,,,25310D3500,HY3010212,,P13576,P13576,$156.67,"Sold Individually",Replacement
274,"2017-12-07 21:52:55","Direct Fit Radiator — P2441 Replacement",,,"Factory Finish",,,,,0K2A615200,KI3010103,,P2441,P2441,$104.15,"Sold Individually",Replacement
275,"2017-12-07 21:52:55","Direct Fit Radiator — P2853 Replacement",,,"Factory Finish",,,,,25769584,GM3010493,,P2853,P2853,$88.39,"Sold Individually",Replacement
276,"2017-12-07 21:52:55","Direct Fit Radiator — P2138 Replacement",,,"Factory Finish",,,,,1R3Z8005CA,FO3010115,,P2138,P2138,$94.73,"Sold Individually",Replacement
277,"2017-12-07 21:52:55","Direct Fit Radiator — P2971 Replacement",,,"Factory Finish",,,,,68003973AB,CH3010342,,P2971,P2971,$80.64,"Sold Individually",Replacement
278,"2017-12-07 21:52:55","Direct Fit Radiator — P2442 Replacement",,,"Factory Finish",,,,,0K52Y15200D,KI3010113,,P2442,P2442,$141.09,"Sold Individually",Replacement
279,"2017-12-07 21:52:55","Direct Fit Radiator — P2854 Replacement",,,"Factory Finish",,,,,25772258,GM3010492,,P2854,P2854,$131.10,"Sold Individually",Replacement
280,"2017-12-07 21:52:55","Direct Fit Radiator — P13245 Replacement",,,,,,,,55111352AA,FI3010100,,P13245,P13245,$54.95,"Sold Individually",Replacement
281,"2017-12-07 21:52:55","Direct Fit Radiator — P2139 Replacement",,,"Factory Finish",,,,,F8ZZ8005AA,FO3010116,,P2139,P2139,$106.53,"Sold Individually",Replacement
282,"2017-12-07 21:52:55","Direct Fit Radiator — P2995 Replacement",,,"Factory Finish",,,,,1K0121251CJ,VW3010150,,P2995,P2995,$78.59,"Sold Individually",Replacement
283,"2017-12-07 21:52:55","Direct Fit Radiator — P2894 Replacement",,,"Factory Finish",,,,,LFB715200A,MA3010215,,P2894,P2894,$52.05,"Sold Individually",Replacement
284,"2017-12-07 21:52:55","Direct Fit Radiator — P2190 Replacement",,,"Factory Finish",,,,,1635000003,MB3010124,,P2190,P2190,$141.89,"Sold Individually",Replacement
285,"2017-12-07 21:52:55","Direct Fit Radiator — P13186 Replacement",,,"Factory Finish",Overstock,,,,AA5Z8005A,FO3010298,,P13186,P13186,$37.74,"Sold Individually",Replacement
286,"2017-12-07 21:52:55","Direct Fit Radiator — P1696 Replacement",,,"Factory Finish",,,,"Please measure your Radiatorsize before ordering.",52469670,GM3010241,,P1696,P1696,$181.95,"Sold Individually",Replacement
287,"2017-12-07 21:52:55","Direct Fit Radiator — P13129 Replacement",,,Natural,,,,,55056858AE,CH3010353,,P13129,P13129,$123.48,"Sold Individually",Replacement
288,"2017-12-07 21:52:55","Direct Fit Radiator — P2443 Replacement",,,"Factory Finish",,,,"Automatic Transmission (willfit Manual Transmission,transmission coolant line doesnot need to be plugged)",19010PPAA51,HO3010180,,P2443,P2443,$51.76,"Sold Individually",Replacement
289,"2017-12-07 21:52:57","Control Arm (Rear, Driver Or Passenger Side, Lower) —REPJ281517 Replacement",,,,,,"Rear, Driver Or PassengerSide, Lower",,52128866AA,,,REPJ281517,REPJ281517,$21.16,"Sold Individually",Replacement
290,"2017-12-07 21:52:57","Control Arm (Front, Driver Side, Lower) — REPI281506Replacement",,,,,,"Front, Driver Side, Lower",,545012J011,,,REPI281506,REPI281506,$42.00,"Sold Individually",Replacement
291,"2017-12-07 21:52:57","Control Arm (Front, Driver And Passenger Side, Upper)— KIT1-071117-73-A Replacement",,,,,,"Front, Driver And PassengerSide, Upper","Includes (2) Front, UpperControl Arms, (2) Front, SwayBar Links","4L3Z3084AB, 6L3Z3084AR,7L1Z3084A, 9L3Z3084A,BL3Z3084A, EL3Z3084A,4L3Z3085AB, 6L3Z3085AL,7L1Z3085A, 9L3Z3085A,BL3Z3085A, EL3Z3085A",,,KIT1-071117-73-A,KIT1-071117-73-A,$108.92,Kit,Replacement
292,"2017-12-07 21:52:57","Control Arm (Front, Passenger Side, Lower) —ARBS281501 Replacement",,,,,,"Front, Passenger Side, Lower",,4543468,,,ARBS281501,ARBS281501,$47.39,"Sold Individually",Replacement
293,"2017-12-07 21:52:57","Control Arm (Front, Passenger Side, Lower) —REPH281557 Replacement",,,,,,"Front, Passenger Side, Lower",,51350SHJA03,,,REPH281557,REPH281557,$102.82,"Sold Individually",Replacement
294,"2017-12-07 21:52:57","Control Arm (Front, Driver Side, Lower) — REPT281530Replacement",,,,,,"Front, Driver Side, Lower",,4806912160,,,REPT281530,REPT281530,$34.60,"Sold Individually",Replacement
295,"2017-12-07 21:52:57","Control Arm (Front, Driver Side, Lower) — ARBS281502Replacement",,,,,,"Front, Driver Side, Lower",,4543450,,,ARBS281502,ARBS281502,$53.94,"Sold Individually",Replacement
296,"2017-12-07 21:52:57","Control Arm (Front, Driver Side, Lower) — REPH281558Replacement",,,,,,"Front, Driver Side, Lower",,51360SHJA03,,,REPH281558,REPH281558,$121.77,"Sold Individually",Replacement
297,"2017-12-07 21:52:57","Control Arm (Rear, Driver And Passenger Side, Upper)— KIT1-062717-62-A Replacement",,,,,,"Rear, Driver And PassengerSide, Upper","Includes (2) Rear UpperControl Arms, (2) Rear LowerControl Arms, (2) Rear SwayBar Links",,,"Non-extended (OE length)",KIT1-062717-62-A,KIT1-062717-62-A,$100.40,Kit,Replacement
298,"2017-12-07 21:52:57","Control Arm (Front, Driver And Passenger Side) —KIT1-051414-18-D Replacement",,,,,,"Front, Driver And PassengerSide","(2) Front Upper Control Arms,(2) Front Inner Tie Rod Ends,(2) Front Outer Tie Rod Ends,(2) Front Lower Ball Joints,(1) Front Pitman Arm","5L3Z-3084-B, 5L3Z-3085-B",,,KIT1-051414-18-D,KIT1-051414-18-D,$236.43,Kit,Replacement
299,"2017-12-07 21:52:57","Control Arm (Front, Driver And Passenger Side, Lower)— KIT1-071117-74-A Replacement",,,,,,"Front, Driver And PassengerSide, Lower",,,,,KIT1-071117-74-A,KIT1-071117-74-A,$99.26,Kit,Replacement
300,"2017-12-07 21:52:57","Control Arm (Front, Driver And Passenger Side) —KIT1-101414-01-D Replacement",,,,,,"Front, Driver And PassengerSide","(2) Front Lower Control Arms,(2) Front Lower Control ArmBushings, (2) Front Outer TieRod Ends, (2) Front Sway BarLinks","31126752717, 31121127726",,,KIT1-101414-01-D,KIT1-101414-01-D,$185.64,Kit,Replacement
