truck_part.id,truck_part.ts,truck_part.title,truck_part.assembly,truck_part.certification,truck_part.color_finish,truck_part.deals,truck_part.light_source,truck_part.location,truck_part.notes,truck_part.replaces_o_e_number,truck_part.replaces_partslink_number,truck_part.type,truck_part.manufacturer,truck_part.item,truck_part.price,truck_part.quantity_sold,truck_part.by
1,"2017-08-03 04:03:25","Headlight (Driver Side) &mdash; REPF100144 Replacement",,"DOT/SAE Compliant","Clear Lens",Overstock,Halogen,"Driver Side",,AG1Z13008D,FO2502283,Composite,REPF100144,REPF100144,$425.41,"Sold Individually",Replacement
2,"2017-08-03 04:03:25","Headlight (Driver And Passenger Side) &mdash;KIT1-053100-7-A Replacement",,"DOT/SAE Compliant","Clear Lens",,Halogen,"Driver And Passenger Side","Kit Includes 2 Headlights, 2Parking Lights and 2 HeadlightHousings","16526134, 16526133, 15199558,15199559, 15798920, 15798919","GM2503187, GM2502187,GM2520173, GM2521173,GM1221122, GM1221121",Composite,KIT1-053100-7-A,KIT1-053100-7-A,$168.96,Kit,Replacement
3,"2017-08-03 04:03:25","Headlight (Driver And Passenger Side) &mdash;SET-REPK100133Q Replacement",,"CAPA Certified, DOT/SAECompliant","Clear Lens",Overstock,Halogen,"Driver And Passenger Side",,"921012T121, 921022T121","KI2502155C, KI2503155C",Composite,SET-REPK100133Q,SET-REPK100133Q,$396.82,"Set Of 2",Replacement
4,"2017-08-03 04:03:25","Headlight (Driver And Passenger Side) &mdash;SET-REPN100149 Replacement",,"DOT/SAE Compliant","Clear Lens",,Halogen,"Driver And Passenger Side",,"260601KM0A, 260101KM0A","NI2503201, NI2502201",Composite,SET-REPN100149,SET-REPN100149,$232.52,"Set Of 2",Replacement
5,"2017-08-03 04:03:25","Headlight (Passenger Side) &mdash; D100127 Replacement",,"DOT/SAE Compliant","Clear Lens; Chrome Interior",,Halogen,"Passenger Side","With corner light bulb shield",55077606AB,CH2503159,Composite,D100127,D100127,$65.73,"Sold Individually",Replacement
6,"2017-08-03 04:03:25","Headlight (Driver Side) &mdash; 20-1571-00 Replacement",,"DOT/SAE Compliant","Clear Lens",,Halogen,"Driver Side","With side marker; Without trim",E9TZ13008D,FO2502104,Composite,20-1571-00,20-1571-00,$104.57,"Sold Individually",Replacement
7,"2017-08-03 04:03:25","Headlight (Passenger Side) &mdash; T100137 Replacement",,"DOT/SAE Compliant","Clear Lens",,Halogen,"Passenger Side",,81110AE010,TO2503150,Composite,T100137,T100137,$112.07,"Sold Individually",Replacement
8,"2017-08-03 04:03:25","Headlight (Driver And Passenger Side) &mdash;SET-REPK100163Q Replacement",,"CAPA Certified, DOT/SAECompliant","Clear Lens",,Halogen,"Driver And Passenger Side","With LED accent light","921011U600, 921021U600","KI2502165C, KI2503165C",,SET-REPK100163Q,SET-REPK100163Q,$787.80,"Set Of 2",Replacement
9,"2017-08-03 04:03:25","Headlight (Driver Side) &mdash; REPG100120 Replacement",,"DOT/SAE Compliant","Clear Lens",,LED,"Driver Side",,23130715,GM2502390,Composite,REPG100120,REPG100120,$529.29,"Sold Individually",Replacement
10,"2017-12-07 21:51:44","Headlight (Driver And Passenger Side) &mdash;SET-20-3519-80 Replacement","With Bulb(s)","DOT/SAE Compliant","Clear Lens",,Halogen,"Driver And Passenger Side","Does not include bracket(s)","3L3Z13008DA, 3L3Z13008CA","FO2503139, FO2502139",Composite,SET-20-3519-80,SET-20-3519-80,$55.58,"Set Of 2",Replacement
11,"2017-08-03 04:03:25","Headlight (Driver Side) &mdash; D100128 Replacement",,"DOT/SAE Compliant","Clear Lens; Chrome Interior",,Halogen,"Driver Side","With corner light bulb shield",55077607AB,CH2502159,Composite,D100128,D100128,$129.25,"Sold Individually",Replacement
12,"2017-08-03 04:03:25","Headlight (Driver And Passenger Side) &mdash;KIT1-51415-37-B Replacement",,"DOT/SAE Compliant","Clear Lens",,Halogen,"Driver And Passenger Side","Kit Includes 2 Headlights and2 Fog Lights","2W4Z13008BA, 2W4Z13008CA,XW4Z15200CA, XW4Z15200DA","FO2503174, FO2502174,FO2593175, FO2592175",Composite,KIT1-51415-37-B,KIT1-51415-37-B,$349.05,Kit,Replacement
13,"2017-08-03 04:03:25","Headlight (Passenger Side) &mdash; 20-1578-00 Replacement",,"DOT/SAE Compliant","Clear Lens",,Halogen,"Passenger Side",,33100SH3A05,HO2503102,Composite,20-1578-00,20-1578-00,$121.70,"Sold Individually",Replacement
14,"2017-08-03 04:03:25","Headlight (Driver And Passenger Side) &mdash;SET-REPH100339Q Replacement",,"DOT/SAE Compliant","Clear Lens",,Halogen,"Driver And Passenger Side",,"92101A5050, 92102A5050","HY2502173C, HY2503173C",,SET-REPH100339Q,SET-REPH100339Q,$477.96,"Set Of 2",Replacement
15,"2017-08-03 04:03:25","Headlight (Driver And Passenger Side) &mdash;SET-REPH100333Q Replacement",,"CAPA Certified, DOT/SAECompliant","Clear Lens",,Halogen,"Driver And Passenger Side",,"33100SZAA01, 33150SZAA01","HO2519125C, HO2518125C",,SET-REPH100333Q,SET-REPH100333Q,$381.26,"Set Of 2",Replacement
16,"2017-08-03 04:03:25","Headlight (Driver Side) &mdash; T100138 Replacement",,"DOT/SAE Compliant","Clear Lens",,Halogen,"Driver Side",,81150AE010,TO2502150,Composite,T100138,T100138,$107.61,"Sold Individually",Replacement
17,"2017-08-03 04:03:25","Headlight (Passenger Side) &mdash; KIT1-082913-01-BReplacement",,"DOT/SAE Compliant","Clear Lens",,Halogen,"Passenger Side","Kit Includes 1 Headlight and 1Corner Light","8111002110, 8151002070","TO2503133, TO2531137",Composite,KIT1-082913-01-B,KIT1-082913-01-B,$54.56,Kit,Replacement
18,"2017-08-03 04:03:25","Headlight (Driver And Passenger Side) &mdash;SET-REPF100117Q Replacement",,"CAPA Certified, DOT/SAECompliant","Clear Lens",,Halogen,"Driver And Passenger Side",,"BG1Z13008B, BG1Z13008A","FO2502280C, FO2503280C",Composite,SET-REPF100117Q,SET-REPF100117Q,$763.33,"Set Of 2",Replacement
19,"2017-08-03 04:03:25","Headlight (Driver Side) &mdash; REPJ100152Q Replacement",,"CAPA Certified, DOT/SAECompliant","Clear Lens; Black Interior",,Halogen,"Driver Side",,68171215AB,CH2502246C,,REPJ100152Q,REPJ100152Q,$147.66,"Sold Individually",Replacement
20,"2017-08-03 04:03:25","Headlight (Passenger Side) &mdash; REPD100115 Replacement",,"DOT/SAE Compliant","Clear Lens",,Halogen,"Passenger Side",,5303744AD-PFM,CH2503194,Composite,REPD100115,REPD100115,$108.01,"Sold Individually",Replacement
21,"2017-08-03 04:03:25","Headlight (Passenger Side) &mdash; RC10010003 Replacement",,"DOT/SAE Compliant","Clear Lens; Chrome Interior",,Halogen,"Passenger Side",,68284785AA,CH2503260,Composite,RC10010003,RC10010003,$239.29,"Sold Individually",Replacement
22,"2017-08-03 04:03:25","Headlight (Passenger Side) &mdash; G100101 Replacement",,"DOT/SAE Compliant","Clear Lens",,Halogen,"Passenger Side",,15218078,GM2503214,Composite,G100101,G100101,$131.93,"Sold Individually",Replacement
23,"2017-08-03 04:03:25","Headlight (Driver Side) &mdash; REPF100112 Replacement",,"DOT/SAE Compliant","Clear Lens; Black Interior",,Halogen,"Driver Side","With black trim",AR3Z13008D,FO2502276,Composite,REPF100112,REPF100112,$158.26,"Sold Individually",Replacement
24,"2017-08-03 04:03:25","Headlight (Passenger Side) &mdash; REPH100353 Replacement",,"DOT/SAE Compliant","Clear Lens",,Halogen,"Passenger Side",,33100TS8A51,HO2503163,,REPH100353,REPH100353,$158.91,"Sold Individually",Replacement
25,"2017-12-07 21:51:55","OE Fender (Front, Passenger Side) — REPD220137Replacement",,,Primed,,,"Front, Passenger Side",,55369734AB,CH1241273,,REPD220137,REPD220137,$134.69,"Sold Individually",Replacement
26,"2017-12-07 21:51:55","OE Fender (Front, Driver Side) — REPD220138Replacement",,,Primed,,,"Front, Driver Side",,55369735AB,CH1240273,,REPD220138,REPD220138,$134.23,"Sold Individually",Replacement
27,"2017-12-07 21:51:55","OE Fender (Front, Driver And Passenger Side) —KIT1-012717-06-B Replacement",,,Primed,,,"Front, Driver And PassengerSide","Includes 2 Fenders, BumperCover, 2 Grille Assemblies,Grille Trim, 2 Fog LightCovers, and Hood","60210TZ5A90ZZ, 60260TZ5A90ZZ,04711TZ5A80ZZ, 71103TZ5A00,75101TZ5A01, 75105TZ5A01,71102TZ5A00, 71107TZ5A00,60100TZ5A90ZZ-PFM","AC1241124, AC1240124,AC1000184, AC1036100,AC1200121, AC1202103,AC1039105, AC1038105,AC1230127",,KIT1-012717-06-B,KIT1-012717-06-B,"$1,385.11",Kit,Replacement
28,"2017-12-07 21:51:55","OE Fender (Front, Driver Side) — REPH220110Replacement",,,"Textured Dark Gray",,,"Front, Driver Side","With mudguard provision andturn signal light hole",74165SCVA10ZA,HO1240178,,REPH220110,REPH220110,$49.68,"Sold Individually",Replacement
29,"2017-12-07 21:51:55","OE Fender (Front, Driver Side) — 9752 Replacement",,,Primed,,,"Front, Driver Side","Without fender flare holes",F31010W030,NI1240161,,9752,9752,$151.96,"Sold Individually",Replacement
30,"2017-12-07 21:51:55","OE Fender (Front, Driver Side) — C220144 Replacement",,,Primed,,,"Front, Driver Side","Without antenna hole",25849189,GM1240319,,C220144,C220144,$43.71,"Sold Individually",Replacement
31,"2017-12-07 21:51:55","OE Fender (Front, Passenger Side) — REPV220105Replacement",,,Primed,,,"Front, Passenger Side","With turn signal light hole",308023076,VO1241119,,REPV220105,REPV220105,$42.51,"Sold Individually",Replacement
32,"2017-12-07 21:51:55","OE Fender (Front, Driver Side) — REPC220170Replacement",,,Primed,,,"Front, Driver Side",,68079073AB,CH1240274,,REPC220170,REPC220170,$71.96,"Sold Individually",Replacement
33,"2017-12-07 21:51:55","OE Fender (Front, Passenger Side) — REPM220141Replacement",,,Primed,Overstock,,"Front, Passenger Side","Without provisions formudguard and stone guard; Withturn signal light hole",BBY85211Y,MA1241164,,REPM220141,REPM220141,$127.87,"Sold Individually",Replacement
34,"2017-12-07 21:51:55","OE Fender (Front, Driver And Passenger Side) —KIT1-81915-39-A Replacement",,,Primed,,,"Front, Driver And PassengerSide","Kit Includes 2 Fenders and 2Fender Liners","12455104, 12455103, 10430448,10430449","GM1241259, GM1240259,GM1249109, GM1248109",,KIT1-81915-39-A,KIT1-81915-39-A,$148.75,Kit,Replacement
35,"2017-12-07 21:51:55","OE Fender (Front, Passenger Side) — KIT1-111416-21-AReplacement",,,Primed,,,"Front, Passenger Side","Kit Includes 1 Fender, 1 TurnSignal Light and 1 Headlight","60211SV4508ZZ, 33302SV4A02,33100SV4A02","HO1241122, HO2531116,HO2503106",,KIT1-111416-21-A,KIT1-111416-21-A,$123.44,Kit,Replacement
36,"2017-12-07 21:51:55","OE Fender (Front, Driver Side) — 9752-2 Replacement",,,Primed,,,"Front, Driver Side","With fender flare holes",F31010W035,NI1240160,,9752-2,9752-2,$124.31,"Sold Individually",Replacement
37,"2017-12-07 21:51:55","OE Fender (Front, Driver Side) — C220144QReplacement",,"CAPA Certified",Primed,,,"Front, Driver Side","Without antenna hole",25849189,GM1240319C,,C220144Q,C220144Q,$52.15,"Sold Individually",Replacement
38,"2017-12-07 21:51:55","OE Fender (Front, Driver Side) — KIT1-111216-60-AReplacement",,,Primed,,,"Front, Driver Side","Kit Includes 1 Fender and 1Hood","631014Y935, F51005Y7CM","NI1240166, NI1230152",,KIT1-111216-60-A,KIT1-111216-60-A,$304.86,Kit,Replacement
39,"2017-12-07 21:51:55","OE Fender (Front, Passenger Side) — REPN220117QReplacement",,"CAPA Certified",Primed,Overstock,,"Front, Passenger Side","With holes for fender flareand turn signal light",FCA001KAMA,NI1241200C,,REPN220117Q,REPN220117Q,$91.53,"Sold Individually",Replacement
40,"2017-12-07 21:51:55","OE Fender (Front, Passenger Side) — KIT1-60615-137-CReplacement",,,Primed,,,"Front, Passenger Side","Kit Includes 1 Fender, 1Corner Light, 1 Hood, 1 BumperCover and 1 Headlight","BJ0J52111A, BJ0E51060BP1,B25D52310H, BJ0J50031ABB,BJ0E51030A","MA1241136, MA2521113,MA1230146, MA1000161,MA2503114",,KIT1-60615-137-C,KIT1-60615-137-C,$524.08,Kit,Replacement
41,"2017-12-07 21:51:55","OE Fender (Front, Driver Side) — REPV220106Replacement",,,Primed,,,"Front, Driver Side","With turn signal light hole",308023078,,,REPV220106,REPV220106,$42.51,"Sold Individually",Replacement
42,"2017-12-07 21:51:55","OE Fender (Front, Driver Side) — B312 Replacement",,,Primed,,,"Front, Driver Side",,41358157625,BM1240123,,B312,B312,$198.64,"Sold Individually",Replacement
43,"2017-12-07 21:51:55","OE Fender (Front, Driver And Passenger Side) —KIT1-72115-43-A Replacement",,,Primed,,,"Front, Driver And PassengerSide","Kit Includes 2 Fenders and 2Fender Liners","538013F380, 538023F200,5387530150, 5387630110","LX1241104, LX1240104,LX1251103, LX1250103",,KIT1-72115-43-A,KIT1-72115-43-A,$397.06,Kit,Replacement
44,"2017-12-07 21:51:55","OE Fender (Front, Passenger Side) — REPV220117Replacement",,,Primed,,,"Front, Passenger Side",,5N0821106A,VW1241141,,REPV220117,REPV220117,$54.84,"Sold Individually",Replacement
45,"2017-12-07 21:51:55","OE Fender (Front, Driver Side) — KIT1-111416-30-AReplacement",,,Primed,,,"Front, Driver Side","Kit Includes 1 Fender, 1Fender Liner and 1 Headlight","60261SV4508ZZ, 74151SV4010,33150SV4A02","HO1240122, HO1248107,HO2502106",,KIT1-111416-30-A,KIT1-111416-30-A,$113.89,Kit,Replacement
46,"2017-12-07 21:51:55","OE Fender (Front, Passenger Side) — KIT1-111316-96-AReplacement",,,Primed,,,"Front, Passenger Side","Kit Includes 1 Fender and 1Headlight","60211S04A00ZZ, 33101S01305","HO1241143, HO2519101",,KIT1-111316-96-A,KIT1-111316-96-A,$100.41,Kit,Replacement
47,"2017-12-07 21:51:55","OE Fender (Front, Passenger Side) — REPH220307Replacement",,,Primed,,,"Front, Passenger Side",,66321D3000,HY1241165,,REPH220307,REPH220307,$143.82,"Sold Individually",Replacement
48,"2017-12-07 21:51:55","OE Fender (Front, Passenger Side) — T220151Replacement",,,Primed,,,"Front, Passenger Side","With mudguard provision; Withholes for antenna and fenderflare",538010C080,TO1241201,,T220151,T220151,$125.63,"Sold Individually",Replacement
49,"2017-12-07 21:52:03","OE Replacement Power Mirror (Driver And Passenger Side)— SET-LN20ER Kool Vue",,,Chrome,,,"Driver And Passenger Side","Standard type","6L3Z17683EA, 6L3Z17682HA","FO1320332, FO1321332",,SET-LN20ER,SET-LN20ER,$254.40,"Set Of 2","Kool Vue"
50,"2017-12-07 21:52:03","OE Replacement Power Mirror (Driver Side) — KA30EL-SKool Vue",,,"Paint to Match",Overstock,,"Driver Side",,876101G103,KI1320170,,KA30EL-S,KA30EL-S,$89.68,"Sold Individually","Kool Vue"
51,"2017-12-07 21:52:03","OE Replacement Power Mirror (Driver And Passenger Side)— SET-FD69ER Kool Vue",,,"4 Caps - Paint to Match &Textured Black",,,"Driver And Passenger Side",,"6F1Z17682C, 6F1Z17683C","FO1321194, FO1320194",,SET-FD69ER,SET-FD69ER,$103.61,"Set Of 2","Kool Vue"
52,"2017-12-07 21:52:03","OE Replacement Power Mirror (Passenger Side) —MA17ER-S Kool Vue",,,"Paint to Match",,,"Passenger Side",,KD3569121H-PFM,MA1321175,,MA17ER-S,MA17ER-S,$99.24,"Sold Individually","Kool Vue"
53,"2017-12-07 21:52:03","OE Replacement Power Mirror (Passenger Side) —HY59ER-S Kool Vue",,,"Paint to Match",,,"Passenger Side",,"876203M520, 876203M500",HY1321198,,HY59ER-S,HY59ER-S,$110.55,"Sold Individually","Kool Vue"
54,"2017-12-07 21:52:03","OE Replacement Power Mirror (Driver And Passenger Side)— SET-CV35ER Kool Vue",,,"Textured Black",,,"Driver And Passenger Side",,"15789783, 15789782","GM1321322, GM1320322",,SET-CV35ER,SET-CV35ER,$123.03,"Set Of 2","Kool Vue"
55,"2017-12-07 21:52:03","OE Replacement Power Mirror (Driver Side) — MA17EL-SKool Vue",,,"Paint to Match",,,"Driver Side",,KD3569181G-PFM,MA1320175,,MA17EL-S,MA17EL-S,$101.96,"Sold Individually","Kool Vue"
56,"2017-12-07 21:52:03","OE Replacement Power Mirror (Driver Side) — FD214ELKool Vue",,,"Paint to Match",Overstock,,"Driver Side",,8G1Z17683J,FO1320313,,FD214EL,FD214EL,$53.29,"Sold Individually","Kool Vue"
57,"2017-12-07 21:52:03","OE Replacement Power Mirror (Driver Side) — HY59EL-SKool Vue",,,"Paint to Match",Overstock,,"Driver Side",,"876103M520, 876103M500",HY1320198,,HY59EL-S,HY59EL-S,$137.04,"Sold Individually","Kool Vue"
58,"2017-12-07 21:52:03","OE Replacement Power Mirror (Driver Side) — GM91ELKool Vue",,,"Paint to Match",,,"Driver Side",,22817090-PFM,GM1320434,,GM91EL,GM91EL,$58.67,"Sold Individually","Kool Vue"
59,"2017-12-07 21:52:03","OE Replacement Power Mirror (Driver And Passenger Side)— SET-PT14ER Kool Vue",,,"Paint to Match",,,"Driver And Passenger Side",,"22724871, 22724872","GM1321257, GM1320257",,SET-PT14ER,SET-PT14ER,$88.62,"Set Of 2","Kool Vue"
60,"2017-12-07 21:52:03","OE Replacement Power Mirror (Passenger Side) —MA19ER-S Kool Vue",,,"Paint to Match",,,"Passenger Side",,KD4569121G-PFM,MA1321176,,MA19ER-S,MA19ER-S,$124.69,"Sold Individually","Kool Vue"
61,"2017-12-07 21:52:03","OE Replacement Power Mirror (Passenger Side) —NS139ER Kool Vue",,,"Paint to Match",Overstock,,"Passenger Side",,963013WC0A,,,NS139ER,NS139ER,$91.43,"Sold Individually","Kool Vue"
62,"2017-12-07 21:52:03","OE Replacement Power Mirror (Driver Side) — CV111ELKool Vue",,,"Paint to Match",,,"Driver Side","Without blind spot glass","20858744, 22818288, 23467296","GM1320387, GM1320453",,CV111EL,CV111EL,$53.11,"Sold Individually","Kool Vue"
63,"2017-12-07 21:52:03","OE Replacement Power Mirror (Driver Side) — HO52ELKool Vue",,,"Paint to Match",,,"Driver Side",,76250SNEA22ZK,HO1320260,,HO52EL,HO52EL,$33.46,"Sold Individually","Kool Vue"
64,"2017-12-07 21:52:03","OE Replacement Power Mirror (Passenger Side) —FD240ER Kool Vue",,,"Textured Black",,,"Passenger Side",,CJ5Z17682BA-PFM,FO1321434,,FD240ER,FD240ER,$125.33,"Sold Individually","Kool Vue"
65,"2017-12-07 21:52:03","OE Replacement Power Mirror (Passenger Side) —SC15ER-S Kool Vue",,,"Paint to Match",,,"Passenger Side",,8791074080-PFM,SC1321107,,SC15ER-S,SC15ER-S,$111.90,"Sold Individually","Kool Vue"
66,"2017-12-07 21:52:03","OE Replacement Power Mirror (Driver And Passenger Side)— SET-GM73ER Kool Vue",,,"Textured Black",,,"Driver And Passenger Side","Telescopic type; Dual glass","15904035-PFM, 15904034-PFM","GM1321410, GM1320410",,SET-GM73ER,SET-GM73ER,$94.46,"Set Of 2","Kool Vue"
67,"2017-12-07 21:52:03","OE Replacement Power Mirror (Driver Side) — PT11ELKool Vue",,,"Paint to Match",,,"Driver Side",,25615195,GM1320217,,PT11EL,PT11EL,$26.84,"Sold Individually","Kool Vue"
68,"2017-12-07 21:52:03","OE Replacement Power Mirror (Driver And Passenger Side)— SET-FD259ER-S Kool Vue",,,"Paint to Match",,,"Driver And Passenger Side",,"CP9Z17682DA-PFM,CP9Z17683DA-PFM","FO1321462, FO1320462",,SET-FD259ER-S,SET-FD259ER-S,$229.76,"Set Of 2","Kool Vue"
69,"2017-12-07 21:52:03","OE Replacement Power Mirror (Driver Side) — CH46ELKool Vue",,,"Textured Black",Clearance,,"Driver Side",,5054369AA,CH1320299,,CH46EL,CH46EL,$37.39,"Sold Individually","Kool Vue"
70,"2017-12-07 21:52:03","OE Replacement Power Mirror (Driver And Passenger Side)— SET-TY78ER Kool Vue",,,"Paint to Match",,,"Driver And Passenger Side",,"8791047101, 8794047101","TO1321229, TO1320229",,SET-TY78ER,SET-TY78ER,$141.22,"Set Of 2","Kool Vue"
71,"2017-12-07 21:52:03","OE Replacement Power Mirror (Passenger Side) — GM91ERKool Vue",,,"Paint to Match",,,"Passenger Side",,22817091-PFM,GM1321434,,GM91ER,GM91ER,$58.67,"Sold Individually","Kool Vue"
72,"2017-12-07 21:52:03","OE Replacement Power Mirror (Passenger Side) —FD114ER Kool Vue",,,"Paint to Match",,,"Passenger Side","Without spot mirror","9L8Z17682BA, AL8Z17682AA","FO1321292, FO1321351",,FD114ER,FD114ER,$72.73,"Sold Individually","Kool Vue"
73,"2017-12-07 21:52:14","Tail Light (Passenger Side) — REPF730103Q Replacement","Without Bulb(s)","CAPA Certified, DOT/SAECompliant","Clear & Red Lens",,,"Passenger Side",,6L2Z13404CA,FO2819140C,,REPF730103Q,REPF730103Q,$89.35,"Sold Individually",Replacement
74,"2017-12-07 21:52:14","Tail Light (Driver Side) — REPF730104Q Replacement","Without Bulb(s)","CAPA Certified, DOT/SAECompliant","Clear & Red Lens",,,"Driver Side",,6L2Z13405CA,FO2818140C,,REPF730104Q,REPF730104Q,$89.35,"Sold Individually",Replacement
75,"2017-12-07 21:52:14","Tail Light (Driver Side, Outer) — REPL730312Replacement","With Bulb(s)","DOT/SAE Compliant","Red Lens",,,"Driver Side, Outer",,815600E090,LX2804112,,REPL730312,REPL730312,$172.31,"Sold Individually",Replacement
76,"2017-12-07 21:52:14","Tail Light (Passenger Side) — REPF730107Q Replacement","Without Bulb(s)","CAPA Certified, DOT/SAECompliant","Red Lens",,,"Passenger Side",,BL3Z13404B,FO2819143C,,REPF730107Q,REPF730107Q,$102.83,"Sold Individually",Replacement
77,"2017-12-07 21:52:14","Tail Light (Driver Side) — REPF730108Q Replacement","Without Bulb(s)","CAPA Certified, DOT/SAECompliant","Red Lens",,,"Driver Side",,BL3Z13405B,FO2818143C,,REPF730108Q,REPF730108Q,$76.90,"Sold Individually",Replacement
78,"2017-12-07 21:52:14","Tail Light (Passenger Side) — REPF730117 Replacement","With Bulb(s)","DOT/SAE Compliant","Clear & Red Lens",,,"Passenger Side","With painted insert",9S4Z13404C,FO2801218,,REPF730117,REPF730117,$105.29,"Sold Individually",Replacement
79,"2017-12-07 21:52:14","Tail Light (Driver And Passenger Side, Outer) —SET-REPH730323 Replacement","Without Bulb(s)","DOT/SAE Compliant","Red Lens",,,"Driver And Passenger Side,Outer",,"33501S5BA01, 33551S5BA01","HO2801153, HO2800153",,SET-REPH730323,SET-REPH730323,$102.87,"Set Of 2",Replacement
80,"2017-12-07 21:52:14","Tail Light (Driver Side) — REPF730118 Replacement","With Bulb(s)","DOT/SAE Compliant","Clear & Red Lens",,,"Driver Side","With painted insert",9S4Z13405C,FO2800218,,REPF730118,REPF730118,$119.63,"Sold Individually",Replacement
81,"2017-12-07 21:52:14","Tail Light (Driver And Passenger Side) —SET-REPH730325 Replacement","Without Bulb(s)","DOT/SAE Compliant","Clear & Red Lens",,,"Driver And Passenger Side",,"33501SVAA02-PFM,33551SVAA02-PFM","HO2801164, HO2800165",,SET-REPH730325,SET-REPH730325,$87.80,"Set Of 2",Replacement
82,"2017-12-07 21:52:14","Tail Light (Passenger Side) — REPF730119 Replacement","Without Bulb(s)","DOT/SAE Compliant","Clear & Red Lens",,,"Passenger Side",,9E5Z13404A,FO2819147,,REPF730119,REPF730119,$124.90,"Sold Individually",Replacement
83,"2017-12-07 21:52:14","Tail Light (Passenger Side, Outer) — 3151917RASReplacement","With Bulb(s)","DOT/SAE Compliant","Amber, Clear & Red Lens",,,"Passenger Side, Outer",,B655065Y71,NI2801132,,3151917RAS,3151917RAS,$54.17,"Sold Individually",Replacement
84,"2017-12-07 21:52:14","Tail Light (Driver And Passenger Side, Outer) —SET-REPH730337 Replacement","With Bulb(s)","DOT/SAE Compliant","Clear & Red Lens",,,"Driver And Passenger Side,Outer",,"33501SNAA02, 33551SNAA02","HO2801165, HO2800166",,SET-REPH730337,SET-REPH730337,$142.92,"Set Of 2",Replacement
85,"2017-12-07 21:52:14","Tail Light (Driver Side) — REPF730120 Replacement","Without Bulb(s)","DOT/SAE Compliant","Clear & Red Lens",,,"Driver Side",,9E5Z13405A,FO2818147,,REPF730120,REPF730120,$124.90,"Sold Individually",Replacement
86,"2017-12-07 21:52:14","Tail Light (Passenger Side) — 65245 Replacement","Without Bulb(s)","DOT/SAE Compliant","Amber, Clear & Red Lens",,,"Passenger Side","Without black-out",1EM945112,VW2801108,,65245,65245,$84.42,"Sold Individually",Replacement
87,"2017-12-07 21:52:14","Tail Light (Driver Side) — 3151938LAS Replacement","With Bulb(s)","DOT/SAE Compliant","Clear Lens",,,"Driver Side",,265558J025,NI2800154,,3151938LAS,3151938LAS,$55.93,"Sold Individually",Replacement
88,"2017-12-07 21:52:14","Tail Light (Driver And Passenger Side) — SET-T730169Replacement","Without Bulb(s)","DOT/SAE Compliant","Clear, Red & Smoked Lens",,,"Driver And Passenger Side",,"8156135280, 8155135320","TO2800172, TO2801172",,SET-T730169,SET-T730169,$243.97,"Set Of 2",Replacement
89,"2017-12-07 21:52:14","Tail Light (Driver And Passenger Side) —SET-REPH730341 Replacement","Without Bulb(s)","DOT/SAE Compliant","Clear & Red Lens",,,"Driver And Passenger Side",,"33501SCVA31, 33551SCVA31","HO2819145, HO2818145",,SET-REPH730341,SET-REPH730341,$209.17,"Set Of 2",Replacement
90,"2017-12-07 21:52:14","Tail Light (Driver And Passenger Side, Outer) —SET-REPT730357 Replacement","With Bulb(s)","DOT/SAE Compliant","Clear & Red Lens",,,"Driver And Passenger Side,Outer",,"8.155E+105, 8.156E+105","TO2805120, TO2804120",,SET-REPT730357,SET-REPT730357,$181.77,"Set Of 2",Replacement
91,"2017-12-07 21:52:14","Tail Light (Passenger Side, Outer) — REPL730329QReplacement","Without Bulb(s)","CAPA Certified, DOT/SAECompliant","Clear & Red Lens",,,"Passenger Side, Outer",,8155133560,LX2805113C,,REPL730329Q,REPL730329Q,$278.46,"Sold Individually",Replacement