business_x_category.id,business.id,business.ts,business.business_name,business.home_page,business.email_address,business.phone,business.street,business.city,business.state,business.zip_code,business.full_address,business.category,business.rating,business.number_of_reviews,business.bbb_rating_or_license,business.latitude,business.longitude,business.cover_image,business.slogan,business.general_info,business.regular_hours,business.extra_phones,business.services_products,business.payment,business.price_range,business.aka,business.other_links,business.other_information,business.review_1_name,business.review_1_date,business.review_1_rating,business.review_1_text,business.review_2_name,business.review_2_date,business.review_2_rating,business.review_2_text
1323236,421831,"2020-09-27 03:11:16","Johnson Sheet Metal Inc",http://www.lennox.com,brad@jsm.kscoxmail.com,"(844) 453-9273","512 S Main St",Hutchinson,KS,67501,"512 S Main St,Hutchinson,KS 67501","Heating Contractors & Specialties, Air Conditioning Contractors & Systems, Air Conditioning Equipment & Systems, Air Conditioning Service & Repair, Furnaces Parts & Supplies, Furnaces-Heating, Heating Equipment & Systems, Major Appliances, Metal Specialties, Sheet Metal Fabricators, Sheet Metal Work, Sheet Metal Work-Manufacturers, Steel Fabricators, Steel Processing",,,A+,38.04513,-97.93172,,"""Serving Reno Co. Since 1921""","Specializing In Sales & Service Of Lennox Products Since 1921","Mon - Fri: 8:00 am - 12:00 pm1:00 pm - 5:00 pm Sat - Sun Closed",,,,,,http://www.lennox.com,"Services: Sheet Metal Work",,,,,,,,
1326006,422582,"2020-09-27 03:11:18",Tmsi,http://www.tmsioftexarkana.com,jkelleytmsi@aol.com,"(870) 216-1100","4810 Boyd Rd",Texarkana,AR,71854,"4810 Boyd Rd,Texarkana,AR 71854","Steel Fabricators, Air Conditioning Contractors & Systems, Air Conditioning Service & Repair, Heating Contractors & Specialties, Mechanical Contractors, Metal-Wholesale & Manufacturers, Steel Processing, Welders",,,,33.38421,-93.9906,https://i3.ypcdn.com/blob/f05a46389046c4dbc54316f2f126f32734f04bd3_100x100_crop.jpg?63f80dd,,,"Mon - Fri: 7:00 am - 5:00 pm",,,"discover, visa",,,http://www.tmsioftexarkana.com,,,,,,,,,
1326993,422861,"2020-09-27 03:11:18","Tack & Warren Services",http://www.tackandwarren.com,,"(727) 316-8255","806 Pierce St",Clearwater,FL,33756,"806 Pierce St,Clearwater,FL 33756","Heating Contractors & Specialties, Air Conditioning Contractors & Systems, Air Conditioning Equipment & Systems, Air Conditioning Service & Repair, Building Contractors, Fireplace Equipment, Fireplaces, Heating Equipment & Systems, Metal Specialties, Metal Tanks, Metal Tubing, Sheet Metal Work, Steel Erectors, Steel Processing",5,"1 Review",A+,27.96416,-82.79527,https://i3.ypcdn.com/blob/71a9f11e52d19aa5d30ef65acca3e47ab3197b25_100x100_crop.jpg?63f80dd,"Call us today to schedule an appointment.","Welcome to Tack and Warren A/C Services Inc. Serving all of Pinellas County. We can service all your heating and air conditioning needs: Maintenance, Installs, Repair & Service. We also have a metal fabrication shop for all of your metal needs. We offer welding services as well. We are a licensed A/C contractor license number CMC008091. Call us today we are ready to help you with any heating and air conditioning problems you are having.","Mon - Sun: 8:00 am - 5:00 pm","Fax: (727) 461-6967",,"debit, discover, visa, mastercard, all major credit cards",,,http://www.tackandwarren.com,"Wheelchair Accessible: Yes Parking: Lot, Free","Y N.",01/19/2016,five,"Had a stainless repair done here yesterday. The guys did a great job with a TIG welder. High quality work and very nice folks with John as foreman it seems. Highly recommend.",,,,
1327040,422873,"2020-09-27 03:11:18","Hart Heating & Cooling",http://hartheatingandcooling.com,tomhart99@gmail.com,"(928) 239-9344","2160 Shelby Dr Ste 206",Sedona,AZ,86336,"2160 Shelby Dr Ste 206,Sedona,AZ 86336","Heating, Ventilating & Air Conditioning Engineers, Air Cleaning & Purifying Equipment, Air Conditioning Contractors & Systems, Air Conditioning Equipment & Systems, Air Conditioning Service & Repair, Building Contractors, Construction Engineers, Fireplace Equipment, Fireplaces, Heating Contractors & Specialties, Heating Equipment & Systems, Heating Equipment & Systems-Repairing, Metal Tanks, Metal Tubing, Professional Engineers, Steel Erectors, Steel Processing",,,,34.8542,-111.7979,,"Your Air Conditioning & Heating Specialists.","Hart Heating & Cooling of Sedona, AZ, has been your reliable heating and air conditioning company for over 36 years. Our expert technicians serve the Sedona, Cottonwood and Verde Valley, AZ area. We only use the best HVAC products when we replace your existing appliances. As a courtesy to our customers, we provide a warranty and guarantees on all of our products. Our residential or commercial HVAC services include: В• Furnace and boiler repair В• Installation and remodeling В• Heaters and air conditioning В• Pumps, motors and controls В• Repair and service on all brands В• Maintenance We are also NATE, EPA certified and an APS qualified contractor. If you are having any issues with your heating or air conditioning system, we are here to help you. Don't wait until your system breaks down on you, contact us and we will have it repaired in no time. Call Hart Heating and Cooling today for more details!","Mon - Fri: 8:00 am - 5:00 pm",,,"cash, check",,,http://hartheatingandcooling.com,,,,,,,,,
1330681,423904,"2020-09-27 03:11:20","Baumer's Heating & Air Conditioning, LLC",,baumersheatingandair@yahoo.com,"(541) 951-1449","3037 Coker Butte Rd",Medford,OR,97504,"3037 Coker Butte Rd,Medford,OR 97504","Furnace Repair & Cleaning, Air Conditioning Contractors & Systems, Air Conditioning Equipment & Systems, Air Conditioning Service & Repair, Boiler Dealers, Boiler Repair & Cleaning, Boilers Equipment, Parts & Supplies, Building Contractors, Construction Engineers, Fireplace Equipment, Fireplaces, Furnaces-Heating, Heat Pumps, Heating Contractors & Specialties, Heating Equipment & Systems, Heating Equipment & Systems-Repairing, Heating, Ventilating & Air Conditioning Engineers, Metal Tanks, Metal Tubing, Professional Engineers, Sheet Metal Work, Steel Erectors, Steel Processing",,,A+,42.37649,-122.82595,,"Owner Answers All Calls!","Baumer's Heating & Air Conditioning, LLC serves the Rogue Valley & the surrounding Southern Oregon areas. With over 20 years of experience, we offer high quality service repair. We provide furnace repair Air conditioning repair All makes and models Heating, cooling and ventilation equipment.Problem system? We can help! Quality repairs are guaranteed. If you are looking for honest service at a fair price without unnecessary purchase of new equipment, Baumer's Heating & Air Conditioning, LLC is for you. Call today for your free estimate.","Mon - Fri: 8:00 am - 5:00 pm Sat - Sun Closed",,,"amex, discover, visa, master card, cash, check, debit",,,,,,,,,,,,
1330819,423940,"2020-09-27 03:11:20","Powder River Heating & Air Conditioning Inc",http://powderriverheating.com,dispatch@prhvac.com,"(307) 228-1813","3707 Tanner Dr",Gillette,WY,82718,"3707 Tanner Dr,Gillette,WY 82718","Heating Contractors & Specialties, Air Conditioning Contractors & Systems, Air Conditioning Equipment & Systems, Air Conditioning Service & Repair, Building Contractors, Fireplace Equipment, Fireplaces, Heating Equipment & Systems, Major Appliances, Metal Tanks, Metal Tubing, Plumbers, Sewer Cleaners & Repairers, Sewer Contractors, Steel Erectors, Steel Processing, Water Damage Emergency Service",5,"9 Reviews",A+,44.26045,-105.49815,,"Your Comfort Is Our Business.","Powder River Heating and Air Conditioning Inc is proud of our years of service to the Gillette, Buffalo, and Sheridan areas of Wyoming, and we look forward to helping you with your heating, air conditioning, and plumbing needs. We're pleased to serve the residential, commercial and industrial customers of Northeastern Wyoming. Our team is prepared to help you with the sales, service and installation of the heating, cooling or plumbing system that is ideal for your home or business. Our products and services include: Furnaces and boilers Air conditioning Plumbing Refrigeration Water heaters Service on all makes and models Emergency service 24 hours a dayWhen it comes to your home or your business, you want dependable systems that provide you with value as well as comfort. At Powder River Heating and Air Conditioning Inc, your comfort is our business. We are bonded, insured and up to date on all local and state codes, licenses and requirements. We also guarantee our work.We offer in-house design build projects as well. This allows our licensed mechanical engineering staff to work with customers to give them the system that will best meet their requirements. Call Powder River Heating and Air Conditioning Inc today. We look forward to serving you and making you feel more comfortable!","Mon - Fri: 7:30 am - 5:00 pm","Fax: (307) 682-8343 TollFree: (800) 644-3009",,"discover, master card, visa",,,http://powderriverheating.com,"Parking: Lot","Kristi O.",07/10/2018,five,"This company has been great! Has came same day as called both times. They fixed our problem quickly!","Ross K.",10/21/2015,five,"We used Powder River Heating & Air Conditioning for the first time and it was a very positive experience. They provide quality work for sure."
1333815,424805,"2020-09-27 03:11:30","Aldag Honold Mechanical Inc",http://www.aldaghonold.com,ah@aldaghonold.com,"(920) 458-5558","3509 S Business Dr",Sheboygan,WI,53081,"3509 S Business Dr,Sheboygan,WI 53081","Boiler Dealers, Air Conditioning Contractors & Systems, Air Conditioning Equipment & Systems, Air Conditioning Service & Repair, Boiler Repair & Cleaning, Boilers Equipment, Parts & Supplies, Building Contractors, Building Contractors-Commercial & Industrial, Fireplace Equipment, Fireplaces, Heating Contractors & Specialties, Heating Equipment & Systems, Mechanical Contractors, Metal Specialties, Plumbers, Plumbing Contractors-Commercial & Industrial, Sheet Metal Work, Sheet Metal Work-Manufacturers, Steel Fabricators, Steel Processing, Ventilating Contractors, Water Damage Emergency Service, Water Dealers, Water Heaters",,,A+,43.71802,-87.73723,,,"Residential, Commercial & Industrial Installation & Service. Serving Sheboygan County for Over 100 Years. 24 Hour Emergency Service. * Talk To A Technician, Not An Answering Service.","Mon - Thu: 7:00 am - 4:00 pm Fri: 7:00 am - 3:00 pm Sat - Sun Closed",,,"discover, visa, mastercard, all major credit cards, amex, debit, check, cash",,,"Mechanical Contractors-Sheet Metal, HVAC, Plumbing/Piping","Parking: Lot, Free Services: Boiler Repair, Sheet Metal Work",,,,,,,,
1341278,426918,"2020-09-27 03:11:40","Hk Quality Sheet Metal",http://www.hkqualitysheetmetal.com,,"(816) 233-6335","1105 N 3rd St","Saint Joseph",MO,64501,"1105 N 3rd St,Saint Joseph,MO 64501","Steel Fabricators, Air Conditioning Contractors & Systems, Air Conditioning Equipment & Systems, Air Conditioning Service & Repair, Furnaces-Heating, Heat Pumps, Heating Contractors & Specialties, Heating Equipment & Systems, Heating Equipment & Systems-Repairing, Mechanical Contractors, Sheet Metal Fabricators, Sheet Metal Work, Steel Processing",,,,39.77483,-94.85641,https://i4.ypcdn.com/blob/4ed56ac607eef06033532e5934055399332f3caf_100x100_crop.jpg?63f80dd,,"* M-F 8:00-4:30, Closed Sat & Sun * We Offer 24 Hour Emergency Service * Payment Methods: Checks ASSOCIATION* St. Joseph Heat Pump Association * Member of City Mechanical Review Board","Mon - Fri: 7:30 am - 4:00 pm Sat - Sun Closed","Phone: (816) 232-7856 Fax: (816) 232-9191",,"check, no credit cards",,"Quality Sheet Metal H K Quality Sheet Metal HK Quality Heating & Cooling HK Quality Sheet Metal",http://www.hkqualitysheetmetal.com,"Same Day Service: Yes Services: Air Conditioning, Service & Repair, Installation, Air Duct Cleaning Free Estimates: Yes",,,,,,,,
1344257,427808,"2020-09-27 03:11:51","Pritchard Bros Plumbing",,gnystrom@pritchardbros.com,"(515) 432-6816","1019 Story St",Boone,IA,50036,"1019 Story St,Boone,IA 50036","Sheet Metal Work, Air Conditioning Contractors & Systems, Air Conditioning Equipment & Systems, Air Conditioning Service & Repair, Building Contractors, Construction Engineers, Fireplace Equipment, Fireplaces, Furnaces-Heating, Heating Equipment & Systems, Heating, Ventilating & Air Conditioning Engineers, Metal Tanks, Metal Tubing, Plumbers, Professional Engineers, Steel Erectors, Steel Processing, Water Damage Emergency Service",,,A+,42.06653,-93.88033,,"""LOCALLY OWNED and OPERATED PREMIER LENNOX DEALER""","Pritchard Brothers Plumbing & Heating for ""62 Years"" has been doing it all from AIR Whether it's New Construction or Remodeling give us a call for your Residential or Commercial Project. 24 Hour Emergency Service! See our Ad.","Mon - Sun: Open 24 Hours",,,"check, discover, master card, visa",,,,"Services: Bathroom Remodeling, Geothermal Heating & Cooling, Drain Cleaning",,,,,,,,
1345238,428113,"2020-09-27 03:11:54","Mills George P",http://georgep.millsinc.thryv.com,christie.schuh@dexmedia.com,"(301) 251-9888","1027 Taft St",Rockville,MD,20850,"1027 Taft St,Rockville,MD 20850","Heating Contractors & Specialties, Air Conditioning Contractors & Systems, Air Conditioning Equipment & Systems, Air Conditioning Service & Repair, Building Contractors, Commercial Real Estate, Fireplace Equipment, Fireplaces, Heating Equipment & Systems, Metal Tanks, Metal Tubing, Sheet Metal Work, Steel Erectors, Steel Processing",,,,39.09337,-77.13736,,,"Mills George P Inc. is Mayland's leading heating contractor. We serve both residential and commercial customers. We also specialize in sheet metal work and provide quality service at affordable prices. Call us today for more information. We understand the importance of fast service that you can count on. Same day service is also available.","Mon - Fri: 7:30 am - 4:00 pm Sat - Sun Closed",,,"check, discover, master card, visa, cash",,,website,"Services: Duct Systems",,,,,,,,
1355986,431255,"2020-09-27 03:12:20","Campbell Heating & AC",http://www.campbellshvac.com,dacinc@iwvisp.com,"(760) 463-0837","821 W Inyokern Rd",Ridgecrest,CA,93555,"821 W Inyokern Rd,Ridgecrest,CA 93555","Heating Contractors & Specialties, Air Conditioning Contractors & Systems, Air Conditioning Equipment & Systems, Air Conditioning Service & Repair, Building Contractors, Fireplace Equipment, Fireplaces, Heating Equipment & Systems, Metal Tanks, Metal Tubing, Sheet Metal Work, Steel Erectors, Steel Processing",,,,35.65136,-117.68676,,"Air conditioning contractors","Campbell Heating & AC is dedicated to provide the best possible solution for your home or business. You can count on us to provide you with a system and solution that fits your unique needs, and since we've installed many systems in this area, we've earned a reputation for doing the job right the first time. Call us today for more information.","Mon - Sun: Open 24 Hours","Fax: (760) 446-2563",,"visa, master card, debit",,,http://www.campbellshvac.com,,,,,,,,,
1358213,431919,"2020-09-27 03:12:20","Lakewood Furnace Co",http://www.lakewoodfurnace.com,info@lakewoodfurnace.com,"(216) 370-7135","18502 Detroit Ave",Lakewood,OH,44107,"18502 Detroit Ave,Lakewood,OH 44107","Air Conditioning Contractors & Systems, Air Conditioning Equipment & Systems, Air Conditioning Service & Repair, Air Quality-Indoor, Boiler Repair & Cleaning, Boilers Equipment, Parts & Supplies, Building Contractors, Environmental & Ecological Consultants, Environmental & Ecological Products & Services, Fireplace Equipment, Fireplaces, Furnaces-Heating, Heating Contractors & Specialties, Heating Equipment & Systems, Heating Equipment & Systems-Repairing, Metal Tanks, Metal Tubing, Steel Erectors, Steel Processing",,,A+,41.48222,-81.82697,https://i4.ypcdn.com/blob/e3ba94bda3d1a3ca796638b71edeef35615f38a5_100x100_crop.jpg?63f80dd,,"*Quality Since 1914*Licensed, Bonded, Insured *Residential and Commercial Heating. Air Conditioning Systems*Our Line of Products Includes: Furnaces, Air Conditioners, Heat Pumps, Hot Water, Steam Boilers, Electric Air Cleaners, Humidifiers","Mon - Fri: 8:00 am - 5:00 pm",,,"all major credit cards, master card, visa, amex",,"Lakewood Furnace Company",http://www.lakewoodfurnace.com,"By Appointment Only: No Services: Commercial, Heating, Furnace Repair, Residential, Air Conditioning, Duct Systems, Service & Repair, Installation Emergency Service: Yes Free Estimates: Yes",,,,,,,,
1359383,432211,"2020-09-27 03:12:29","Mt Vernon Heating and Cooling",http://mtvernonheatingandcooling.com,mountvernon@mtvernonheatingandcooling.com,"(319) 382-6031","2465 Valleyview Ct",Marion,IA,52302,"2465 Valleyview Ct,Marion,IA 52302","Heating, Ventilating & Air Conditioning Engineers, Air Conditioning Contractors & Systems, Air Conditioning Equipment & Systems, Air Conditioning Service & Repair, Building Contractors, Construction Engineers, Fireplace Equipment, Fireplaces, Heating Contractors & Specialties, Heating Equipment & Systems, Metal Tanks, Metal Tubing, Plumbers, Plumbing Fixtures, Parts & Supplies, Professional Engineers, Steel Erectors, Steel Processing, Water Heater Repair",,,,42.02097,-91.58644,,"Call us for all your heating and air conditioning needs today!","With over 30 years of experience I have the expertise to assist you with all of your HVAC needs. Whether you need help with air conditioning, heating, ventilation, or commercial refrigeration Mt Vernon Heating and Cooling can provide the highest level of expertise HVAC services. We Serve Cedar Rapids and the surrounding communities. Call to schedule your appointment today!","Mon - Sun: Open 24 Hours","Phone: (319) 241-9161",,"amex, cash, check, debit, discover, visa, master card",,,http://mtvernonheatingandcooling.com,,,,,,,,,
1370949,435577,"2020-09-27 03:12:40","Christian And Son LLC Heating and Cooling",http://www.acrepaircullmanal.com,,"(256) 615-8958","9868 Al Highway 91",Hanceville,AL,35077,"9868 Al Highway 91,Hanceville,AL 35077","Air Conditioning Contractors & Systems, Air Conditioning Equipment & Systems, Air Conditioning Service & Repair, Automobile Air Conditioning Equipment, Automobile Parts & Supplies, Building Contractors, Fireplace Equipment, Fireplaces, Heating Contractors & Specialties, Heating Equipment & Systems, Metal Tanks, Metal Tubing, Steel Erectors, Steel Processing",,,A+,33.91529,-86.93983,https://i3.ypcdn.com/blob/863942e474811ce0fc56495c344ce3354ad55bb7_100x100_crop.jpg?63f80dd,"Christian And Son Fast,Affordable Service","At Christian And Son , you the customer are our only concern. When you are satisfied , we are satisfied. If you should not besatisfiedwith any work or product we provide rest assured we will make it right. This is our promise to you. We offer Sales of quality American Standard,York, Bryant, Rheem, Goodman, Mitsubishi And Sanyo Heating And Air Conditioning products.We Service All Makes and Models.","Mon - Fri: 8:00 am - 6:00 pm Sat: 10:00 am - 6:00 pm Sun: 10:00 am - 1:00 pm",,,"visa, check, cash, financing available, all major credit cards, mastercard, amex, discover, debit, insurance, paypal",,,http://www.acrepaircullmanal.com,"Services: Heating, Air Conditioning, Service & Repair, Installation Free Estimates: Yes",,,,,,,,
1373667,436399,"2020-09-27 03:12:44","A Windham County Sheet Metal Inc",http://windhamcountyhvac.com,,"(800) 762-3488","144 Old Turnpike Rd",Quinebaug,CT,06262,"144 Old Turnpike Rd,Quinebaug,CT 06262","Sheet Metal Work, Air Conditioning Contractors & Systems, Air Conditioning Equipment & Systems, Air Conditioning Service & Repair, Building Contractors, Chimney Cleaning, Chimney Contractors, Cleaning Contractors, Construction Engineers, Fireplace Equipment, Fireplaces, Heating Contractors & Specialties, Heating Equipment & Systems, Heating Equipment & Systems-Repairing, Heating, Ventilating & Air Conditioning Engineers, Metal Tanks, Metal Tubing, Prefabricated Chimneys, Professional Engineers, Sheet Metal Fabricators, Steel Erectors, Steel Processing, Ventilating Contractors",,,,42.021748,-71.93914,,,"Mon-Fri: 7am-3pm","Mon - Fri: 7:00 am - 3:00 pm Sat - Sun Closed","Phone: (860) 935-5153",,"visa, amex, check, debit, discover, mastercard",,"Windham County Sheetmetal",http://windhamcountyhvac.com,,,,,,,,,
1575643,493127,"2020-09-27 03:18:59","Black Diamond Electric, Plumbing, Heating and Air",,Blackdiamondelectric@gmail.com,"(801) 386-8645","2870 S 300 W","Salt Lake City",UT,84115,"2870 S 300 W,Salt Lake City,UT 84115","Home Improvements, Air Conditioning Equipment & Systems, Air Conditioning Service & Repair, Electric Contractors-Commercial & Industrial, Electricians, Heating, Ventilating & Air Conditioning Engineers, Home Automation Systems, Home Repair & Maintenance, Lighting Contractors, Plumbers",5,"1 Review",A+,40.70912,-111.90012,,"You'll be Glad You've Called an Expert","At Black Diamond Electric, we provide top notch electrical service at an honest, fair price. We have years of experience in the electrical industry and we have invested a lot of time and resources into solving electrical problems quickly, and efficiently. With the right equipment, knowledge, and products we can repair any electrical problem, and complete any installation. Our professional electricians are fully licensed, insured and drug tested. All of our installations and repairs are up to local and national codes and we guarantee all of our work. Technicians will arrive with a fully stocked trailer so we can complete most projects on the initial visit. We have the knowledge and equipment to install, repair and maintain anything electrical, and we guarantee all of our work. In the electrical industry, there are always new technologies that improve the efficiency of lighting and appliances. We are always finding ways to make your home or business more efficient, and save money and energy. It is very easy to schedule an appointment with Black Diamond Electric. You can call us anytime and schedule an appointment. We can usually have a technician there within one day on non-emergency appointments. On emergency appointments, we can be there within hours. We can arrive and find a solution to the problem quickly, and accurately. You can also email us any time and receive a fast response. 2nd Location: 3578 S 500 W, Salt Lake City, UT 84115","Mon - Sun: Open 24 Hours","Phone: (801) 923-1390",,"amex, check, visa, mastercard, discover, all major credit cards, financing available",,,"Website Primary Website","Bonded: Yes Commercial: Yes Insured: Yes Licensed: Yes Residential: Yes Services: Electrician, Plumbing, Phone Wiring, Appliance Repair, Sewer Cleaning, Home Theater Design, Water Softeners, Heating & Air Conditioning/hvac, Water Heaters, Drain Cleaning Warranties: Yes","Joleigh H.",06/18/2015,five,"All of the power in my house went out yesterday after plugging in my range after a remodel. After checking the 'usuals', I called Black Diamond and Dan answered immediately and was great. Power restored quickly and we were able to enjoy the rest of the day.",,,,
1575883,493168,"2020-09-27 03:18:59","Sears Home Services",http://www.searshomeservices.com,,"(844) 313-7430","701 Seneca St","Storm Lake",IA,50588,"701 Seneca St,Storm Lake,IA 50588","Home Improvements, Air Conditioning Equipment & Systems, Air Conditioning Service & Repair, Bathroom Remodeling, Heating Equipment & Systems, Kitchen Planning & Remodeling Service",,,,42.64578,-95.19679,,,,"Mon - Fri: 9:00 am - 6:30 pm Sat: 9:00 am - 6:00 pm Sun: 12:00 am - 5:00 pm","TollFree: (844) 317-9159 TollFree: (844) 313-7430 Toll Free: (844) 317-9159",,,,,http://www.searshomeservices.com,,,,,,,,,