business_x_category.id,business.id,business.ts,business.business_name,business.home_page,business.email_address,business.phone,business.street,business.city,business.state,business.zip_code,business.full_address,business.category,business.rating,business.number_of_reviews,business.bbb_rating_or_license,business.latitude,business.longitude,business.cover_image,business.slogan,business.general_info,business.regular_hours,business.extra_phones,business.services_products,business.payment,business.price_range,business.aka,business.other_links,business.other_information,business.review_1_name,business.review_1_date,business.review_1_rating,business.review_1_text,business.review_2_name,business.review_2_date,business.review_2_rating,business.review_2_text
1057578,336994,"2020-09-27 03:03:27","BH Notary Service - Bassem Abousaif Hanna",https://bhnotaryservice.com,bhnotaryservice@outlook.com,"(718) 208-3361",,,,,,"Notaries Public, Attorneys",,,,,,https://i2.ypcdn.com/blob/ff81698553e95f454535847eba3064c0d2848fc6_100x100_crop.jpg?f9d23e1,,"It is our mission to provide quick and convenient service any time you need a document signed, sealed, or delivered. Our flexible services come to you, whether you need us at your business, the bank, or your home. We are the local mobile notary you can rely on when you need legal document preparation, loan signing, and other notary services. Other specialties include: Notario Publico Cerca de Mi Huntington Beach, CA 92647 Notario Publico Huntington Beach, CA 92647 Nearest Notary Public Huntington Beach, CA 92647 Mobile Notary Public Huntington Beach, CA 92647 If your important documentation calls for professional notary service, donВ’t hesitate to call BH Notary Service - Bassem Abovsaif Hanna. When an expert witness is critical to the timely filing of your paperwork we are ready with a mobile notary, notary public, and notary signing.","Mon - Sun: 8:30 am - 10:00 pm",,,"amex, cash, check, discover, master card, visa",,,https://bhnotaryservice.com/,,,,,,,,,
1057873,337066,"2020-09-27 03:03:35","Budget Mobile Notary",http://notaryonwheels.com,,"(619) 280-2965",,,,,,"Notaries Public, Attorneys, Legal Service Plans",,,,,,,,,"Wed: 8:30 am - 7:30 pm",,,,,,http://notaryonwheels.com,,,,,,,,,
1057969,337097,"2020-09-27 03:03:35","Conolly Legal, PL",,MConolly@ConollyLegal.com,"(561) 275-1728","801 Northpoint Pkwy Ste 62","West Palm Beach",FL,33407,"801 Northpoint Pkwy Ste 62,West Palm Beach,FL 33407","Attorneys, Business Law Attorneys, Contract Law Attorneys, Estate Planning Attorneys, Notaries Public",,,,26.76303,-80.094,,,,"Mon - Fri: 9:00 am - 5:00 pm Sat - Sun Closed",,,"visa, amex, discover, check, cash, mastercard",,,,,,,,,,,,
1058014,337108,"2020-09-27 03:03:35","Title & Abstract Svc",,bill@titleandabstract.net,"(985) 643-9377","820 Oak Harbor Blvd # 4",Slidell,LA,70458,"820 Oak Harbor Blvd # 4,Slidell,LA 70458","Abstracters, Attorneys, Insurance, Notaries Public, Title & Mortgage Insurance, Title Companies",,,,30.22659,-89.78194,,,,"Mon - Fri: 8:00 am - 5:00 pm",,,,,"Title and Abstract Services LLC Title & Abstract Service Title & Abstract SVC LLC Title and Abstract Services",,"Parking: Lot",,,,,,,,
1058025,337111,"2020-09-27 03:03:35","Dean Law Firm LLC",http://www.deanlawfirmsc.com,scapers5091@yahoo.com,"(803) 395-0854","146 Centre St",Orangeburg,SC,29115,"146 Centre St,Orangeburg,SC 29115","Attorneys, Administrative & Governmental Law Attorneys, Criminal Law Attorneys, Discrimination & Civil Rights Law Attorneys, Employee Benefits & Worker Compensation Attorneys, Labor & Employment Law Attorneys, Medical Law Attorneys, Medical Malpractice Attorneys, Notaries Public, Personal Injury Law Attorneys, Social Security & Disability Law Attorneys, Workers Compensation & Disability Insurance",,,,33.49238,-80.86072,https://i1.ypcdn.com/blob/e83a1d4bf11bbb730f3363493634990029f61adb_100x100_crop.jpg?f9d23e1,"Proudly Representing Injured Workers For Over 35 Years.","For more than 35 years, the plaintiff's lawyer at the Dean Law Firm has helped Orangeburg, South Carolina, residents with recovering the compensation that they deserve for their personal injury, workers' compensation, and disability claims. Whether you have been injured in an accident that was caused by the negligence of a person or business or in an accident while you were working, you may need experienced legal help to recover compensation in an amount that is fair. If you are disabled and unable to work, you may also need help with your social security disability claim. Our attorneys works hard to advocate for our clients through depositions, hearings, and trials. We are often able to negotiate settlements for our personal injury clients without having to go to trial, and we regularly appear before administrative law judges and before courts to litigate matters on our clientsВ’ behalf when settlements cannot be reached. Whether you have been injured in an accident or while you were working, dealing with insurance companies and workers' compensation claims may be overwhelming. If you are disabled and have had your Social Security disability benefits claim denied, you may not know what to do. When you get help from an experienced attorney at the Dean Law Firm, you may be more likely to resolve your claims successfully. Contact us today to schedule your free consultation.","Mon - Thu: 8:30 am - 5:00 pm Fri: 8:30 am - 3:00 pm",,,,,,http://www.deanlawfirmsc.com,"Specialties: Workers Compensation, Auto Accidents Appointment Needed: No Free Consultation: Yes Parking: Free",,,,,,,,
1058741,337282,"2020-09-27 03:03:35","Caire D Agna Law Corp",,d.caire@yahoo.com,"(985) 649-1500","100 Galeria Blvd",Slidell,LA,70458,"100 Galeria Blvd,Slidell,LA 70458","Elder Law Attorneys, Abrasives, Attorneys, Estate Planning Attorneys, Family Law Attorneys, General Practice Attorneys, Notaries Public, Sandblasting Equipment & Supplies, Trust Companies, Wills, Trusts & Estate Planning Attorneys",,,,30.31041,-89.75251,,,"Successions-Wills-Living Trusts-Community Property-Trusts","Mon - Fri: 9:00 am - 5:00 pm Sat - Sun Closed",,,,,,,,,,,,,,,
1058807,337296,"2020-09-27 03:03:35","Notary Direct",https://m.facebook.com/pages/notary-direct/169598303054410,info@notarydirect.com,"(504) 271-5000","9135 W Judge Perez Dr",Chalmette,LA,70043,"9135 W Judge Perez Dr,Chalmette,LA 70043","Notaries Public, Attorneys, General Practice Attorneys",,,,29.94897,-89.97152,,,,"Mon - Fri: 6:00 am - 12:00 pm",,,"amex, discover, master card, visa",,,https://m.facebook.com/pages/notary-direct/169598303054410,,,,,,,,,
1059041,337346,"2020-09-27 03:03:35","Accent Title",http://www.accenttitle.com,moconnor@celticgroup.com,"(225) 292-2130","3999 S Sherwood Forest Blvd","Baton Rouge",LA,70816,"3999 S Sherwood Forest Blvd,Baton Rouge,LA 70816","Title Companies, Attorneys, Notaries Public, Title & Mortgage Insurance","4,5","6 Reviews",A+,30.41626,-91.05107,,,,"Mon - Fri: 8:30 am - 5:30 pm Sat - Sun Closed",,,,,,"http://www.accenttitle.com https://accenttitle.com","Parking: Lot",lacharlie,04/27/2012,one,"Realtors....trust me...this is the worst closing attorney in the City of Baton Rouge. They don't return your phone calls....they don't update you....and they absolutely love DRAMA! Commerce title is a much wiser choice providing you want to close your sales. I'm amazed this company is still in business.",sean1478,02/09/2012,five,"Great Title company! Friendly Staff. They closed my loan at 7:30 p,m. on a Friday night so that i would not have to leave work early. Closing attorney Brouillette made everyone feel at ease."
1059128,337366,"2020-09-27 03:03:35","Appleberry Elaine Attorney At Law",http://facebook.com,,"(504) 362-7800","405 Gretna Blvd Ste 107",Gretna,LA,70053,"405 Gretna Blvd Ste 107,Gretna,LA 70053","Civil Litigation & Trial Law Attorneys, Attorneys, Family Law Attorneys, General Practice Attorneys, Notaries Public, Personal Injury Law Attorneys, Social Security & Disability Law Attorneys",,,,29.90146,-90.04621,,,,"Mon - Fri: 9:00 am - 5:00 pm",,,,,,http://facebook.com,"Parking: Lot",,,,,,,,
1059194,337382,"2020-09-27 03:03:35","Griffith Steven F Sr LTD",,griffithlawfirm@aol.com,"(985) 764-6862","13358 River Rd",Destrehan,LA,70047,"13358 River Rd,Destrehan,LA 70047","Family Law Attorneys, Attorneys, Criminal Law Attorneys, Insurance, Notaries Public, Property & Casualty Insurance, Title & Mortgage Insurance",,,,29.94918,-90.37466,,,"Personal Injury, Divorce, Criminal Law, Custody & Support, Wills & Successions","Mon - Fri: 8:00 am - 4:00 pm Sat - Sun Closed","Fax: (985) 764-3692",,,,,,,,,,,,,,
1059349,337417,"2020-09-27 03:03:35","Kutztown Notary By Appointment",,,"(610) 683-3683",,,,,,"Attorneys, Notaries Public, School Supplies & Services, State Government, Tutoring",,,,,,,,"Meeting all your notarial needs! Notarizations by appointment only. Fast, courteous and thorough service. Will travel. Call today!",,,,"cash only",,,,,,,,,,,,
1059361,337419,"2020-09-27 03:03:35","Hamilton Robert Lee Law Offices Of",http://www.legalsaint.com,robert@legalsaint.com,"(530) 244-1755","448 Redcliff Dr",Redding,CA,96002,"448 Redcliff Dr,Redding,CA 96002","Landlord & Tenant Attorneys, Accident & Property Damage Attorneys, Attorneys, Criminal Law Attorneys, DUI & DWI Attorneys, Notaries Public, Personal Injury Law Attorneys, Process Servers, Real Estate Attorneys",,,A+,40.57547,-122.36329,,"Call Me For A Free CONFIDENTIAL Consultation",,,,,"visa, mastercard",,,http://www.legalsaint.com,,,,,,,,,
1059769,337515,"2020-09-27 03:03:35","Jenny Abshier, Esq.",http://www.louisianabankruptcynow.com,jenny.abshier.esq@gmail.com,"(504) 222-2536","3005 Harvard Ave Ste 102",Metairie,LA,70006,"3005 Harvard Ave Ste 102,Metairie,LA 70006","Attorneys, Bankruptcy Law Attorneys, Bankruptcy Services, Employment Discrimination Attorneys, Notaries Public",5,"4 Reviews",,30.00246,-90.18936,,"If You're in Debt Now, You Need Bankruptcy Now!","Please see my websites for a complete description of what I do: www.jennyabshieresq.com www.LouisianaBankruptcyNow.com","Mon: 10:00 am - 7:00 pm Tue - Thu: 9:00 am - 3:30 pm Fri: 9:00 am - 1:00 pm",,,"no credit cards",,,"Bankruptcy Information",,"Ronald B.",07/08/2016,five,"att JENNY Abshier, is a vary good attorney . She explain my whole case , she help me to give my family a decetent funner i.m vary grateful for the help she , gave me. she was a godsend. she changed the way i look at attorney. for best att in world , put this attorney first.","Sonnet I.",07/15/2014,five,"Jenny Abshier is a brilliant attorney. She walked me through every step of the bankruptcy, answering all of my questions. She made sure I understood what to expect before we even started the process. She also looked at all my options and recommended the best course of action for my situation. During the process, she was always happy to answer any question I had and reassure me that I was doing the right thing. Thanks to her services and her guidance my credit score has gone up 67 points in the 9 months since my bankruptcy finished!"
1059775,337516,"2020-09-27 03:03:35","Pucheu, John H",http://www.pprlaw.com,prr@prrlaw.com,"(337) 457-9075","106 Park Ave",Eunice,LA,70535,"106 Park Ave,Eunice,LA 70535","Notaries Public, Attorneys",,,,30.49294,-92.41555,,,"Pucheu, Pucheu & Robinson, LLP offers a variety of legal services from family and personal injury law to property damage and estate law services to all of Eunise Louisiana","Mon - Fri: 9:00 am - 5:00 pm Sat - Sun Closed",,,,,,"http://www.pprlaw.com http://prrlaw.com","Specialties: Atvs, Defective Products, Estate Planning, Death Claims, Faulty Products, Fatalities, Neck & Back, Injury Claims, Workplace Injuries, Head & Brain, Job Injuries, Personal Injury, Environmental Claims, Paralysis, Work-Related Injuries, Accidents, Personal Injuries, Paraplegic & Quadriplegic, Pain & Suffering, Products Liability, Unsafe Products, Trains",,,,,,,,
1059930,337558,"2020-09-27 03:03:35","Court Services Unlimited",http://courtservicesunlimited.com,servepaper@aol.com,"(408) 277-6700","255 N Market St Suite #130","San Jose",CA,95110,"255 N Market St Suite #130,San Jose,CA 95110","Process Servers, Attorneys, Legal Service Plans, Notaries Public",5,"1 Review",,37.33911,-121.89497,https://i1.ypcdn.com/blob/369b7db91d24e4e6b335d034c5197fa61399d5d8_100x100_crop.jpg?f9d23e1,"Service Guaranteed With A Valid Address",,"Mon - Thu: 8:00 am - 5:00 pm Fri: 8:00 am - 4:00 pm","Primary Phone: (408) 490-4054",,,,"Court Services Unlimited LlC","http://courtservicesunlimited.com https://courtservicesunlimited.com","Parking: Street",mbennet,03/13/2012,five,"Not only do they do what they say they are going to do, but they keep in contact with you. I have used Court Services several times, they always complete service, even where others have failed. They go above and beyond to complete service, file paperwork and let you know what is happening. The are the only ones I will use now.",,,,
1061092,337843,"2020-09-27 03:03:35","Dupont Dupont & Dupont",http://www.dupontlawfirm.com,,"(225) 687-6893","23635 Railroad Ave",Plaquemine,LA,70764,"23635 Railroad Ave,Plaquemine,LA 70764","Attorneys, Loans, Notaries Public",,,,30.28828,-91.23486,,,,"Mon - Sun: Open 24 Hours",,,,,,"http://www.dupontlawfirm.com http://bartbernard.com http://dupont.com",,,,,,,,,
1061198,337867,"2020-09-27 03:03:35","Betro and Company",http://www.betro.com,fbetro@betrolaw.com,"(508) 698-3600","30 Mechanic St Ste 3",Foxboro,MA,02035,"30 Mechanic St Ste 3,Foxboro,MA 02035","Attorneys, Accountants-Certified Public, Accounting Services, Financial Services, Notaries Public, Seals-Notary & Corporation",,,,42.06681,-71.24702,https://i3.ypcdn.com/blob/d3fa924abf47662739ea827b586a48d0dbe0b8a8_100x100_crop.jpg?f9d23e1,"Serving corporate and individual clients since 1958","Serving corporate and individual clients since 1958, Betro and Company, P.C. of Foxboro, Massachusetts, is a widely recognized leader among New England's certified public accountants. From traditional accounting and tax services to progressive valuation and transaction advisory services, our experience and knowledge of the local business environment is unsurpassed. Today, our team of certified public accountants and accredited valuation professionals is proud to serve greater New England from office locations in both Massachusetts and Rhode Island. Contact Us Today: Name Phone number Message Massachusetts Society of Certified Public Accountants, Certified Public Accountants in Foxboro, MAAmerican Institute of Certified Public Accountants, Certified Public Accountants in Foxboro, MANational Association of Certified Valuators and Analysts, Certified Public Accountants in Foxboro, MA Whether preparing tax returns, reviewing accounting records, or planning for acquisition, succession, expansion, or litigation, each member of Betro and Company, P.C. understands that the timely delivery of accurate support is essential to the continued success of our clients. Originally located in Boston's Post Office Square, Betro and Company, P.C. was founded in 1958 by Gerald J. Betro. The firm, now headed by Gerald's son, Felix S. Betro, has a home office in Foxboro, Massachusetts, with additional offices in Cataumet on Cape Cod and in Smithfield, Rhode Island. In 2008, Betro and Company, P.C. celebrated its 50th anniversary, marking five decades of providing exceptional financial accounting service to individuals and businesses throughout New England. Many of the firm's clients have remained loyal throughout our existence, giving testimony to the outstanding level of expertise and service we provide","Mon - Fri: 8:30 am - 5:00 pm Sat - Sun Closed",,,"cash, all major credit cards, check",,"Betro and Company P.C.",http://www.betro.com,"Services: Mental Health Services",,,,,,,,
1061450,337920,"2020-09-27 03:03:35","Baudry & Tabb LLC",http://www.abtabblaw.net/,jtabb.law@gmail.com,"(985) 255-4828","111 Wilson St",Franklin,LA,70538,"111 Wilson St,Franklin,LA 70538","Criminal Law Attorneys, Attorneys, DUI & DWI Attorneys, Family Law Attorneys, Notaries Public, Personal Injury Law Attorneys, Real Estate Attorneys",5,"1 Review",,29.79062,-91.50011,,"Attorneys: Michael Aloise Ryan Baudry Joseph A. Tabb","The Law Firm of Aloise, Baudry, & Tabb, LLC offers general legal services including work in the following areas of law:? Personal Injury Law (Auto Accidents, Maritime Law, Jones Act Cases) Family Law (Divorce, Custody, Adoptions, etc) Criminal Defense Real Estate Law (Sales, Mortgages, etc) Probate (Successions, Wills, etc) Corporate Formation If you have looked at the categories above, and you do not see the area listed that you need help in, please do not hesitate to contact us and if we can not help you, we can help find someone that can.","Mon - Fri: 8:30 am - 5:00 pm","Phone: (337) 828-0455",,check,,"Joseph Tabb Aloise Baudry & Tabb",http://www.abtabblaw.net,,johnbrouss12345,02/24/2011,five,"These attorneys are really good at what they do. They work fast and they really care about your case. They are prepared and very professional.",,,,
1062260,338109,"2020-09-27 03:03:42","DeBates Raymond P.C.",http://www.debateslaw.com,rdebates@colonialtitlecompany.com,"(586) 863-5270","27500 Harper Ave Ste 200","Saint Clair Shores",MI,48081,"27500 Harper Ave Ste 200,Saint Clair Shores,MI 48081","Notaries Public, Attorneys, Landlord & Tenant Attorneys, Real Estate Attorneys, Title Companies, Wills, Trusts & Estate Planning Attorneys",,,,42.49427,-82.89708,https://i1.ypcdn.com/blob/71e13a7d4723df5609cf8abfd5bbeee12e3b9ea9_100x100_crop.jpg?f9d23e1,,"Raymond DeBates has been a licensed practicing attorney in the state of Michigan since 1984. He obtained a degree from Michigan State University in Resource Development and a Juris Doctorate degree from MSU/Detroit College of Law. Mr. DeBates main focuses are: Real Estate, closing and documents, Business formation, Finance, Foreclosures, and Land-lord Tenant Law. He has worked in numerous counties throughout Michigan. Mr. DeBates is a Member of the Michigan State Bar & is admitted to practice in Federal Courts. He is a member of the real property ad business law sections of the State Bar of Michigan.",,"Fax: (586) 774-7040",,"check, cash, no credit cards",,"DeBates Raymond Esq.","http://www.debateslaw.com http://www.rdebates.com",,,,,,,,,
1062589,338194,"2020-09-27 03:03:42","Need-It-Now Services, Inc.",,,"(512) 270-4944",,Austin,TX,78702,"Austin,TX 78702","Attorneys, Drug Testing, Legal Document Assistance, Legal Forms, Notaries Public",,,,,,,,,,,,,,,,,,,,,,,,
1062849,338271,"2020-09-27 03:03:42","Madeline S. Carbonette, Attorney at Law & Notary Public",,,"(225) 769-1234",,,,,70808,"Attorneys, Notaries Public",,,,,,,,,,,,,,,,,,,,,,,,
1063258,338366,"2020-09-27 03:03:42","Anderson & Anderson",,,"(985) 643-6443","2217 2nd St",Slidell,LA,70458,"2217 2nd St,Slidell,LA 70458","Notaries Public, Attorneys, Criminal Law Attorneys, Family Law Attorneys, Personal Injury Law Attorneys, Probate Law Attorneys, Wills, Trusts & Estate Planning Attorneys",,,,30.2738,-89.78183,,"""Since 1981""","Formed as a partnership of law corporations in 1985, Anderson & Anderson originated with the founding of Joseph P. Anderson, Jr., Ltd. in 1981. As so established, the firm has engaged in the practice of law continuously since 1981 in Slidell, Louisiana. The firm has sustained growth through maintaining its customary standards of hard work, professionalism and personalized service and has a well-established tradition of handling complex cases and advancing novel legal theories. The firm also has a well-established tradition of serving and financially supporting Slidell area civic, charitable and religious organizations.","Mon - Fri: 9:00 am - 5:00 pm",,,,,,,"Specialties: Workers Compensation, Partnerships, Divorce & Family",,,,,,,,
1063902,338523,"2020-09-27 03:03:42","Judycki Frank Attorney At Law",http://www.frankjudyicki.com,,"(985) 385-1520","1109 8th St","Morgan City",LA,70380,"1109 8th St,Morgan City,LA 70380","Notaries Public, Accident & Property Damage Attorneys, Accident Reconstruction Service, Adoption Law Attorneys, Attorneys, Automobile Accident Attorneys, Bankruptcy Law Attorneys, Bankruptcy Services, Child Custody Attorneys, Criminal Law Attorneys, DUI & DWI Attorneys, Divorce Assistance, Divorce Attorneys, Elderly Homes, Family Law Attorneys",,,,29.70416,-91.20246,,,"A privately held company in Morgan City LA","Mon - Fri: 9:00 am - 5:00 pm",,,"cash, check",,,http://www.frankjudyicki.com,"Specialties: Criminal, Estate Planning, Debt, Personal Injury & Property Damage",,,,,,,,
1064026,338555,"2020-09-27 03:03:42","Hunter Legal, LLC",,,"(225) 242-9450","1926 Wooddale Blvd Ste 118b","Baton Rouge",LA,70806,"1926 Wooddale Blvd Ste 118b,Baton Rouge,LA 70806","Attorneys, Family Law Attorneys, Juvenile Law Attorneys, Notaries Public, Traffic Law Attorneys",,,,30.46618,-91.11326,,,,"Mon - Fri: 9:00 am - 5:00 pm Sat - Sun Closed","Fax: (225) 245-3219",,"visa, master card, amex, discover, check, paypal, cash",,,,,,,,,,,,
1064072,338566,"2020-09-27 03:03:42","LeBleu, Fred C III",http://www.theroachlawfirm.com/Attorneys,flebleu@fredlebleu.com,"(337) 764-5565","2917 Ryan St","Lake Charles",LA,70601,"2917 Ryan St,Lake Charles,LA 70601","Criminal Law Attorneys, Attorneys, Notaries Public",,,,30.20182,-93.21831,,,"Have you been charged with a crime? Fred C. LeBleu III, Attorney at Law is here to fight for your rights. We specialize in criminal law, drug crime, federal crime, and sex crime. Our attorney has the knowledge, experience, and professionalism to handle all your cases. At Fred C. LeBleu III, Attorney at Law, our team of lawyers will represent you tirelessly and work hard to resolve your cases. We will aggressively represent you, regardless of your situation. Let us help you, no matter if you are facing criminal charges or dealing with personal injury.","Mon - Fri: 8:00 am - 5:00 pm",,,,,,http://www.theroachlawfirm.com/Attorneys,,,,,,,,,
1064112,338574,"2020-09-27 03:03:42","Baton Rouge Title Co, Inc",http://www.brtitle.com,,"(225) 291-1111","10500 Coursey Blvd Ste 100","Baton Rouge",LA,70816,"10500 Coursey Blvd Ste 100,Baton Rouge,LA 70816","Title Companies, Attorneys, Insurance, Notaries Public, Property & Casualty Insurance, Real Estate Attorneys, Title & Mortgage Insurance",,,A+,30.41625,-91.06391,,,"Baton Rouge Title is the oldest and largest title company in the Baton Rouge area with several convenient locations so that we are never too far to handle your individual closing needs. From residential sales, construction mortgages, refinances and second mortgages, to deferred tax exchanges, to the largest commercial transactions, we have the experience and knowledge to service all real estate closings","Mon - Fri: 8:00 am - 4:00 pm Sat - Sun Closed",,,"financing available",,,http://www.brtitle.com,,,,,,,,,