business_x_category.id,business.id,business.ts,business.business_name,business.home_page,business.email_address,business.phone,business.street,business.city,business.state,business.zip_code,business.full_address,business.category,business.rating,business.number_of_reviews,business.bbb_rating_or_license,business.latitude,business.longitude,business.cover_image,business.slogan,business.general_info,business.regular_hours,business.extra_phones,business.services_products,business.payment,business.price_range,business.aka,business.other_links,business.other_information,business.review_1_name,business.review_1_date,business.review_1_rating,business.review_1_text,business.review_2_name,business.review_2_date,business.review_2_rating,business.review_2_text
17018797,2380719,"2020-09-27 06:22:13","Merchant Solutions Int.",http://www.merchantsolution.com,support@merchantsolution.com,"(517) 882-2121",,Lansing,MI,48911,"Lansing,MI 48911","Credit Card-Merchant Services, Banks, Commercial & Savings Banks, Credit Card Companies, Credit Cards & Plans-Equipment & Supplies, Financial Services, Office Furniture & Equipment",,,,,,,"The Power Of the Card Captured here","Central Payment equips business with the very best in transaction processing technology and services. We pride ourselves on our competitive pricing, around-the-clock customer support, and innovative technology sets the industry gold standard. The 40,000 and counting business we service produce more than 3.5 billion dollars in annual credit card sales. Charge Smart - Multiply your sales Mobile Marketing - Expand your customer base Social Media - Increase your cash flow Loyalty Redefined - Create customer loyalty","Mon - Sun: Open 24 Hours","TollFree: (800) 485-2630",,"amex, discover, visa, check, mastercard",,,"http://www.merchantsolution.com https://www.merchantsolution.com",,,,,,,,,
17023933,2382030,"2020-09-27 06:22:23","Frost - Downtown Corpus Christi",,,"(361) 883-3621","802 N Carancahua St","Corpus Christi",TX,78401,"802 N Carancahua St,Corpus Christi,TX 78401","Banks, ATM Locations, Annuities & Retirement Insurance Plans, Commercial & Savings Banks, Financial Planners, Financial Planning Consultants, Financial Services, Internet Banking, Investment Advisory Service, Investment Management, Investment Securities, Investments, Loans, Mortgages, Mutual Funds, Office Furniture & Equipment-Renting & Leasing, Stock & Bond Brokers, Surety & Fidelity Bonds",,,,27.79763,-97.39686,,"Banking. Investments. Insurance.","Texas roots. World-class service. From banking and insurance to all your investment needs, Frost is here for you. Literally. If you're in Texas, chances are there's a Frost nearby with folks you can trust to navigate you through any financial decision, no matter how simple or complicated. And because we put people first, you'll get the kind of customer service Frost has been known for since we first started serving this great state six generations ago. You'll also be able to take advantage of our time-tested, disciplined approach to helping you make the right financial decisions for your money.","Mon - Fri: 9:00 am - 5:00 pm Sat - Sun Closed",,,,,,,,,,,,,,,
17030084,2383615,"2020-09-27 06:22:25","Secu-Atm-Guilford Crossing B1nh",,,"(336) 834-2362","4917 Piedmont Pkwy",Jamestown,NC,27282,"4917 Piedmont Pkwy,Jamestown,NC 27282","ATM Locations, Banks, Office Furniture & Equipment",,,,36.04015,-79.92181,,,,,,,,,,,,,,,,,,,
17076358,2395867,"2020-09-27 06:23:21","Oak Grove Financial",http://www.oakgrovefin.com,info@oakgrovefin.com,"(612) 547-9797",,Minneapolis,MN,55436,"Minneapolis,MN 55436","Real Estate Developers, Banks, Business Brokers, Commercial & Savings Banks, Commercial Real Estate, Investment Advisory Service, Loans, Office Buildings & Parks, Real Estate Loans",,,,,,,"Connected to capital. Connecting to borrowers.",,,,,"check, no credit cards, paypal, travelers checks",,,"Website for company and services",,,,,,,,,
17491750,2550192,"2020-09-27 06:37:54","First National Bank",https://www.fnbo.com,,"(815) 472-6500","159 Stirling Pl Ste 2",Momence,IL,60954,"159 Stirling Pl Ste 2,Momence,IL 60954","Banks, ATM Locations, Loans, Mortgages",,,,41.17448,-87.6618,,,,,"Phone: (815) 472-6510",,"all major credit cards",,"First National Bank of Grant Park Momence First National Bank-Grant Park",https://www.fnbo.com,,,,,,,,,
17491754,2550193,"2020-09-27 06:37:54","Bank of America Financial Center",https://www.bankofamerica.com,,"(860) 645-3280","14 N Main St",Manchester,CT,06042,"14 N Main St,Manchester,CT 06042","Banks, ATM Locations, Commercial & Savings Banks, Loans",,,,41.79494,-72.52213,https://i2.ypcdn.com/blob/3a79f235d7941cc9916f72ed93b9c38968b966b8_100x100_crop.jpg?f9d23e1,"LIFE'S BETTER WHEN WE'RE CONNECTED","Welcome to Bank of America in Manchester, CT, home to a variety of your financial needs including checking and savings accounts, online banking, mobile and text banking, student banking and credit cards. You have full access to your Bank of America accounts at any of our more than 5,000 banking centers nationwide. When you visit our financial centers, our knowledgeable associates and welcoming environment will make you feel at home.Easy access for everyone: Handicap accessible parking spaces, Handicap accessible restrooms and Braille signage (where available), Ramps in locations with steps, Easy-to-open doors, Handicap accessible safe deposit box rooms.","Sun:- Mon:9-4 Tue:9-4 Wed:9-4 Thu:9-4 Fri:9-4 Sat:9-12","Fax Number: (860) 512-3869 Fax: (860) 512-3869 TollFree: (800) 432-1000",,"debit, all major credit cards, master card, visa",,"Bank of America ATM",https://www.bankofamerica.com,,,,,,,,,
17491759,2550195,"2020-09-27 06:37:54","Bank of the West",https://www.bankofthewest.com,virginia.victorin@bankofthewest.com,"(720) 304-0889","400 Center Dr",Superior,CO,80027,"400 Center Dr,Superior,CO 80027","Banks, ATM Locations, Loans, Mortgages",,,,39.95554,-105.17041,https://i2.ypcdn.com/blob/b84df1cfcb49ce008a7c931a68e40e94ccf2ee75_100x100_crop.jpg?f9d23e1,,,"Mon - Fri: 9:00 am - 5:00 pm Sat: 9:00 am - 12:00 pm Sun Closed","Phone: (720) 304-0893 Primary Phone: (720) 304-0890",,"master card, visa",,"Commercial Federal Bank",https://www.bankofthewest.com,,,,,,,,,
17491768,2550201,"2020-09-27 06:37:54","Bank of America Financial Center",https://www.bankofamerica.com,,"(405) 773-1683","6901 NW Expressway","Oklahoma City",OK,73132,"6901 NW Expressway,Oklahoma City,OK 73132","Banks, ATM Locations, Commercial & Savings Banks, Loans",,,,35.55719,-97.63623,https://i2.ypcdn.com/blob/3a79f235d7941cc9916f72ed93b9c38968b966b8_100x100_crop.jpg?f9d23e1,"LIFE'S BETTER WHEN WE'RE CONNECTED","Welcome to Bank of America in Oklahoma City, OK, home to a variety of your financial needs including checking and savings accounts, online banking, mobile and text banking, student banking and credit cards. You have full access to your Bank of America accounts at any of our more than 5,000 banking centers nationwide. When you visit our financial centers, our knowledgeable associates and welcoming environment will make you feel at home.Easy access for everyone: Handicap accessible parking spaces, Handicap accessible restrooms and Braille signage (where available), Ramps in locations with steps, Easy-to-open doors, Handicap accessible safe deposit box rooms.","Sun:- Mon:9-4 Tue:9-4 Wed:9-4 Thu:9-4 Fri:9-5 Sat:9-12","Phone: (405) 249-8748 Fax Number: (405) 773-7126 Fax: (405) 773-7126 TollFree: (800) 432-1000",,,,"Bank of America Mortgage",https://www.bankofamerica.com,,,,,,,,,
17491774,2550203,"2020-09-27 06:37:54",ATM,http://www.bmoharris.com,,"(888) 340-2265","4901 Spring St","Mount Pleasant",WI,53406,"4901 Spring St,Mount Pleasant,WI 53406","ATM Locations, Banks",,,,42.73631,-87.83938,,,,,,,,,,"http://www.bmoharris.com https://network.americanexpress.com/globalnetwork/atm_locator/en https://branchlocator.bmoharris.com",,,,,,,,,
17491781,2550208,"2020-09-27 06:37:54","Luzerne Bank",http://www.luzernebank.com,contactus@luzernebank.com,"(570) 613-0966","324 Wyoming Ave",Wyoming,PA,18644,"324 Wyoming Ave,Wyoming,PA 18644","Commercial & Savings Banks, ATM Locations, Banks",,,,41.31151,-75.83733,,,,"Mon - Thu: 8:00 am - 5:00 pm Fri: 8:00 am - 6:00 pm Sat: 9:00 am - 12:00 pm","Phone: (570) 613-0866 Fax: (570) 613-0866 Fax Number: (570) 613-0866",,,,"Luzerne National Bank Luzerne Bank Atm","http://www.luzernebank.com http://luzernenational.com https://www.luzernebank.com",,,,,,,,,
17491782,2550209,"2020-09-27 06:37:54","Bank of America Financial Center",https://www.bankofamerica.com,,"(410) 309-1004","7170 Cradlerock Way",Columbia,MD,21045,"7170 Cradlerock Way,Columbia,MD 21045","Banks, ATM Locations, Commercial & Savings Banks, Loans",,,,39.18692,-76.84238,https://i2.ypcdn.com/blob/7dba43688188f7ff524ea672a918b3cbb3f2aabf_100x100_crop.jpg?f9d23e1,"LIFE'S BETTER WHEN WE'RE CONNECTED","Welcome to Bank of America in Columbia, MD, home to a variety of your financial needs including checking and savings accounts, online banking, mobile and text banking, student banking and credit cards. You have full access to your Bank of America accounts at any of our more than 5,000 banking centers nationwide. When you visit our financial centers, our knowledgeable associates and welcoming environment will make you feel at home.Easy access for everyone: Handicap accessible parking spaces, Handicap accessible restrooms and Braille signage (where available), Ramps in locations with steps, Easy-to-open doors, Handicap accessible safe deposit box rooms.","Sun:- Mon:9-5 Tue:9-5 Wed:9-5 Thu:9-5 Fri:9-6 Sat:9-12","Phone: (410) 381-7152 Fax: (443) 766-7656 Fax Number: (443) 766-7656 TollFree: (800) 432-1000",,"debit, all major credit cards, master card, visa",,,https://www.bankofamerica.com,,,,,,,,,
17491786,2550210,"2020-09-27 06:37:54","Bank of America",https://www.bankofamerica.com,,"(931) 582-6282","95 Main St","Mc Ewen",TN,37101,"95 Main St,Mc Ewen,TN 37101","Banks, ATM Locations, Commercial & Savings Banks, Loans",5,"1 Review",,36.10869,-87.63473,https://i2.ypcdn.com/blob/3a79f235d7941cc9916f72ed93b9c38968b966b8_100x100_crop.jpg?f9d23e1,,,"Mon - Thu: 8:30 am - 3:30 pm Fri: 8:30 am - 5:00 pm","Primary Phone: (931) 582-2739 Phone: (931) 582-2739 Fax: (931) 296-0087 TollFree: (800) 432-1000",,"all major credit cards, master card, visa",,"Bank of America ATM Bank Of America Corporation",https://www.bankofamerica.com,"Specialties: Travelers Checks, Mutual Funds, Refinancing, Stocks, Analysts, Estates / Trusts / Probate, Insurance",sam1257,02/13/2009,five,"The people that work there are all very nice I have banked at alot of banks and this one is the best I have ever used.",,,,
17491791,2550212,"2020-09-27 06:37:54","Associated Bank",https://www.associatedbank.com,,"(262) 692-2466","211 Highland Dr",Fredonia,WI,53021,"211 Highland Dr,Fredonia,WI 53021","Banks, ATM Locations, Financial Services",,,,43.47145,-87.94273,,,,"Mon - Sun: 12:00 pm - 11:30 pm",,,"all major credit cards",,"Associated Banc-Corp Associated Bank NA ATM",https://www.associatedbank.com,"Specialties: Travelers Checks",,,,,,,,
17491797,2550216,"2020-09-27 06:37:54","Citizens Bank",http://www.citizensbank.com,,"(810) 487-0160","6452 W Pierson Rd",Flushing,MI,48433,"6452 W Pierson Rd,Flushing,MI 48433","Banks, ATM Locations, Loans, Mortgages",,,,43.06081,-83.81009,,,,"Mon - Fri: 7:00 am - 7:00 pm",,,"all major credit cards",,,http://www.citizensbank.com,,,,,,,,,
17491809,2550225,"2020-09-27 06:37:54","Citizens Bank",http://www.citizensbank.com,janetholleran@citizensbank.com,"(814) 234-6301","341 Science Park Rd Ste 201","State College",PA,16803,"341 Science Park Rd Ste 201,State College,PA 16803","Banks, ATM Locations, Loans, Mortgages",,,,40.77852,-77.89496,,,,,,,"all major credit cards",,,http://www.citizensbank.com,,,,,,,,,
17491817,2550230,"2020-09-27 06:37:54","Bank of America",https://www.bankofamerica.com,,"(509) 575-6733","201 N 40th Ave",Yakima,WA,98908,"201 N 40th Ave,Yakima,WA 98908","Banks, ATM Locations, Commercial & Savings Banks, Loans",,,,46.60011,-120.56154,https://i2.ypcdn.com/blob/3a79f235d7941cc9916f72ed93b9c38968b966b8_100x100_crop.jpg?f9d23e1,"LIFE'S BETTER WHEN WE'RE CONNECTED","Welcome to Bank of America in Yakima, WA, home to a variety of your financial needs including checking and savings accounts, online banking, mobile and text banking, student banking and credit cards. You have full access to your Bank of America accounts at any of our more than 5,000 banking centers nationwide. When you visit our financial centers, our knowledgeable associates and welcoming environment will make you feel at home.Easy access for everyone: Handicap accessible parking spaces, Handicap accessible restrooms and Braille signage (where available), Ramps in locations with steps, Easy-to-open doors, Handicap accessible safe deposit box rooms.","Mon - Thu: 9:30 am - 5:00 pm Fri: 9:30 am - 6:00 pm Sun: 9:30 am - 5:00 pm","Phone: (509) 961-5107 Fax Number: (509) 972-7616 Fax: (509) 972-7616 TollFree: (800) 432-1000",,"debit, master card, visa",,"Bank of America Financial Center Bank of America Mortgage",https://www.bankofamerica.com,,,,,,,,,
17491823,2550231,"2020-09-27 06:37:54","Towpath Credit Union",http://www.towpathcu.com,,"(330) 664-4700","2969 Smith Rd",Fairlawn,OH,44333,"2969 Smith Rd,Fairlawn,OH 44333","Credit Unions, ATM Locations, Banks, Commercial & Savings Banks, Financial Services, Loans, Mortgages, Real Estate Loans",,,A+,41.13636,-81.61683,https://i2.ypcdn.com/blob/a8416121503f86cf306e4e91895da204996841ec_100x100_crop.jpg?f9d23e1,"Proud of Our History, Excited About Our Future","Please Visit Our Web Site For More Information.","Mon - Tue: 9:00 am - 5:00 pm Wed: 10:00 am - 5:00 pm Thu - Fri: 9:00 am - 5:00 pm Sat: 9:00 am - 12:00 pm",,,,,,http://www.towpathcu.com,"Parking: Lot",,,,,,,,
17491830,2550233,"2020-09-27 06:37:54","Bank of America",https://www.bankofamerica.com,,"(407) 654-6576","13910 County Road 455",Clermont,FL,34711,"13910 County Road 455,Clermont,FL 34711","Banks, ATM Locations, Commercial & Savings Banks, Loans",,,,28.54757,-81.68227,https://i2.ypcdn.com/blob/e5c606a0e1b89adf65d960acae973aab8099fd04_100x100_crop.jpg?f9d23e1,"LIFE'S BETTER WHEN WE'RE CONNECTED","Welcome to Bank of America in Clermont, FL, home to a variety of your financial needs including checking and savings accounts, online banking, mobile and text banking, student banking and credit cards. You have full access to your Bank of America accounts at any of our more than 5,000 banking centers nationwide. When you visit our financial centers, our knowledgeable associates and welcoming environment will make you feel at home.Easy access for everyone: Handicap accessible parking spaces, Handicap accessible restrooms and Braille signage (where available), Ramps in locations with steps, Easy-to-open doors, Handicap accessible safe deposit box rooms.","Sun:- Mon:9-4 Tue:9-4 Wed:9-4 Thu:9-4 Fri:9-5 Sat:-","Fax: (407) 877-1837 Fax Number: (407) 877-1837 TollFree: (800) 432-1000",,"debit, master card, visa",,"Bank of America Financial Center ATM Bank of America",https://www.bankofamerica.com,,,,,,,,,
17491834,2550234,"2020-09-27 06:37:54","Bank of America Financial Center",https://www.bankofamerica.com,,"(951) 929-8614","1687 E Florida Ave",Hemet,CA,92544,"1687 E Florida Ave,Hemet,CA 92544","Banks, ATM Locations, Commercial & Savings Banks, Loans",,,,33.74707,-116.95485,https://i2.ypcdn.com/blob/3a79f235d7941cc9916f72ed93b9c38968b966b8_100x100_crop.jpg?f9d23e1,"LIFE'S BETTER WHEN WE'RE CONNECTED","Welcome to Bank of America in Hemet, CA, home to a variety of your financial needs including checking and savings accounts, online banking, mobile and text banking, student banking and credit cards. You have full access to your Bank of America accounts at any of our more than 5,000 banking centers nationwide. When you visit our financial centers, our knowledgeable associates and welcoming environment will make you feel at home.Easy access for everyone: Handicap accessible parking spaces, Handicap accessible restrooms and Braille signage (where available), Ramps in locations with steps, Easy-to-open doors, Handicap accessible safe deposit box rooms.","Sun:- Mon:9-6 Tue:9-6 Wed:9-6 Thu:9-6 Fri:9-6 Sat:9-2","Fax Number: (951) 652-2552 Fax: (951) 652-2552 TollFree: (800) 432-1000",,"master card, visa, all major credit cards, debit",,,https://www.bankofamerica.com,,,,,,,,,
17491841,2550236,"2020-09-27 06:37:54","Simmons Bank",http://simmonsbank.com,,"(866) 246-2400","1025 S Donaghey Ave",Conway,AR,72034,"1025 S Donaghey Ave,Conway,AR 72034","Commercial & Savings Banks, ATM Locations, Banks, Loans, Mortgages, Trust Companies",,,,35.06608,-92.45508,,,,,,,,,,"http://simmonsbank.com https://simmonsbank.com",,,,,,,,,
17491846,2550237,"2020-09-27 06:37:54","Chemical Bank",http://www.chemicalbankmi.com,Escalated.Case@ChemicalBankMI.com,"(989) 693-6441","5002 Center St",Fairgrove,MI,48733,"5002 Center St,Fairgrove,MI 48733","ATM Locations, Banks, Financial Planning Consultants, Retirement Planning Services",,,,43.512573,-83.583534,,,,"Mon - Fri: 1:00 am - 8:00 am","Phone: (989) 673-3184 TollFree: (800) 867-9757",,"master card, visa",,"Chemical Bank ATM Chemical Bank & Trust Co-Thumb Region","http://www.chemicalbankmi.com https://www.chemicalbank.com",,,,,,,,,
17491850,2550239,"2020-09-27 06:37:54","Bank of America",https://www.bankofamerica.com,john@halls.net,"(818) 997-4832","8324 Van Nuys Blvd","Panorama City",CA,91402,"8324 Van Nuys Blvd,Panorama City,CA 91402","Banks, ATM Locations, Commercial & Savings Banks, Loans",,,,34.22222,-118.44827,https://i2.ypcdn.com/blob/71bdd8e5f766ef48e0f6242ce90d3e2c01582fdd_100x100_crop.jpg?f9d23e1,"Life's better when we're connected.","Welcome to Bank of America in Panorama City, CA, home to a variety of your financial needs including checking and savings accounts, online banking, mobile and text banking, student banking and credit cards. You have full access to your Bank of America accounts at any of our more than 5,000 banking centers nationwide. When you visit our financial centers, our knowledgeable associates and welcoming environment will make you feel at home.Easy access for everyone: Handicap accessible parking spaces, Handicap accessible restrooms and Braille signage (where available), Ramps in locations with steps, Easy-to-open doors, Handicap accessible safe deposit box rooms.","Sun:- Mon:9-6 Tue:9-6 Wed:9-6 Thu:9-6 Fri:9-6 Sat:9-2","Phone: (818) 672-4069 Primary Phone: (818) 997-4835 Phone: (818) 424-4602 Primary Phone: (818) 672-4053 Phone: (818) 994-8200 Primary Phone: (818) 577-1130 Fax: (818) 672-4069 Fax Number: (818) 672-4069 TollFree: (800) 432-1000",,"debit, master card, visa",,"Bank of America Financial Center Bank of America Mortgage",https://www.bankofamerica.com,,,,,,,,,
17491855,2550241,"2020-09-27 06:37:54","Bank of America Financial Center",https://www.bankofamerica.com,info@flagman.com,"(860) 284-5130","240 W Main St",Avon,CT,06001,"240 W Main St,Avon,CT 06001","Banks, ATM Locations, Commercial & Savings Banks, Loans",,,,41.81285,-72.85202,https://i2.ypcdn.com/blob/3a79f235d7941cc9916f72ed93b9c38968b966b8_100x100_crop.jpg?f9d23e1,"LIFE'S BETTER WHEN WE'RE CONNECTED","Welcome to Bank of America in Avon, CT, home to a variety of your financial needs including checking and savings accounts, online banking, mobile and text banking, student banking and credit cards. You have full access to your Bank of America accounts at any of our more than 5,000 banking centers nationwide. When you visit our financial centers, our knowledgeable associates and welcoming environment will make you feel at home.Easy access for everyone: Handicap accessible parking spaces, Handicap accessible restrooms and Braille signage (where available), Ramps in locations with steps, Easy-to-open doors, Handicap accessible safe deposit box rooms.","Sun:- Mon:9-4 Tue:9-4 Wed:9-4 Thu:9-4 Fri:9-4 Sat:9-12","Phone: (860) 519-8921 Fax Number: (860) 507-0220 Fax: (860) 507-0220 TollFree: (800) 432-1000",,debit,,"Bank of America Mortgage",https://www.bankofamerica.com,,,,,,,,,
17491860,2550243,"2020-09-27 06:37:54","First National Bank",https://www.fnbo.com,,"(717) 814-5301","135 N George St",York,PA,17401,"135 N George St,York,PA 17401","Banks, ATM Locations, Loans, Mortgages",,,,39.96498,-76.72837,,,,"Mon - Sun: Open 24 Hours","Phone: (717) 650-2301",,"debit, all major credit cards",,"First National Bank ATM",https://www.fnbo.com,,,,,,,,,
17491866,2550244,"2020-09-27 06:37:54","First American Bank",,hsa@firstambank.com,"(708) 442-9600","15 Riverside Rd",Riverside,IL,60546,"15 Riverside Rd,Riverside,IL 60546","Commercial & Savings Banks, ATM Locations, Banks, Financial Services, Loans, Mortgages",,,,41.82698,-87.81841,https://i2.ypcdn.com/blob/096f0c52c2d01af8611ae07394f27eeae6077c83_100x100_crop.jpg?f9d23e1,,"Friendly professionals at First American Bank's branch at 15 Riverside Road in Riverside, IL, provide the answers and solutions you need. Open checking and savings accounts, apply for a mortgage or business loan, and much more at this location. Keep in mind, you also can manage your accounts anytime through Online and Mobile Banking.","Mon - Thu: 8:00 am - 5:00 pm Fri: 8:00 am - 6:00 pm Sat: 8:00 am - 1:00 pm Sun Closed",,,"all major credit cards",,,,"Parking: Lot, Free Wheelchair Accessible: Yes",,,,,,,,
17491873,2550246,"2020-09-27 06:37:54","First Financial Bank",http://www.bankatfirst.com,Adam.Kiefaber@bankatfirst.com,"(419) 636-6917","327 S Main St",Bryan,OH,43506,"327 S Main St,Bryan,OH 43506","Commercial & Savings Banks, ATM Locations, Banks, Financial Services, Investments, Loans",,,,41.47118,-84.55059,,,"First Financial Bank is a full-service financial institution headquartered in Cincinnati and operates in Ohio, Indiana and Kentucky. Its parent company is First Financial Bancorp (NASDAQ: FFBC)","Mon - Fri: 9:00 am - 5:00 pm Sat: 9:00 am - 12:00 pm","Fax: (419) 636-0876 TollFree: (877) 322-9530 TollFree: (877) 322-8100",,debit,,"ATM First Financial Bank ATM",http://www.bankatfirst.com,,,,,,,,,
17491885,2550250,"2020-09-27 06:37:54","Northwest Bank",http://www.snl.com/IRWeblinkX/branchdetails.aspx?iid=1137118&bankfacility=19088&Zip=44089&Street=&City=&State=,info@northwest.com,"(440) 967-3124","4455 Liberty Ave",Vermilion,OH,44089,"4455 Liberty Ave,Vermilion,OH 44089","Banks, ATM Locations, Commercial & Savings Banks, Loans, Mortgages",,,,41.42477,-82.34358,https://i2.ypcdn.com/blob/6f01c8d5d8ad4ae2e5b81d92a6105c3a06582be6_100x100_crop.jpg?f9d23e1,"Northwest Bank is a bank headquartered in Warren, Pennsylvania. It operates 172 branches in central",,"Mon - Thu: 9:00 am - 5:00 pm Fri: 9:00 am - 5:30 pm Sat: 9:00 am - 12:00 pm","Toll-Free: (877) 672-5678",,debit,,,"http://www.snl.com/IRWeblinkX/branchdetails.aspx?iid=1137118&bankfacility=19088&Zip=44089&Street=&City=&State= http://www.northwest.com",,,,,,,,,
17491894,2550253,"2020-09-27 06:37:54","City National Bank & Trust ATM",https://www.cnb1901.com,,"(918) 355-0029","3900 E Hillside Dr","Broken Arrow",OK,74014,"3900 E Hillside Dr,Broken Arrow,OK 74014","Commercial & Savings Banks, ATM Locations, Banks",,,,36.06491,-95.74307,,,,"Mon - Fri: 9:00 am - 7:00 pm Sat: 9:00 am - 4:00 pm","Phone: (918) 355-0040 Phone: (918) 355-0030 TollFree: (866) 385-3444",,,,,https://www.cnb1901.com,,,,,,,,,