business_x_category.id,business.id,business.ts,business.business_name,business.home_page,business.email_address,business.phone,business.street,business.city,business.state,business.zip_code,business.full_address,business.category,business.rating,business.number_of_reviews,business.bbb_rating_or_license,business.latitude,business.longitude,business.cover_image,business.slogan,business.general_info,business.regular_hours,business.extra_phones,business.services_products,business.payment,business.price_range,business.aka,business.other_links,business.other_information,business.review_1_name,business.review_1_date,business.review_1_rating,business.review_1_text,business.review_2_name,business.review_2_date,business.review_2_rating,business.review_2_text
1275801,408368,"2020-09-27 03:10:05","Randell Construction LLP",http://randellconstruction.com,robert@randellconstruction.com,"(208) 423-4268","3952 N 3600 E",Kimberly,ID,83341,"3952 N 3600 E,Kimberly,ID 83341","General Contractors, Altering & Remodeling Contractors, Basement Contractors, Building Contractors-Commercial & Industrial, Concrete Contractors, Construction Consultants, Deck Builders, Demolition Contractors, Excavation Contractors, Foundation Contractors, Garages-Building & Repairing, Grading Contractors, Home Builders, Insulation Contractors, Metal Buildings, Patio Builders, Septic Tanks & Systems, Steel Erectors",,,A+,42.57022,-114.34385,,,,,,,,,"Randell Robert",http://randellconstruction.com,"Specialties: Septic Systems, Irrigation, Driveways, Ponds Services: Septic Tanks",,,,,,,,
1277214,408765,"2020-09-27 03:10:05","Hearn Construction",http://www.hearnconstructioninc.com,steve@hearnconstructioninc.com,"(765) 416-1204","816 Millbrook Ln",Kokomo,IN,46901,"816 Millbrook Ln,Kokomo,IN 46901","Building Contractors, Altering & Remodeling Contractors, Basement Contractors, Bathroom Remodeling, Building Contractors-Commercial & Industrial, Building Maintenance, Buildings-Pole & Post Frame, Cabinet Makers, Cabinets, Foundation Contractors, General Contractors, Home Improvements, Home Repair & Maintenance, Kitchen Planning & Remodeling Service, Metal Buildings, Real Estate Management, Steel Fabricators, Steel Processing, Water Damage Emergency Service",,,,40.47853,-86.15111,,,"Hearn Construction, Inc. offers commercial construction and home improvement services in Kokomo, Lafayette, Muncie, South Bend, Rochester, Noblesville and Indianapolis IN.","Mon - Fri: 7:00 am - 5:00 pm",,,,,,http://www.hearnconstructioninc.com,,,,,,,,,
1277300,408792,"2020-09-27 03:10:05","Feller Construction Inc",http://fellerconstruction.com,fellerconstruction@gmail.com,"(417) 257-7275","829 E Main St","West Plains",MO,65775,"829 E Main St,West Plains,MO 65775","General Contractors, Altering & Remodeling Contractors, Basement Contractors, Bathroom Remodeling, Building Construction Consultants, Building Contractors, Building Contractors-Commercial & Industrial, Concrete Contractors, Construction Consultants, Construction Management, Deck Builders, Deck Cleaning & Treatment, Door Repair, Doors, Frames, & Accessories, Home Builders, Kitchen Planning & Remodeling Service, Metal Buildings, Painting Contractors, Patio Builders, Real Estate Developers, Siding Contractors, Steel Erectors, Sunrooms & Solariums, Windows-Repair, Replacement & Installation",,,A+,36.728416,-91.87168,,,,,"Phone: (417) 256-9622 Fax: (417) 256-9622",,,,,http://fellerconstruction.com,"Specialties: Metal Buildings",,,,,,,,
1281888,410073,"2020-09-27 03:10:15","Zarecky's Midwest Construction",http://www.redi-rock.com,,"(605) 224-6345","1000 N Garfield Ave",Pierre,SD,57501,"1000 N Garfield Ave,Pierre,SD 57501","General Contractors, Altering & Remodeling Contractors, Apartment Finder & Rental Service, Basement Contractors, Bathroom Remodeling, Building Construction Consultants, Building Contractors, Building Contractors-Commercial & Industrial, Building Specialties, Carpenters, Concrete Blocks & Shapes, Concrete Contractors, Construction Consultants, Deck Builders, Door Repair, Electricians, Flooring Contractors, Foundation Contractors, Home Builders, Home Design & Planning, Home Improvements, Insulation Contractors, Kitchen Planning & Remodeling Service, Landscape Contractors, Landscape Designers & Consultants, Masonry Contractors, Masonry Contractors-Commercial & Industrial, Metal Buildings, Patio Builders, Real Estate Developers, Real Estate Management, Siding Contractors, Stamped & Decorative Concrete, Steel Erectors",,,A+,44.37842,-100.31564,,,,"Mon - Fri: 9:00 am - 5:00 pm","Phone: (605) 224-9151 Phone: (605) 223-4409 Phone: (651) 773-1287 Fax: (605) 224-9151",,,,"MidWest Construction & Development Midwest Construction, Inc.","http://www.redi-rock.com http://www.zmidwest.com",,,,,,,,,
1281931,410077,"2020-09-27 03:10:15","Goddard Construction Company",http://www.goddardconstruction.com,office@goddardconstruction.com,"(615) 773-4440","9695 Lebanon Rd Ste 400","Mount Juliet",TN,37122,"9695 Lebanon Rd Ste 400,Mount Juliet,TN 37122","General Contractors, Altering & Remodeling Contractors, Basement Contractors, Bathroom Remodeling, Building Construction Consultants, Building Contractors, Building Contractors-Commercial & Industrial, Building Specialties, Carpenters, Construction Consultants, Construction Management, Garages-Building & Repairing, Home Builders, Home Improvements, Kitchen Planning & Remodeling Service, Steel Erectors, Sunrooms & Solariums",2,"1 Review",A+,36.23053,-86.48636,,,,"Mon - Fri: 8:00 am - 4:30 pm","Phone: (615) 758-5342",,,,"Goddard Contruction Goddard Construction Company, LLC Cleary Construction",http://www.goddardconstruction.com,,gwyneth72,"Edited: 08/23/2016",two,"WARNING!!! This company is price gouging!!! We had them price a small bathroom remodel and they came in over twice as much as other people we checked with. The only thing positive I can say about them is that they do answer their phone and setting up an estimate with them was very fast... but I guess I would answer the phone quickly too if I was making that much money doing minor remodeling. When confronted,they don't deny that their prices are higher than other contractors .... their excuse for being so expensive is that they do quality work and that they are insured... Stay away from these guys...",,,,
1282870,410331,"2020-09-27 03:10:15","J A Lyden Construction Co Inc",,info@bbbnebraska.org,"(785) 286-1427","3825 NW Button Rd",Topeka,KS,66618,"3825 NW Button Rd,Topeka,KS 66618","General Contractors, Altering & Remodeling Contractors, Basement Contractors, Bathroom Remodeling, Building Construction Consultants, Building Contractors, Building Specialties, Construction Consultants, Deck Builders, Deck Cleaning & Treatment, Kitchen Planning & Remodeling Service, Metal Buildings, Roofing Contractors, Siding Contractors, Steel Erectors",,,,39.11508,-95.70653,,,,,"Phone: (785) 286-2384",,,,"Lyden J A Construction Co Inc",,,,,,,,,,
1283536,410515,"2020-09-27 03:10:15","Home Check Plus",http://www.dalegruberconstruction.com,g-dale@dalegruberconstruction.com,"(320) 529-4800","120 Osseo Ave N","Saint Cloud",MN,56303,"120 Osseo Ave N,Saint Cloud,MN 56303","General Contractors, Altering & Remodeling Contractors, Basement Contractors, Bathroom Remodeling, Building Construction Consultants, Building Contractors, Building Contractors-Commercial & Industrial, Building Specialties, Carpenters, Concrete Contractors, Deck Builders, Door Repair, Drywall Contractors, Fence Materials, Fence-Sales, Service & Contractors, Fireplaces, Flooring Contractors, Gutters & Downspouts, Handyman Services, Home Builders, Home Improvements, Home Repair & Maintenance, Insulation Contractors, Kitchen Planning & Remodeling Service, Landscape Contractors, Masonry Contractors, Masonry Contractors-Commercial & Industrial, Metal Buildings, Painting Contractors, Patio Builders, Real Estate Inspection Service, Siding Contractors, Steel Erectors, Tile-Contractors & Dealers, Windows-Repair, Replacement & Installation",,,A+,45.55542,-94.17591,,,"Dale Gruber Construction was founded by Dale Gruber in 1983, specializing in all types of construction. After receiving his degree in carpentry from St. Cloud Technical College and then working ten years in the field, his entrepreneurial spirit lead him to start his own business. With the desire to thrive in an industry that is full of many rewards, Dale wanted to be a leader in building for the future.","Mon - Fri: 7:30 am - 5:00 pm","Phone: (320) 251-4956 Phone: (320) 251-3690 Primary Phone: (320) 251-4956 Fax: (320) 251-3690 TollFree: (877) 251-4956 TollFree: (800) 615-4956",,,,"Dale Gruber Construction Home Check Plus Inc Gruber Dale Construction Dale Gruber's Home Check Plus","http://www.dalegruberconstruction.com http://www.homecheckplus.com",,,,,,,,,
1287883,411773,"2020-09-27 03:10:22","Woodchips Construction, Inc.",http://www.woodchipsconstruction.com,woodchips02@gmail.com,"(845) 744-3803",,,,,,"General Contractors, Altering & Remodeling Contractors, Basement Contractors, Building Construction Consultants, Building Contractors, Building Specialties, Carpenters, Construction Management, Deck Builders, Demolition Contractors, Drainage Contractors, Excavation Contractors, Garages-Building & Repairing, Handyman Services, Heating Contractors & Specialties, Home Builders, Kitchen Planning & Remodeling Service, Landscape Designers & Consultants, Real Estate Developers, Roofing Contractors, Siding Contractors, Steel Erectors, Waterproofing Contractors",,,,,,https://i3.ypcdn.com/blob/f8e894def9121ed9181071d60a03270ddcfe40a1_100x100_crop.jpg?63f80dd,,"We are a company that provides construction contractor services in the Pine Bush, NY area and surrounding communities. We are a top rated excavation service provider and offer professional new construction, renovations, and custom home building. Our other specialties are: Spray Foam Insulation Remodeler Contractor We have an extensive background in providing thorough remodeling project planning, total quality management, and above all teamwork with our clients. With this knowledge base we achieve the safe and successful completion of our construction projects. Schedule us today for any type of concrete services, landscaping, and demolition.","Mon - Fri: 8:00 am - 5:00 pm",,,"amex, cash, check, discover, master card, visa",,,http://www.woodchipsconstruction.com/,"Services: Furnace Repair, Basement Remodeling, Handyman, Kitchen Remodeling, Basement Waterproofing, Asphalt Shingle Installation, Vinyl Siding Installation",,,,,,,,
1289342,412201,"2020-09-27 03:10:23","J.R. Fulmer & Son's, Inc",http://fulmerconstruction.net,contact@fulmerconstruction.net,"(717) 786-9749","460 Cinder Rd","New Providence",PA,17560,"460 Cinder Rd,New Providence,PA 17560","General Contractors, Altering & Remodeling Contractors, Basement Contractors, Bathroom Remodeling, Building Construction Consultants, Building Contractors, Building Contractors-Commercial & Industrial, Building Specialties, Cabinets, Carpenters, Construction Consultants, Construction Management, Deck Builders, Demolition Contractors, Drywall Contractors, Garages-Building & Repairing, Home Design & Planning, Home Improvements, Kitchen Planning & Remodeling Service, Plastering Contractors, Residential Designers, Roofing Contractors, Siding Contractors, Steel Erectors, Sunrooms & Solariums",,,A+,39.8938,-76.21024,,,,,,,,,,http://fulmerconstruction.net,"Services: Roof Decks, Wood Siding Installation, Basement Remodeling, Cabinet Refacing, Disability Remodeling, Kitchen Remodeling, Sun Rooms, Cabinet Installation",,,,,,,,
1297861,414603,"2020-09-27 03:10:41","Otte Construction Company",http://www.otteconstruction.com,kmoje@otteconstruction.com,"(402) 375-2180","521 Centennial Rd",Wayne,NE,68787,"521 Centennial Rd,Wayne,NE 68787","General Contractors, Altering & Remodeling Contractors, Basement Contractors, Bathroom Remodeling, Building Construction Consultants, Building Contractors, Building Contractors-Commercial & Industrial, Concrete Contractors, Construction Consultants, Doors, Frames, & Accessories, Home Builders, Home Improvements, Kitchen Planning & Remodeling Service, Masonry Contractors, Masonry Contractors-Commercial & Industrial, Metal Buildings, Real Estate Developers, Siding Contractors, Steel Erectors, Windows-Repair, Replacement & Installation",,,A+,42.23433,-96.99752,,,,"Mon - Fri: 8:00 am - 5:00 pm","Fax: (402) 375-3123 Fax Number: (402) 375-3123",,,,"Otte Construction Inc","http://www.otteconstruction.com https://www.otteconstruction.com",,,,,,,,,
1300456,415326,"2020-09-27 03:10:42","Ims Construction",http://www.imsconstructionbuild.com,imsconstructionbuild@gmail.com,"(406) 892-2415","1072 Mt Highway 206","Columbia Falls",MT,59912,"1072 Mt Highway 206,Columbia Falls,MT 59912","General Contractors, Altering & Remodeling Contractors, Basement Contractors, Bathroom Remodeling, Building Construction Consultants, Building Contractors, Building Contractors-Commercial & Industrial, Construction Consultants, Construction Management, Home Builders, Home Design & Planning, Home Improvements, Kitchen Planning & Remodeling Service, Metal Buildings, Steel Erectors",,,A+,48.2627,-114.16443,,,,,"Primary Phone: (406) 892-3215",,,,"IMS Construction, Inc.","http://www.imsconstructionbuild.com https://imsconstructionbuild.com","Services: Bathroom Remodeling, Pond Construction",,,,,,,,
1300614,415368,"2020-09-27 03:10:42","Battistelli Alan Building Contractors",http://www.alanbattistelli.com,info@alanbattistelli.com,"(978) 999-0003","57 Phillips Ave",Rockport,MA,01966,"57 Phillips Ave,Rockport,MA 01966","Building Contractors, Altering & Remodeling Contractors, Basement Contractors, Building Designers, Cabinets, Construction Consultants, Deck Builders, Flooring Contractors, General Contractors, Home Builders, Insulation Contractors, Masonry Contractors-Commercial & Industrial, Metal Buildings, Residential Designers, Siding Contractors, Steel Erectors, Sunrooms & Solariums",,,A+,42.68495,-70.62105,,"Serving Cape Ann Since 1979.","Alan Battistelli specializes in custom designed and built homes, renovations, additions, and whole-house reconstruction. For 30 years, Alan Battistelli and his team have been building peoples dreams here on Cape Ann. In custom homes and imaginative remodels, Alan knows that superior craftsmanship is a requirement, and on that he's built his reputation.","Mon - Fri: 8:00 am - 5:00 pm",,,,,,http://www.alanbattistelli.com,"Services: Kitchen Remodeling",,,,,,,,
1301494,415604,"2020-09-27 03:10:42","Fay Construction",,fay_construction@yahoo.com,"(815) 224-3778","1722 12th St",Peru,IL,61354,"1722 12th St,Peru,IL 61354","General Contractors, Altering & Remodeling Contractors, Asphalt Paving & Sealcoating, Basement Contractors, Bathroom Remodeling, Building Construction Consultants, Building Contractors, Building Contractors-Commercial & Industrial, Building Specialties, Carpenters, Carports, Ceilings-Supplies, Repair & Installation, Concrete Contractors, Construction Management, Deck Builders, Deck Cleaning & Treatment, Demolition Contractors, Door Repair, Drywall Contractors, Excavation Contractors, Fireplaces, Floor Materials, Flooring Contractors, Foundation Contractors, Garages-Building & Repairing, Gazebos, Gutters & Downspouts, Heating Contractors & Specialties, Home Builders, Home Improvements, Home Repair & Maintenance, Kitchen Planning & Remodeling Service, Lawn & Garden Furnishings, Masonry Contractors, Masonry Contractors-Commercial & Industrial, Paint Removing, Painting Contractors, Plastering Contractors, Road Building Contractors, Roofing Contractors, Roofing Services Consultants, Shutters, Siding Contractors, Stair Builders, Stamped & Decorative Concrete, Steel Erectors, Storm Shelters, Sunrooms & Solariums, Waterproofing Contractors, Windows-Repair, Replacement & Installation",,,,41.33464,-89.12866,,,,"Mon - Fri: 7:30 am - 4:30 pm",,,,,,,"Specialties: Foundations, Patios, Garages, Driveways Services: Basement Remodeling, Bathroom Remodeling, Carport Construction, Kitchen Remodeling, Sun Rooms, Tuck-Pointing, Fireplace Repair, Block Wall Installation, Install Retaining Walls, Stone Wall Repair, Concrete Pumping, Concrete Foundation Installation, Concrete Delivery, Concrete Removal, Concrete Stamping, Install Poured Concrete Walls, Repair Poured Concrete Walls, Stamped Concrete Walls, Concrete Sealing, Window Repair, Storm Window Repair, Pool Enclosures, Patio & Deck Cleaning & Restoration, Tank Removal, Faux Finishes, Textured Painting, Trompe L'oeil, Paint Removal, Ceilings, Rain Gutters, Asbestos Siding Repair, Asphalt Shingle Installation, Flat Roof Installation, Install Composite Roofs, Install Copper Gutters, Install Galvanized Gutters, Install Metal Siding, Install PVC Gutters, Install Seamless Metal Gutters, Install Slate Roofs, Liquid Siding Application, Metal Roof Repair, Paint Metal Roofing, Repair Copper Gutters, Repair Galvanized Gutters, Repair Metal Siding, Repair PVC Gutters, Repair Seamless Metal Gutters, Roof Repair, Roof Sealant Application, Slate Roof Repair, Tile Roof Installation, Tile Roof Repair, Vinyl Siding Installation, Vinyl Siding Repair, Wood Gutter Installation, Wood Gutter Repair, Wood Siding Installation, Wood Siding Repair, Basement Waterproofing, Tank Installation, Window Replacement, Garage Door Repair, Door Hanging",,,,,,,,
1302230,415802,"2020-09-27 03:10:42","Haselhorst Construction Inc",http://www.haselhorstconstruction.com,glennofhci@hotmail.com,"(785) 625-3466","2900 E 8th St",Hays,KS,67601,"2900 E 8th St,Hays,KS 67601","General Contractors, Altering & Remodeling Contractors, Basement Contractors, Bathroom Remodeling, Building Construction Consultants, Building Contractors, Building Contractors-Commercial & Industrial, Building Specialties, Concrete Contractors, Construction Consultants, Fireplaces, Foundation Contractors, Garages-Building & Repairing, Home Builders, Home Improvements, Insulation Contractors, Kitchen Planning & Remodeling Service, Metal Buildings, Patio Builders, Plumbers, Real Estate Developers, Roofing Contractors, Roofing Services Consultants, Skylights, Steel Erectors",1,"1 Review",A+,38.85706,-99.2876,,,,"Mon - Fri: 7:00 am - 5:00 pm","Phone: (785) 259-4159 Phone: (785) 625-4798 Phone: (785) 639-1186 MobilePhone: (785) 623-0211 Fax: (785) 625-4798",,,,,"http://www.haselhorstconstruction.com https://www.haselhorstconstruction.com","Specialties: Home Additions, Commercial, Business, Wells, Residential, Homebuilding, Roofing, Structures, Buildings, Custom Homes, Metallic Buildings",trussmonkey,09/08/2008,one,"when laborers pose as carpenters and have never taken any formal training you get haselhorst construction. They build lazily fast which takes longer than going slow. Their studs don't stack and they are unsafe on the job site. They believe that local laws and codes don't apply to them. Their contract in Anchorage Alaska continually fails inspection. They have no respect for anyone or anything. They will do what they can to charge you $100,000 too much for your framing job.",,,,
1306809,417121,"2020-09-27 03:10:58","Ainsworth-Benning Constr Inc",http://www.ainsworthbenning.com,,"(605) 642-4716","345 Industrial Dr",Spearfish,SD,57783,"345 Industrial Dr,Spearfish,SD 57783","General Contractors, Altering & Remodeling Contractors, Basement Contractors, Building Construction Consultants, Building Contractors, Building Specialties, Construction Consultants, Metal Buildings, Steel Erectors",,,,44.48312,-103.80432,,,"Ainsworth-Benning Construction is engaged in the construction of commercial and residential buildings. It also provides solutions for the heavy highway and land development industries. The company serves clients in South Dakota. Ainsworth-Benning Construction works with a team of more than 100 staff members. The company has undertaken projects for the South Dakota Army National Guard Readiness Center, Rapid City Regional Hospital, Spearfish, Latchstring Restaurant, Spearfish City Hall, First National Bank, and Spearfish Regional Hospital & Clinic.","Mon - Fri: 7:00 am - 5:00 pm","Phone: (605) 321-5661 Phone: (605) 375-3933 Fax Number: (605) 642-7887 Fax: (605) 642-7887",,,,"Ainsworth-Benning Construction Ainsworth-Benning Construction Inc Ainsworth Benning Const Inc Ainsworth-Benning Construction, A Journey Group Company","http://www.ainsworthbenning.com https://journeyconstruction.com/divisions/ainsworth-benning-construction",,,,,,,,,
1306853,417135,"2020-09-27 03:10:58","Schnacker Construction",,tschnacker@schnackerconstruction.com,"(785) 845-3706",,Meriden,KS,66512,"Meriden,KS 66512","General Contractors, Altering & Remodeling Contractors, Basement Contractors, Bathroom Remodeling, Building Construction Consultants, Building Contractors, Building Contractors-Commercial & Industrial, Building Specialties, Cabinets, Carpenters, Carports, Construction Management, Deck Builders, Deck Cleaning & Treatment, Garages-Building & Repairing, Gazebos, Home Builders, Kitchen Planning & Remodeling Service, Steel Erectors, Sunrooms & Solariums, Windows-Repair, Replacement & Installation",,,A+,,,,,,"Mon - Fri: 10:00 am - 6:00 pm Sat: 10:00 am - 4:00 pm",,,,,,,"Services: Patio & Deck Cleaning & Restoration, Window Replacement, Door Hanging, Cabinet Installation, Basement Remodeling, Bathroom Remodeling, Carport Construction, Disability Remodeling, Kitchen Remodeling, Sun Rooms",,,,,,,,
1308115,417515,"2020-09-27 03:10:58","Allied Property Solutions Inc",,,"(802) 763-8808","192 Chelsea St","South Royalton",VT,05068,"192 Chelsea St,South Royalton,VT 05068","General Contractors, Altering & Remodeling Contractors, Basement Contractors, Bathroom Remodeling, Building Construction Consultants, Building Contractors, Building Contractors-Commercial & Industrial, Building Specialties, Cabinet Makers, Cabinets, Cabinets-Refinishing, Refacing & Resurfacing, Carpenters, Carports, Ceilings-Supplies, Repair & Installation, Closets Designing & Remodeling, Concrete Contractors, Construction Management, Deck Builders, Deck Cleaning & Treatment, Demolition Contractors, Fence-Sales, Service & Contractors, Fire & Water Damage Restoration, Foundation Contractors, Garages-Building & Repairing, Gazebos, Handyman Services, Home Builders, Home Design & Planning, Home Improvements, Home Repair & Maintenance, Kitchen Planning & Remodeling Service, Landscape Contractors, Masonry Contractors, Masonry Contractors-Commercial & Industrial, Patio Builders, Real Estate Developers, Real Estate Inspection Service, Roofing Contractors, Roofing Services Consultants, Shutters, Siding Contractors, Skylights, Stair Builders, Steel Erectors, Sunrooms & Solariums, Tree Service, Water Damage Restoration, Waterproofing Contractors, Windows-Repair, Replacement & Installation",,,,43.8205,-72.52166,,,,"Mon - Sun: 7:00 am - 7:00 pm",,,,,"Allied Property Solutions Incorporated",,"Services: Install Retaining Walls, Concrete Foundation Installation, Wood Siding Installation, Install Composite Roofs, Install Metal Siding, Metal Roof Repair, Install Slate Roofs, Roof Repair, Ceilings, Skylight Installation, Tile Roof Installation, Vinyl Siding Installation, Roofing Inspections, Asphalt Shingle Installation, Kitchen Remodeling, Handyman, Fire Damage Restoration, Disability Remodeling, Closet Organization, Carport Construction, Cabinet Refacing, Bathroom Remodeling, Basement Remodeling, Sun Rooms, Water Damage Restoration, Garage Door Repair, Cabinet Installation, Door Hanging, Window Replacement, Basement Waterproofing, Pool Enclosures, Patio & Deck Cleaning & Restoration, Tree Consultants",,,,,,,,