business_x_category.id,business.id,business.ts,business.business_name,business.home_page,business.email_address,business.phone,business.street,business.city,business.state,business.zip_code,business.full_address,business.category,business.rating,business.number_of_reviews,business.bbb_rating_or_license,business.latitude,business.longitude,business.cover_image,business.slogan,business.general_info,business.regular_hours,business.extra_phones,business.services_products,business.payment,business.price_range,business.aka,business.other_links,business.other_information,business.review_1_name,business.review_1_date,business.review_1_rating,business.review_1_text,business.review_2_name,business.review_2_date,business.review_2_rating,business.review_2_text
17129,7349,"2020-09-27 02:31:06","Events By Kat",,,"(314) 640-8522",,"Saint Louis",MO,63122,"Saint Louis,MO 63122","Marketing Programs & Services, Beverages-Distributors & Bottlers, Marketing Consultants, Modeling Agencies",,,,,,,,,,,,,,,,,,,,,,,,
334960,110616,"2020-09-27 02:40:53","Sunrise Cash & Carry",,,"(919) 650-3075","2900 Perimeter Park Dr. Ste100",Morrisville,NC,27560,"2900 Perimeter Park Dr. Ste100,Morrisville,NC 27560","Cigar, Cigarette & Tobacco-Wholesale & Manufacturers, Beverages-Distributors & Bottlers, Paper Products, T-Shirts-Wholesale & Manufacturers, Variety Store Merchandise-Wholesale",,,,35.84581,-78.83385,,,,"Mon - Fri: 8:00 am - 5:30 pm Sat: 10:00 am - 4:00 pm Sun Closed",,,"all major credit cards, visa, discover, mastercard, check, amex",,,,,,,,,,,,
343055,113024,"2020-09-27 02:41:10","C R Frank Popcorn and Supply Co",http://www.crfrankpopcorn.com,,"(314) 731-4500","5757 N Lindbergh Blvd",Hazelwood,MO,63042,"5757 N Lindbergh Blvd,Hazelwood,MO 63042","Candy & Confectionery, Beverages, Beverages-Distributors & Bottlers, Carnival Supplies, Concession Supplies & Concessionaires, Dessert Restaurants, Food Processing Equipment & Supplies, Gas-Industrial & Medical-Cylinder & Bulk, Ice Cream & Frozen Desserts, Ice Making Equipment & Machines, Paper Manufacturers, Paper Products, Popcorn & Popcorn Supplies, Restaurants",,,,38.76191,-90.37255,https://i3.ypcdn.com/blob/acd938f8014baa0ad0fa9151cdeac8aa692d40fb_100x100_crop.jpg?63f80dd,"Select Foods, The Gift of Good, Taste Call to Order Today!",,"Mon - Fri: 8:00 am - 4:30 pm Sat - Sun Closed","TollFree: (888) 280-2125",,"debit, all major credit cards",,"Select Drink,, Inc. C R Frank Popcorn","http://www.crfrankpopcorn.com Beverages, Fountain syrups, Coca Cola","Parking: Lot, Private Wheelchair Accessible: Yes",,,,,,,,
1376516,437294,"2020-09-27 03:12:46","Olde World Leaf & Ale",,,"(615) 373-6815","101 Creekside Xing",Brentwood,TN,37027,"101 Creekside Xing,Brentwood,TN 37027","Beer & Ale, Beverages-Distributors & Bottlers, Cigar, Cigarette & Tobacco Dealers",2,"1 Review",,36.03696,-86.79933,,,,"Mon - Sat: 10:00 am - 9:00 pm Sun: 12:00 pm - 6:00 pm",,,,,,,,andrewmurphy1,11/09/2011,two,"Owner is very rude siting in his office never say hello toot even talking to customers cigar selection is good prices is high beer selection is good",,,,
1378806,438012,"2020-09-27 03:12:53","Great Basin Beverage",,alanb95830@aol.com,"(775) 752-3326","534 Pacific Ave",Wells,NV,89835,"534 Pacific Ave,Wells,NV 89835","Beer & Ale-Wholesale & Manufacturers, Alcoholism Information & Treatment Centers, Beer & Ale, Beverages, Beverages-Distributors & Bottlers, Cigar, Cigarette & Tobacco Dealers, Water Companies-Bottled, Bulk, Etc, Wholesale Liquor, Wine, Wine Brokers",1,"1 Review",A+,41.110664,-114.98049,,,,"Mon - Fri: 8:00 am - 5:00 pm","Phone: (775) 752-3051 Fax: (775) 752-3051 TollFree: (800) 992-8002",,,,"Great Basin Beverage, LLC",,,granger4455,10/21/2008,one,"One Star would be generous This happens to be the """"worst distributor I have ever encountered. 8 Years ago you could get service their was a wonderful man that was the Branch Manager in Ely, for 25 years or longer who cared about his customers and gave excellent service. I heard later that they fired him for doing his job. We in Ely have never forgot this.That is why Alan Blach Jr. is failing in this market and will continue Money first than people that is his business strategy Maybe one day Coors/Miller Brewing Co Will Open There Eyes.",,,,
1380321,438488,"2020-09-27 03:12:54","Bellport Cold Beer & Soda",http://bellportbeer.com,Dave@BellportBeer.com,"(631) 286-0760","417 Station Rd",Bellport,NY,11713,"417 Station Rd,Bellport,NY 11713","Beer & Ale, Beer & Ale-Wholesale & Manufacturers, Beverages, Beverages-Distributors & Bottlers, Cigar, Cigarette & Tobacco Dealers, Restaurants",,,,40.77186,-72.94189,,,"Bellport Cold Beer & Soda Offers the Greatest Variety of Beers Around, Including the Widest Selection of Long Island Brews. See Us for Domestics, Imports, Craft Beers, and Much More! The largest selection of Gluten free and Non alcoholic beer. Serving Long Island since 1997.","Mon - Sat: 10:00 am - 8:00 pm Sun: 10:00 am - 6:00 pm",,,"cash, discover, master card, visa, diners club",,,http://bellportbeer.com/,"Wheelchair Accessible: Yes Parking: Lot, Private Bike Parking: Yes",,,,,,,,
1381596,438882,"2020-09-27 03:12:54","Dirt Cheap",http://www.ilovedirtcheap.com,,"(636) 282-7575","1200 Big Bill Rd",Arnold,MO,63010,"1200 Big Bill Rd,Arnold,MO 63010","Cigar, Cigarette & Tobacco Dealers, Beer & Ale, Beverages-Distributors & Bottlers, Discount Stores, Food Products-Wholesale, Liquor Stores, Pipes & Smokers Articles, Vape Shops & Electronic Cigarettes",,,,38.44303,-90.37728,,,,,,,,,"Dirt Cheap Cigarettes & Beer",http://www.ilovedirtcheap.com,,,,,,,,,
1395331,443219,"2020-09-27 03:13:22","Place I Liquors",,,"(270) 885-1321","2941 Fort Campbell Blvd",Hopkinsville,KY,42240,"2941 Fort Campbell Blvd,Hopkinsville,KY 42240","Beer & Ale, Beverages-Distributors & Bottlers, Cigar, Cigarette & Tobacco Dealers, Liquor Stores, Wine",3,"2 Reviews",,36.83532,-87.4758,,,,"Mon - Thu: 9:00 am - 10:00 pm Fri - Sat: 8:00 am - 12:00 am","Fax: (270) 885-7299 Fax: (270) 885-1321",,"all major credit cards, amex, diners club, discover, master card, visa",,"Place One",,"Parking: Free Wheelchair Accessible: Yes Specialties: All Occasions, Birthdays, Every Occasion","Crystal T.",12/23/2015,one,"Literally felt like I was being followed while in here. The salesmen would not leave me alone, I was asked 3 times if I needed help and the third time when I said I was just looking the guy wouldn't take no for an answer, so I left without buying anything.","Darcey M.",09/02/2013,five,"Great Service!! The employees are awesome!!"
1408239,447297,"2020-09-27 03:13:42","Beer Arena",http://www.beerarenagreensburg.comcastbiz.net,,"(724) 832-7362","332 Donohoe Rd",Greensburg,PA,15601,"332 Donohoe Rd,Greensburg,PA 15601","Beer & Ale-Wholesale & Manufacturers, Beer & Ale, Beverages, Beverages-Distributors & Bottlers, Cigar, Cigarette & Tobacco Dealers, Wine",,,,40.31336,-79.49069,,,"Beer Arena in Greensburg has the largest import and craft selection in Westmoreland County! We offer a huge variety of imports and specialty beers. We have a very extensive beer list, but if there's something you want that you don't see, please give us a call and let us know what we should get next!","Mon - Sat: 9:00 am - 9:00 pm Sun: 9:00 am - 5:00 pm",,,"all major credit cards, check, debit, discover, mastercard, amex, visa",,,http://www.beerarenagreensburg.comcastbiz.net,"Parking: Self, Free Wheelchair Accessible: Yes",,,,,,,,
1408306,447322,"2020-09-27 03:13:42","Woodman drivethru",,,"(937) 254-2224","1624 Woodman Dr",Dayton,OH,45432,"1624 Woodman Dr,Dayton,OH 45432","Beer & Ale, Beverages-Distributors & Bottlers, Cigar, Cigarette & Tobacco Dealers, Wine Bars",,,,39.7335,-84.12148,,,,"Mon - Sat: 9:00 am - 12:00 am Sun: 10:00 am - 11:00 pm",,,"mastercard, all major credit cards, discover, visa",,,,"Parking: Lot, Free Wheelchair Accessible: Yes",,,,,,,,
1411788,448412,"2020-09-27 03:13:47","Sudsy's Beer & Cigars",,info@sudsysabeerstore.com,"(412) 221-8081","3109 Washington Pike Ste 101",Bridgeville,PA,15017,"3109 Washington Pike Ste 101,Bridgeville,PA 15017","Beer & Ale, Beer & Ale-Wholesale & Manufacturers, Beverages-Distributors & Bottlers, Cigar, Cigarette & Tobacco Dealers, Liquor Stores",,,,40.34845,-80.11182,,,,"Mon - Thu: 9:00 am - 9:00 pm Fri - Sat: 9:00 am - 10:00 pm Sun: 10:00 am - 5:00 pm",,,"amex, discover",,"Sudsy's Beer Store",,"Wheelchair Accessible: Yes",,,,,,,,
1413743,449037,"2020-09-27 03:13:54","Red Land Beer & Soda Outlet",http://redlandbeer.com,redlandbeer@epix.net,"(717) 938-2979","601 Old York Rd",Etters,PA,17319,"601 Old York Rd,Etters,PA 17319","Beer & Ale-Wholesale & Manufacturers, Beer & Ale, Beverages, Beverages-Distributors & Bottlers, Cigar, Cigarette & Tobacco Dealers",,,,40.17193,-76.82793,https://i1.ypcdn.com/blob/f334a05945b44c4f025a6d23c369c0d65b373ee4_100x100_crop.jpg?f9d23e1,,"Local family-owned beer and soda distributor. In business for over 20 years!","Mon - Sat: 8:00 am - 11:00 pm Sun: 9:00 am - 7:00 pm",,,"check, debit",,,http://redlandbeer.com,"Parking: Street, Lot, Free Wheelchair Accessible: Yes Price Range : Average",,,,,,,,
1417791,450288,"2020-09-27 03:14:00","Waywood Beverage",,waywoodbeverage@gmail.com,"(610) 444-5222","624 Millers Hl","Kennett Square",PA,19348,"624 Millers Hl,Kennett Square,PA 19348","Beverages, Beer & Ale, Beer & Ale-Wholesale & Manufacturers, Beverages-Distributors & Bottlers, Cigar, Cigarette & Tobacco Dealers, Food Products, Grocery Stores, Ice, Liquor Stores, Pipes & Smokers Articles, Tobacco",,,,39.85236,-75.69803,https://i1.ypcdn.com/blob/5ef3af0ff80d81326280f826c9a2e0be7176410a_100x100_crop.jpg?f9d23e1,"BEER, CIDERS, SELTZERS, ALCOHOLIC SLUSHIES & MORE BEVERAGES","While at our store, you will find a large selection of beers from throughout the world, as well as a large selection of waters, sodas, teas, juices, energy drinks, nonalcoholic beers, and other beverages. We carry a very large quantity of ice at all times. Cups, snacks and other party needs are always plentiful as well. We also carry a selection of cigars and cigarettes. We are always willing to do what we can to bring in any product you request. Feel free to ask us about any product, beer or otherwise, you wish to have us bring in. Call us today!","Mon - Thu: 8:00 am - 8:00 pm Fri - Sat: 8:00 am - 9:00 pm Sun: 9:00 am - 5:00 pm",,,"master card, visa, amex, discover, debit",,,,"Parking: Lot, Private Price Range : Average",,,,,,,,
1419388,450779,"2020-09-27 03:14:00","Hometown Liquor & Company Store",http://hometownliquorwinstonor.com,htliquor29@gmail.com,"(541) 679-7925","390 SW Douglas Blvd",Winston,OR,97496,"390 SW Douglas Blvd,Winston,OR 97496","Beer & Ale, Beverages-Distributors & Bottlers, Cigar, Cigarette & Tobacco Dealers, Liquor Stores",,,,43.1199,-123.41962,,,"Welcome to Hometown Liquor & Company Store! We offer wine, liquor, beer, and tobacco products. We also offer Prison Blues apparel. Our employees will help you find what you need, and they will treat you with courtesy and respect. Family environment- all ages welcome! For more information, call us today!","Mon - Wed: 10:00 am - 7:00 pm Thu - Sat: 10:00 am - 8:00 pm Sun Closed",,,"visa, cash, debit, mastercard",,,"http://hometownliquorwinstonor.com http://ryano.net",,,,,,,,,
1422291,451721,"2020-09-27 03:14:04","Belmont Beverage Stores",https://www.belmontbev.com,contact@belmontbev.com,"(260) 424-4604","3309 N Anthony Blvd","Fort Wayne",IN,46805,"3309 N Anthony Blvd,Fort Wayne,IN 46805","Beer & Ale, Beverages-Distributors & Bottlers, Cigar, Cigarette & Tobacco Dealers, Liquor Stores, Wine",,,A+,41.10673,-85.11612,,,,"Mon - Fri: 8:00 am - 5:00 pm","Phone: (260) 424-3301 Phone: (260) 471-8588 Fax: (260) 424-3301",,"amex, cash, discover, master card, visa",,"Belmont Beverage Stores - Corporate Offices Belmont Beverage Stores of Indiana",https://www.belmontbev.com,,,,,,,,,
1427332,453320,"2020-09-27 03:14:21","Carlisle Beer N Cigar",http://business.carlislechamber.org,info@carlislechamber.org,"(717) 249-2434","770 South West Street",carlisle,PA,17013,"770 South West Street,carlisle,PA 17013","Beer & Ale, Beverages-Distributors & Bottlers, Cigar, Cigarette & Tobacco Dealers, Liquor Stores",,,,40.19189,-77.19546,,,,"Mon - Thu: 9:00 am - 9:00 pm Fri - Sat: 9:00 am - 10:00 pm Sun: 11:00 am - 6:00 pm",,,"visa, master card, discover",,,http://business.carlislechamber.org,"Wheelchair Accessible: Yes Parking: Lot, Private",,,,,,,,
1428514,453700,"2020-09-27 03:14:21","Luckie Pony Keg",https://www.facebook.com/luckiesponykeg,luckies@cinci.rr.com,"(513) 791-0581","8600 Blue Ash Rd",Cincinnati,OH,45242,"8600 Blue Ash Rd,Cincinnati,OH 45242","Beer & Ale, Beverages-Distributors & Bottlers, Tobacco, Wine Bars",4,"1 Review",,39.21563,-84.38653,,,,"Mon - Sun: 11:00 am - 12:00 am","Phone: (513) 781-0581",,"all major credit cards, amex, discover, visa, mastercard",,"Luckies Pony Keg",https://www.facebook.com/luckiesponykeg,"Parking: Lot, Free Bike Parking: Yes Wheelchair Accessible: Yes Price Range : Average",boyguy1200,02/20/2009,four,"Awesome selection of beverages with drive up service. Thought they were fast and very friendly.",,,,
1429366,453975,"2020-09-27 03:14:21","Brewers Outlet",http://brewersoutletmanor.com,dhenry8520@yahoo.com,"(717) 393-7471","1240 Millersville Pike",Lancaster,PA,17603,"1240 Millersville Pike,Lancaster,PA 17603","Beer & Ale, Beer & Ale-Wholesale & Manufacturers, Beverages, Beverages-Distributors & Bottlers, Cigar, Cigarette & Tobacco Dealers, Wholesale Liquor, Wine",5,"1 Review",,40.02775,-76.32615,,,,"Mon - Thu: 9:00 am - 9:00 pm Fri - Sat: 9:00 am - 10:00 pm Sun: 12:00 pm - 5:00 pm",,,,,,http://brewersoutletmanor.com,,"Dwight S.",05/01/2015,five,"Best damm prices and service in town !!!!!",,,,
1435870,455989,"2020-09-27 03:14:32","Dirt Cheap",http://www.ilovedirtcheap.com,,"(314) 869-7409","1401 Dunn Rd","Saint Louis",MO,63138,"1401 Dunn Rd,Saint Louis,MO 63138","Cigar, Cigarette & Tobacco Dealers, Beer & Ale, Beverages-Distributors & Bottlers, Cigar & Cigarette Accessories-Wholesale & Manufacturers, Discount Stores, Food Products-Wholesale, Liquor Stores, Pipes & Smokers Articles, Vape Shops & Electronic Cigarettes",,,,38.77039,-90.2176,https://i1.ypcdn.com/blob/c6fad9955f92dc5b3f74f12f33f310098d934111_100x100_crop.jpg?f9d23e1,,,"Mon - Sat: 8:00 am - 11:00 pm Sun: 9:00 am - 7:00 pm",,,"discover, check, debit, mastercard, amex, visa",,"Dirt Cheap Cigarettes Beer & Liquor",http://www.ilovedirtcheap.com,"Price Range : Below Average Bike Parking: No Wheelchair Accessible: Yes Parking: Lot, Free",,,,,,,,
1442716,458131,"2020-09-27 03:14:59","Tobacco And Beverage Outlet 3",,tobacconbeverage@aol.com,"(334) 239-7221","4220 Mobile Hwy",Montgomery,AL,36108,"4220 Mobile Hwy,Montgomery,AL 36108","Cigar, Cigarette & Tobacco Dealers, Beverages-Distributors & Bottlers",,,,32.33063,-86.34407,,,,"Mon - Thu: 8:00 am - 1:00 pm Fri - Sat: 8:00 am - 2:00 pm Sun: 8:00 am - 12:00 pm","Phone: (334) 239-7233",,"all major credit cards, amex, carte blanche, company card, diners club, discover, jcb, mastercard, visa",,"Tobacco & Beverage Outlet Tobacco 'N' Beverage Outlet 3",,,,,,,,,,
1443932,458527,"2020-09-27 03:14:59","Fishkill Beer and Soda",,,"(845) 897-5412","985 Main St",Fishkill,NY,12524,"985 Main St,Fishkill,NY 12524","Beer & Ale, Beverages, Beverages-Distributors & Bottlers, Cigar, Cigarette & Tobacco Dealers, Wine",,,,41.53168,-73.90788,,,,"Mon - Sat: 9:00 am - 9:00 pm Sun: 10:00 am - 6:00 pm","Phone: (845) 897-9807 Fax Number: (845) 897-9807 Fax: (845) 897-9807",,"all major credit cards",,,,"Wheelchair Accessible: Yes",,,,,,,,
1453127,461376,"2020-09-27 03:15:30","Exton Beverage Ctr",http://www.extonbeverage.com,extonbev@dplus.net,"(484) 713-4292","310 E Lincoln Hwy",Exton,PA,19341,"310 E Lincoln Hwy,Exton,PA 19341","Cigar, Cigarette & Tobacco Dealers, Beer & Ale, Beer & Ale-Wholesale & Manufacturers, Beverages, Beverages-Distributors & Bottlers, Ice, Liquor Stores, Restaurant Equipment & Supplies, Tobacco",,,,40.02847,-75.62134,,"Huge Selection of Imports, Microst Domestics! Lottery - Cigarettes - Kegs - Snacks","Welcome to Exton Beverage Company, Chester County, PA's premier beer store! Exton Beverage Company offers the largest selection of domestic, craft brewed and imported beers in the Chester County. Our staff is friendly and very knowledgeable. We are here to help you. Please take a few minutes to tour our website. We invite you to sign up as a member of www.extonbeverage.com . We hope our website will help you in making your beer purchases an exciting and rewarding experience. As a member, you will receive a monthly newsletter, special member only offers and unique announcements for the arrivals of new and hard to get beers.","Mon - Thu: 9:00 am - 9:00 pm Fri - Sat: 9:00 am - 10:00 pm Sun: 11:00 am - 6:00 pm",,,"discover, master card, visa, debit",,,"http://www.extonbeverage.com http://salondesante.com","Parking: Lot, Private Wheelchair Accessible: Yes Price Range : Average",,,,,,,,
1453547,461500,"2020-09-27 03:15:30","Montrose Beer & Soda",http://montrosebeerandsoda.com,montrosebeerandsoda@hotmail.com,"(914) 739-2211","2039 Albany Post Rd","Croton On Hudson",NY,10520,"2039 Albany Post Rd,Croton On Hudson,NY 10520","Beer & Ale, Beverages, Beverages-Distributors & Bottlers, Cigar, Cigarette & Tobacco Dealers",,,,41.23593,-73.91649,https://i2.ypcdn.com/blob/f9dd00a3bd6d1d4912703a8cae6d4e234c63bdaf_100x100_crop.jpg?f9d23e1,,"As a member of the Empire State Beer Distributor Association, with one of the largest selections of microbrew beers in Westchester county, we can supply almost any beverage that is available within New York State from our comprehensive inventory. We also provide complimentary (economical, convenient, courteous, and reliable) delivery to home, office or business ($100 minimum retail order - COD). We are still located at 2039 Albany Post Road, in Croton-on-Hudson, where we have been since 1984. Please call us at (914) 739-2211, with your order","Mon - Sat: 9:00 am - 7:00 pm Sun: 11:00 am - 5:00 pm",,,"amex, discover, cash, master card, visa",,,website,"Bike Parking: Yes Price Range : Average Wheelchair Accessible: Yes",,,,,,,,
1455533,462124,"2020-09-27 03:15:40","North End Distributors",,,"(610) 970-1877","1474 N Charlotte St",Pottstown,PA,19464,"1474 N Charlotte St,Pottstown,PA 19464","Beer & Ale-Wholesale & Manufacturers, Beer & Ale, Beverages, Beverages-Distributors & Bottlers, Cigar, Cigarette & Tobacco Dealers, Soda Fountain Shops",,,,40.26933,-75.62181,,"COLDEST BEER IN TOWN",,"Mon: 9:00 am - 9:00 pm Sat: 9:00 am - 9:00 pm Sun: 11:00 am - 5:00 pm",,,"amex, discover, mastercard, visa",,,,"Parking: Self",,,,,,,,
1456228,462339,"2020-09-27 03:15:40","Hazel's Beverage World",http://www.hazelsboulder.com,storemgr@hazelsworld.com,"(303) 447-1955","1955 28th St",Boulder,CO,80301,"1955 28th St,Boulder,CO 80301","Beverages-Distributors & Bottlers, Cigar, Cigarette & Tobacco Dealers, Liquor Stores, Wine",5,"1 Review",A+,40.02093,-105.25946,https://i1.ypcdn.com/blob/cd4280e6ab2de3d18ed41b772a3750e96bb7bf45_100x100_crop.jpg?f9d23e1,,,"Mon - Sun: 8:00 am - 11:30 pm","Phone: (303) 443-1524",,"all major credit cards",,,"http://www.hazelsboulder.com https://www.hazelsboulder.com/main.asp?request=SHOWCART&","Parking: Lot, Self, On Site, Free Bike Parking: Yes Wheelchair Accessible: Yes Price Range : Average","Bruce D.",08/19/2012,five,"If you can't find it here, you aren't going to find it anywhere. This place is seriously huge. A very modern, chic feel with an airplane theme, which is a little random for a liquor store but still kind of fun. For a beer guy like me, it's all about the cooler, and this one seems to have just about everything. My favorite is the make your own six pack so you can try new beers without committing to a whole six pack. Prices are very good if you sign up for the rewards card, not as good if don't. They had plenty of people working, mostly pretty young and still learning the ropes, but definitely eager to help. We only waited on one other person at checkout even though it was Saturday and the place was pretty packed. Major improvement over the other stores in Boulder.",,,,
1460737,463785,"2020-09-27 03:15:45","Dirt Cheap Cigarettes & Beer",,,"(314) 869-9779","1375 Dunn Rd","Saint Louis",MO,63138,"1375 Dunn Rd,Saint Louis,MO 63138","Cigar, Cigarette & Tobacco Dealers, Beer & Ale, Beverages-Distributors & Bottlers, Check Cashing Service, Liquor Stores, Pipes & Smokers Articles, Vape Shops & Electronic Cigarettes",,,,38.7698,-90.2159,https://i1.ypcdn.com/blob/b0109fb398b55cc2302b25de8f53beb820bed71c_100x100_crop.jpg?f9d23e1,,,,,,,,,,,,,,,,,,
1463419,464609,"2020-09-27 03:15:54","Dirt Cheap",http://www.ilovedirtcheap.com,,"(314) 845-7709","4359 Telegraph Rd","Saint Louis",MO,63129,"4359 Telegraph Rd,Saint Louis,MO 63129","Cigar, Cigarette & Tobacco Dealers, Beer & Ale, Beverages-Distributors & Bottlers, Discount Stores, Food Products-Wholesale, Liquor Stores, Pipes & Smokers Articles, Vape Shops & Electronic Cigarettes",,,,38.48641,-90.30418,,,,"Mon - Sat: 8:00 am - 11:00 pm Sun: 9:00 am - 7:00 pm",,,"all major credit cards",,"Dirt Cheap Cigarettes & Beer",http://www.ilovedirtcheap.com,"Wheelchair Accessible: Yes",,,,,,,,
1472890,467558,"2020-09-27 03:16:15","J J Distributors",http://www.jjdistributorsllc.com,info@fireplacedist.com,"(502) 442-7648","3415 Fern Valley Rd",Louisville,KY,40213,"3415 Fern Valley Rd,Louisville,KY 40213","Cigar, Cigarette & Tobacco-Wholesale & Manufacturers, Beverages-Distributors & Bottlers, Cigar, Cigarette & Tobacco Dealers, Food Products-Wholesale, General Merchandise-Wholesale, Wholesale Grocers",3,"2 Reviews",,38.15718,-85.69914,,,,"Mon - Fri: 7:00 am - 8:00 pm Sat - Sun: 8:00 am - 7:00 pm","Phone: (502) 962-1255",,,,,http://www.jjdistributorsllc.com,"Parking: Lot","Dunkin C.",01/03/2017,five,"Only company that Carry everything you need and open 7 days a week more product than any big company very good variety friendly people this is the kind of wholesale company we need that help small mom and pop store owners","Bigie J.",10/02/2016,one,"This is the worst place to go if you are in need of help to lift soda or find things. The boys in the store make fun of you and talk behind you in their language. I sent my wife to get sodas and asked the guy to help her but he flatly denied to help. He said they dont make that much of money in soda( that has nothing to do with the attitude). The other guy next to the cashier added that, if one can lift the body, should be able to lift the sodas. Is this how they deal with the female customers? It may not make any difference to them but we will never never go back there again."
1474262,467981,"2020-09-27 03:16:15","Beer & Beverage Of Town N Country",,,"(813) 884-5410","5523 Ambassador Dr",Tampa,FL,33615,"5523 Ambassador Dr,Tampa,FL 33615","Cigar, Cigarette & Tobacco Dealers, Beer & Ale, Beverages, Beverages-Distributors & Bottlers, Convenience Stores, Grocery Stores, Liquor Stores, Pipes & Smokers Articles, Wine",,,,27.99894,-82.56534,https://sapi.everyscape.com/XmlApi/Image.svc/Images/VSTHUMB/VS19103164_W287_H93,"Convenience Drive Thru...",,"Mon - Sat: 9:00 am - 9:00 pm Sun: 11:00 am - 7:00 pm",,,,,,,,,,,,,,,
1475443,468349,"2020-09-27 03:16:26","Zen Beer & Soda",http://www.zenbeersoda.com,abhi@zenbeersoda.com,"(610) 671-4991","823 W Sproul Rd",Springfield,PA,19064,"823 W Sproul Rd,Springfield,PA 19064","Beer & Ale, Beverages-Distributors & Bottlers, Cigar, Cigarette & Tobacco Dealers, Liquor Stores, Wholesale Liquor",,,,39.93893,-75.35,,"Customer service comes first","Premium retailer of craft lagers, IPAs, Stouts. Tastings every Friday.","Mon - Thu: 9:00 am - 10:00 pm Fri - Sat: 9:00 am - 11:00 pm Sun: 9:00 am - 8:00 pm",,,"debit, all major credit cards",,,"Zen Beer &amp.amp. Soda","Parking: Free, Private Bike Parking: Yes Wheelchair Accessible: Yes Price Range : Average",,,,,,,,