business_x_category.id,business.id,business.ts,business.business_name,business.home_page,business.email_address,business.phone,business.street,business.city,business.state,business.zip_code,business.full_address,business.category,business.rating,business.number_of_reviews,business.bbb_rating_or_license,business.latitude,business.longitude,business.cover_image,business.slogan,business.general_info,business.regular_hours,business.extra_phones,business.services_products,business.payment,business.price_range,business.aka,business.other_links,business.other_information,business.review_1_name,business.review_1_date,business.review_1_rating,business.review_1_text,business.review_2_name,business.review_2_date,business.review_2_rating,business.review_2_text
5097564,1521845,"2020-09-27 04:57:50","Sixth Street Grill",http://www.6thstreeteugene.com,the6thstreetgrill@gmail.com,"(541) 485-2961","55 W 6th Ave",Eugene,OR,97401,"55 W 6th Ave,Eugene,OR 97401","Bars, Bar & Grills, Breakfast, Brunch & Lunch Restaurants, Brew Pubs, Restaurants, Steak Houses","4,5","4 Reviews",A+,44.05349,-123.09367,https://i3.ypcdn.com/blob/f708761cc2c644204e7e8e4867122df86ca5cc33_100x100_crop.jpg?f832250,,"6th Street Grill has a relaxed Gastro Pub environment with amazing entrees and professional service. Signature burgers, incredible entrees and salads which complement their hand crafted cocktails and 18 local beers on tap and sporting events. 6th Street Grill В– doing it right. local ingredients, made from scratch, hand cut steaks. in the heart of the Arts and Entertainment District. Parking in back and five levels across the street. Fresh. Local. Gastro. 6th Street Grill.","Mon - Fri: 11:00 am - 9:00 pm Sat - Sun: 9:00 am - 9:00 pm","Phone: (541) 349-0566 Phone: (541) 485-2691 Phone: (541) 485-3080 Fax: (541) 485-3080 Fax: (541) 349-0566",,"visa, mastercard, discover, amex",,"6th Street 6th Street Grill 6th Street Restaurant & Sports Bar","http://www.6thstreeteugene.com https://www.6thstreeteugene.com http://www.sixthstreetgrill.com","Parking: Lot, Free Bike Parking: Yes Wheelchair Accessible: Yes Cuisines: Brew Pubs, Breakfast, Brunch & Lunch, Steakhouse, Bar & Grills Alcohol: Full Bar Wi-Fi: Free Attire: Casual Takes Reservations: Yes Outdoor Seating: No","Dan C.",02/09/2017,five,"We had 30 minutes between trains. We found this wonderful place, two blocks from the train station. My wife ordered the hazelnut chicken salad, I ordered the beef barbacoa tacos. We asked for the order to go. We got our food in time to catch our next train. The flavor of both dishes was amazing. We will definitely go back here the next time we are in Eugene. ????????????????????",hoppitydo,05/01/2012,five,"I love the place! GREAT happy hour-great sevice, nice people. I'll be back with friends!"
5097646,1521858,"2020-09-27 04:57:50","The Derby",http://brownderby.com,orders@brownderby.com,"(704) 283-6411","1012 Skyway Dr",Monroe,NC,28110,"1012 Skyway Dr,Monroe,NC 28110","American Restaurants, Breakfast, Brunch & Lunch Restaurants, Family Style Restaurants, Hamburgers & Hot Dogs, Italian Restaurants, Restaurants, Sandwich Shops, Seafood Restaurants, Soul Food Restaurants, Steak Houses","3,5","3 Reviews",,34.99155,-80.54839,https://i1.ypcdn.com/blob/762c596b5bb5326bc614e27b7416424cacc0f26c_100x100_crop.jpg?f832250,,,"Mon - Sat: 7:00 am - 9:00 pm","Phone: (704) 225-8771 Primary Phone: (704) 225-8771 Fax: (704) 283-6411",,"master card, amex, debit, discover, visa, all major credit cards",,"Derby Restaurant & Bar Brown Derby Derby Restaurant","http://brownderby.com http://www.thederbyrestaurant.com","Wi-Fi: No Bike Parking: No Attire: Casual Cuisines: Southern, Soul, Burgers, Family Style, American, Sandwiches, Hot Dogs, Breakfast, Brunch & Lunch, Italian, Steakhouse, European, Seafood, Continental Alcohol: Full Bar Takes Reservations: Yes Outdoor Seating: No Price Range : Average",PSQUIRREL,08/15/2008,five,"a VERY PLEASANT ATMOSPHERE AND EXPERIENCE. i HAVE ENJOYED COMING TO THE BROWN DERBY FOR 8 YEARS. i WOULD RECOMMEND IT TO ANYONE i LOVE THE COLD PLATE WHILE MY HUSBAND TRIES DIFFERENT HOT DISHES EVERY TIME WE GO. i AGREE ON THE CHICKEN STRIPS ALSO. THE PINTOS ARE TASTY ALSO.","karen phillips",01/23/2008,one,"I entered this restaurant because the lot was full--thought that meant it Must Be Good! I ordered Veal which was a specialty. The salad came first and was clumped iceberg lettuce. The veal looked like it was drowned in tomato sauce and canned mushrooms. The dish looked unappetizing and the veal tasted a bit like tough beef. The waitress was very nice. The atmkosphere was great, music fun."
5097671,1521862,"2020-09-27 04:57:50","Cameron's American Bistro",http://www.cameronsamericanbistro.com,camerons@cameronmitchell.com,"(614) 885-3663","2185 W Dublin Granville Rd",Columbus,OH,43085,"2185 W Dublin Granville Rd,Columbus,OH 43085","American Restaurants, Breakfast, Brunch & Lunch Restaurants, Caterers, Family Style Restaurants, Fine Dining Restaurants, Restaurants, Seafood Restaurants, Steak Houses",4,"7 Reviews",,40.08974,-83.04866,https://i1.ypcdn.com/blob/ea582ff9c8f75dfd774e7b6aac38e2fef86a3294_100x100_crop.jpg?f832250,,"No other restaurant brings home the delicious diversity of American cuisine quite like Cameron's. Our chefs travel to such domestic culinary capitals as San Francisco, New Orleans, New York, Chicago and Los Angeles. What they bring back are the very best fresh seafood, pastas, steaks and chops that those cities have to offer. Book your reservation today and come in and enjoy your 5 star fine dining experience!","Mon - Thu: 5:00 pm - 10:00 pm Fri - Sat: 5:00 pm - 11:00 pm Sun: 5:00 pm - 9:00 pm","Fax: (614) 885-4781",,"all major credit cards",,,"http://www.cameronsamericanbistro.com https://www.cameronsamericanbistro.com/Menus.aspx","Parking: Free Wi-Fi: No Bike Parking: No Attire: Dressy Wheelchair Accessible: Yes Cuisines: Steakhouse, Seafood Alcohol: Full Bar Takes Reservations: Yes Outdoor Seating: No","Francis P.",08/17/2014,three,"Yes, the se[ING was well lit and the atmosphere friendly. I was hoping for a quite more romantic venue but I guess you don't get that in a bistro. The Vegetable Plate that my girlfriend had asher main course was quite fantastic. It showed a lot of thought was put into it and not just a mishmash of freshly cooked and prepared veggies. We started off with the calamari which was very good and wonderfully seasoned. It was my dish that kind of disappointed me. The sticky rice was a bit hard on the edges and the red snapper, although light and flakey, just didn't have enough seasoning to make it pop. Overall a pleasant experience.",NotWendys,03/30/2009,two,"This is why some people say they don't like grits. They were instant and horrible. It was like eating tasteless sand. If you go here, please do not order the shrimp and grits because you would leave having been given completely the wrong idea about what otherwise should be a great experience. They were terrible. I guess I should've known better but fell for it out of lust for what I hoped would be good food. As far as it being kid-friendly, it was the night we went which was during the middle of the week. I have no need to go back. I can make it better at home for much less money, probably faster, and not walk away feeling I was somehow tricked into having a less than mediocre experience."
5097894,1521899,"2020-09-27 04:57:50","M & M Ranch House",http://www.facebook.com/M-M-Ranch-House-225741684153293,mmranchhouse@gmail.com,"(530) 527-1420","645 Antelope Blvd","Red Bluff",CA,96080,"645 Antelope Blvd,Red Bluff,CA 96080","American Restaurants, Banquet Halls & Reception Facilities, Barbecue Restaurants, Breakfast, Brunch & Lunch Restaurants, Hamburgers & Hot Dogs, Italian Restaurants, Restaurants, Steak Houses, Take Out Restaurants",5,"2 Reviews",,40.1851,-122.20218,,,,"Mon Closed Tue - Sun: 7:00 am - 8:00 pm","TollFree: (844) 491-9665",,"visa, master card, all major credit cards, amex, discover, cash, check",,"M and M Ranch House Restaurat","http://www.facebook.com/M-M-Ranch-House-225741684153293 https://www.google.com.tr?gws_rd=cr&dcr=0&ei=trnqwq_nhiguswh_ib24bw https://plus.google.com/114105895096984196197/about?gl=us&hl=en","Parking: Lot, Free Wi-Fi: No Bike Parking: Yes Attire: Casual Good For Groups: Yes Good for Kids: Yes Wheelchair Accessible: Yes Take Out: Yes Cuisines: Burgers, Barbecue, American, Take Out, Hot Dogs, Breakfast, Brunch & Lunch, Italian, Steakhouse, European, Continental Alcohol: Beer, Wine Takes Reservations: No Outdoor Seating: No Specialties: American Restaurant, American, American Food Price Range : Average","Anon A.",12/27/2017,five,"We love M&M Ranch House! They have a wonderful selection of sandwiches, burgers and steaks! Nice salad bar and very nice people. Recommended!",beeatch,02/05/2011,five,"This is one of my favorite restaurants ever. It's casual, the prices are reasonable, the people are very nice and the food is excellent! Great burgers and steaks."
5097971,1521909,"2020-09-27 04:57:50","Sylvia's Restaurant",http://www.sylviassoulfood.com,info@sylviasrestaurant.com,"(212) 996-0660","328 Malcolm X Blvd","New York",NY,10027,"328 Malcolm X Blvd,New York,NY 10027","American Restaurants, Barbecue Restaurants, Breakfast, Brunch & Lunch Restaurants, Restaurants, Soul Food Restaurants, Steak Houses",3,"47 Reviews",,40.80864,-73.94453,,,,"Mon - Sat: 8:00 am - 10:30 pm Sun: 11:00 am - 8:00 pm","Phone: (212) 427-6389 Phone: (212) 996-2669",,"amex, visa, mastercard, check",,"Sylvia's Queen Of Sea Food Sylvia's Queen Of Soul Food Rest.","http://www.sylviassoulfood.com http://sylviasrestaurant.com",,DavidLucil,03/08/2010,five,"I took my wife and kids here and thought it was absolutely delightful! I got to meet Sylvia Woods and even members of the family. This is a family owned establishment which made it an even better experience. Somebody told me to go to Mannas..and that is owned by a Korean women ? Why wouldn't I go to a southern style restaurant owned and operated by people from the South instead. I LOVED IT!! Kids LOVED IT As Well. And Sylvia Woods was a sweetheart. Food was delectable!!",mishoopo,08/08/2009,two,"The hostess will tell you the wait is just 10 minutes but if the waiting area is mildly crowded you'll be waiting for an hour. Don't agree for being seated close to the entrance. It is like a train stop. It is too tight and too much back and forth. Remember to ask for everything at once because your waitress, although nice and friendly, might disappear for 20 minutes during your meal. The food is delicious and nutritious and the prices are reasonable but the overall dining experience is sub-par. I wish they will get it together and get more organized. I guess this will not happen soon since they donВ’t have to do thatВ… customer will be still come there anyway."
5098216,1521952,"2020-09-27 04:57:50","Tbones Roadhouse",http://www.tbonesroadhouse.com,,"(508) 747-2667","22 Main St",Plymouth,MA,02360,"22 Main St,Plymouth,MA 02360","American Restaurants, Bars, Breakfast, Brunch & Lunch Restaurants, Brew Pubs, Caterers, Night Clubs, Restaurants, Steak Houses, Taverns",,,,41.95618,-70.66444,,,"T Bones is casual dining space that offers a variety of dining options to students. Its range of starters includes Buffalo chicken dip, nachos, and buffalo fingers and quesadilla. The restaurant serves chicken sandwiches, smoked turkey, barbeque steak tips, and taco, steakhouse, Caesar, and wedge Salads. T Bones also provides a selection of wines that includes rum runner, pinot grigio, green monster, white zinfandel, chardonnay, merlot, shiraz, pinot noir and cabernet sauvignon. It offers watermelon, platinum and pomegranate margarita, as well as serves strawberry, apple and snickers martini. The restaurant s menu additionally includes ice creams, cakes and brownies. T Bones organizes various dance and theme parties and entertainment events for its guests. It is located in Plymouth, Mass.","Mon - Sun: 8:00 am - 10:00 pm",,,"check, visa, amex, discover, mastercard",,"Tbones Roadhouse Bbq-Catering","http://www.tbonesroadhouse.com https://www.tbonesroadhouse.com","Cuisines: Brew Pubs, Caterers, American, Breakfast, Brunch & Lunch, Steakhouse Price Range : Below Average Drive Through: No Outdoor Seating: No Wheelchair Accessible: Yes Wi-Fi: No Takes Reservations: No Parking: Street Bike Parking: Yes",,,,,,,,
5098246,1521956,"2020-09-27 04:57:50","The Fresh Fish Company",http://www.thefreshfishco.com,fishco@eschelon.com,"(303) 740-9556","7800 E Hampden Ave",Denver,CO,80231,"7800 E Hampden Ave,Denver,CO 80231","Seafood Restaurants, American Restaurants, Banquet Halls & Reception Facilities, Barbecue Restaurants, Bars, Breakfast, Brunch & Lunch Restaurants, Buffet Restaurants, Creole & Cajun Restaurants, Family Style Restaurants, Fine Dining Restaurants, French Restaurants, Night Clubs, Restaurant Menus, Restaurants, Steak Houses, Take Out Restaurants","3,5","91 Reviews",A+,39.65239,-104.8999,https://i3.ypcdn.com/blob/0fdc720a692fdbb1a62500529b0e332e19903241_100x100_crop.jpg?f832250,"Perfect for Lunch - Happy Hour - Dinner - Sunday Brunch","The Fresh Fish Co. has been serving over 20 varieties of the freshest seafood in Denver, for over 34 years. We are proud to have been voted Denver's Best Seafood Restaurant for four years in a row (2008, 2009, 2010 and 2011) We are known for our mesquite wood grilling, live lobsters, four varieties of crab, melt in your mouth prime rib as well as homemade sides, desserts, sauces and dressings. Our champagne Sunday Brunch buffet is one of the city's best for quality and value. We cater to specialized nutritional requirements from calories to gluten with informative menu and an accommodating staff. As we look to the future, we will emphasize responsibly harvested seafood, wild or farmed. Reservations are not required, but recommended, for any party size. Join us for Happy Hour at the Black Pearl Oyster Bar! Party with us at the Proof Nightclub! Visit our website.","Mon - Thu: 11:30 am - 9:00 pm Fri - Sat: 11:30 am - 9:30 pm Sun: 10:00 am - 9:00 pm",,,"discover, mastercard, visa, amex",,,http://www.thefreshfishco.com,"Parking: Lot, Private Wi-Fi: No Bike Parking: Yes Attire: Casual Good For Family: Yes Good For Groups: Yes Wheelchair Accessible: Yes Cuisines: Seafood Alcohol: Full Bar, No Takes Reservations: Yes Outdoor Seating: No Price Range : Average Good for Kids: Yes","Steve H.",09/03/2016,five,"Best seafood in town.I love the atmosphere and the happy hour! I had the Prime Rib and Lobster Tail! Delicious!Sunday brunch is excellent, lots of crab legs, lots of peel and eat shrimp, a good time overall. Make sure to try the seafood salad! We had an excellent experience there, the staff was very nice and friendly. Their service is Perfect. Highly recommended!!","Rosalyn P.",03/16/2015,five,"Great food, great brunch price. Sitting @ table next to family, who had a very rude waitress. Tossing bowls at customers and juice glasses. Knocking over an item on their way able. Very rude disrespectful. Hope we don't get that waitress."
5098294,1521961,"2020-09-27 04:57:50",Stockyard,http://www.stock-yardrestaurant.com,,"(615) 255-6464","901 2nd Ave N",Nashville,TN,37201,"901 2nd Ave N,Nashville,TN 37201","Family Style Restaurants, Banquet Halls & Reception Facilities, Breakfast, Brunch & Lunch Restaurants, Fine Dining Restaurants, French Restaurants, Restaurants, Steak Houses",3,"109 Reviews",,36.17292,-86.78243,,,,"Mon - Thu: 5:00 am - 10:00 pm Fri: 5:00 pm - 11:00 pm Sat: 5:00 pm - 10:30 pm Sun: 5:00 pm - 9:00 pm",,,,,"Stock Yard Restaurant",http://www.stock-yardrestaurant.com,"Cuisines: Fine Dining, Family Style, French, Breakfast, Brunch & Lunch, European, Steakhouse, Continental Good for Kids: Yes Takes Reservations: Yes",07rebel,11/19/2012,one,"Terrible! This place is making a living off sucker tourist and they got me. Very over priced. Which is fine if the food was even decent. That was bar none the worst steak I have ever eaten. My wife felt the same way. Terrible!",genek1475319743,06/26/2012,five,"Went here for our anniversary. Took the Dry-Aged surf and turf option. Two Manhattan strips grilled over Hickory charcoal and a large lobster to share. As far as I know, this is the only restaurant to offer a luxury like this in the city. Great experience."
5098373,1521977,"2020-09-27 04:57:50","Billy Bob's Silver Diner",http://billybobssilverdiner.com,news@mooresvilletribune.com,"(336) 768-0654","1650 Hanes Mall Blvd","Winston Salem",NC,27103,"1650 Hanes Mall Blvd,Winston Salem,NC 27103","American Restaurants, Barbecue Restaurants, Breakfast, Brunch & Lunch Restaurants, Caterers, Restaurants, Steak Houses",3,"3 Reviews",A+,36.07138,-80.33781,,,"Billy Bob's Silver Diner is a family-owned restaurant that offers a variety of food options. It provides a range of side dishes, sandwiches and starters for lunch and dinner. The restaurant offers corned beef hash, smoked sausage, pork tenderloins and chicken quesadillas. Billy Bob's Silver Diner also serves grilled sirloin tips, baby back ribs and baked beans. It provides a children s menu that includes French toast and spaghetti. The restaurant is a member of the Winston-Salem Chamber of Commerce. Billy Bob's Silver Din offers a selection of desserts, such as banana split and sundaes. Its party room can accommodate up to 50 people for special events.","Mon - Thu: 7:00 am - 10:00 pm Fri - Sat: 7:00 am - 12:00 am Sun: 7:00 am - 10:00 pm","Phone: (336) 768-1246 Fax: (336) 768-1246",,"discover, master card, visa, all major credit cards, amex",,,http://billybobssilverdiner.com,"Cuisines: Caterers, Barbecue, American, Breakfast, Brunch & Lunch, Steakhouse Wi-Fi: Free Parking: Lot, Private Alcohol: Beer, Wine Bike Parking: Yes Attire: Casual Takes Reservations: No Outdoor Seating: No Price Range : Below Average",2kidz1dog,03/03/2012,one,"My family and I were so excited when Billy Bob's reopened. We enjoyed meeting the new owner/manager and eagerly awaited our next chance to eat there, until... Last night I ordered the taco salad and asked for no tomatoes. I uderstood that the meat/chili that they use in the salad had some tomatoes in it and I was willing to pick those out or eat around them. When my food finally came out - that is a whole other story... I found that the cooks added EXTRA tomatoes! When I brought this to the waitress' attention she simply apologized but never offered to make it right. When asked about it, I was still charged full price for the meal and was told that that it was my fault. Our waitress did a ton of apologizing but very little service. She brought out my husband's meal and said she would be right back with mine. We waited for 4 minutes and she never came - the entire time she stood at the ice cream freezer socializing with the night manager and dishingup someone's sundae. I had to get up and ask for ketchup, silverware, oh yeah --- and my FOOD!!! We won't ever go back there! WS is full of restaurants that put their customer's first and unfortunately Billy Bob's has lost our business but gained a bunch of bad publicity!",tchad111,07/07/2009,four,"Just moved here from Michigan we stopped in for breakfast (which was great) and the waitress was amazingly friendly and helpful. We were in a hurry because we had an early morning inspection on the home we had just purchased and she got us in and out on time with some friendly chat inbetween ! We plan to visit often...."
5098567,1522009,"2020-09-27 04:57:53","Shilo Restaurant Portland Airport",http://www.shiloinns.com/shilo-inns-portland-airport/dining,paul.childers@shiloinns.com,"(503) 252-4300","11707 NE Airport Way",Portland,OR,97220,"11707 NE Airport Way,Portland,OR 97220","American Restaurants, Bars, Breakfast, Brunch & Lunch Restaurants, Cocktail Lounges, French Restaurants, Night Clubs, Restaurants, Seafood Restaurants, Steak Houses, Taverns",,,,45.56773,-122.54231,,,"There is nothing better than the combination of great food, excellent service and convenience! Proudly serving a variety of Northwest favorites along with a wide-range selection of classic American dishes your whole family will enjoy. Walk-ins are always welcome, but feel free to make a reservation","Mon - Sat: 6:00 am - 10:00 pm","TollFree: (800) 222-2244",,"all major credit cards",,"Shilo Restaurant PDX Airport Shilo Portland Restaurant","http://www.shiloinns.com/shilo-inns-portland-airport/dining http://www.shiloportlandrestaurant.com","Parking: Lot, Private Wi-Fi: Free Bike Parking: Yes Attire: Casual Wheelchair Accessible: Yes Cuisines: American, French, Breakfast, Brunch & Lunch, Steakhouse, European, Seafood, Continental Alcohol: Full Bar Takes Reservations: Yes Outdoor Seating: No Price Range : Average",,,,,,,,
5098879,1522067,"2020-09-27 04:57:53","Duke's Restaurant & Barefoot Bar",http://dukeswaikiki.com,info@mindgruve.com,"(808) 922-2268","2335 Kalakaua Ave Ste 116",Honolulu,HI,96815,"2335 Kalakaua Ave Ste 116,Honolulu,HI 96815","Barbecue Restaurants, Breakfast, Brunch & Lunch Restaurants, Family Style Restaurants, Restaurants, Seafood Restaurants, Steak Houses",4,"18 Reviews",,21.27692,-157.82768,https://i1.ypcdn.com/blob/0b877da44757ff7486b0f86e617a1917c48523f0_100x100_crop.jpg?f832250,,,SU,,,"amex, discover, master card, visa, all major credit cards",,,http://dukeswaikiki.com,"Parking: Garage, Street, Valet Wi-Fi: No Cuisines: Barbecue, Family Style, Breakfast, Brunch & Lunch, Steakhouse, Seafood","Jason B.",07/10/2015,three,"It was ok place for drinks. Too expensive for too little servings. However, food was decent..",sue721,05/20/2012,three,"We did not make reservations and were told it would be a 45 minute wait but ended up being only about 20 minutes. We had an awesome waitress aand we enjoyed the singers who came around to the tables. Salad bar was good and my husband liked the kabobs but I think the rest of the food was just ok with small portions for the price, We had a good time but undecided on going back."
5099234,1522128,"2020-09-27 04:57:53","Gale Street Inn",http://www.galestreet.com,,"(773) 725-1300","4914 N Milwaukee Ave",Chicago,IL,60630,"4914 N Milwaukee Ave,Chicago,IL 60630","American Restaurants, Barbecue Restaurants, Breakfast, Brunch & Lunch Restaurants, Caterers, Continental Restaurants, Hamburgers & Hot Dogs, Restaurants, Sandwich Shops, Seafood Restaurants, Steak Houses",5,"1 Review",A+,41.96985,-87.76302,https://i1.ypcdn.com/blob/81eca47a57efb315c69607e2917aca928ae9a671_100x100_crop.jpg?f832250,,,"Mon: 4:00 pm - 10:00 pm Tue Closed Wed - Thu: 11:30 am - 10:00 pm Fri: 11:30 am - 11:00 pm Sat: 12:00 pm - 11:00 pm Sun: 12:00 pm - 12:00 am","Fax: (773) 725-0859",,"discover, master card, paypal, visa, all major credit cards, amex, diners club",,"Gale Street Inn Chicago",http://www.galestreet.com,"Parking: Lot, Private Wi-Fi: Free Bike Parking: Yes Attire: Casual Wheelchair Accessible: Yes Cuisines: Burgers, Caterers, Barbecue, American, Sandwiches, Hot Dogs, Breakfast, Brunch & Lunch, Steakhouse, European, Seafood, Continental Alcohol: Full Bar Takes Reservations: Yes Outdoor Seating: No Price Range : Above Average",golander,08/16/2012,five,"Best Ribs in Chicago, love the tasty butter and rolls. If the pulled pork sandwich is available get it!",,,,