business_x_category.id,business.id,business.ts,business.business_name,business.home_page,business.email_address,business.phone,business.street,business.city,business.state,business.zip_code,business.full_address,business.category,business.rating,business.number_of_reviews,business.bbb_rating_or_license,business.latitude,business.longitude,business.cover_image,business.slogan,business.general_info,business.regular_hours,business.extra_phones,business.services_products,business.payment,business.price_range,business.aka,business.other_links,business.other_information,business.review_1_name,business.review_1_date,business.review_1_rating,business.review_1_text,business.review_2_name,business.review_2_date,business.review_2_rating,business.review_2_text
17491998,2550289,"2020-09-27 06:37:54","Bank of America",https://www.bankofamerica.com,,"(276) 223-6150","210 E Main St",Wytheville,VA,24382,"210 E Main St,Wytheville,VA 24382","Banks, ATM Locations, Commercial & Savings Banks, Loans",,,A+,36.95116,-81.08303,https://i2.ypcdn.com/blob/3a79f235d7941cc9916f72ed93b9c38968b966b8_100x100_crop.jpg?f9d23e1,,,"Mon - Fri: 9:00 am - 5:00 pm","Phone: (276) 228-5191 Phone: (276) 223-6154 Fax: (276) 228-3755 TollFree: (866) 792-4357",,"debit, master card, visa",,"First Bank",https://www.bankofamerica.com,,,,,,,,,
17492020,2550298,"2020-09-27 06:37:54",ATM,http://www.firstbankks.com,,"(316) 284-0404","1315 Washington Rd",Newton,KS,67114,"1315 Washington Rd,Newton,KS 67114","ATM Locations, Banks, Commercial & Savings Banks",,,,38.02866,-97.33722,,,,,,,,,"First Bank","http://www.firstbankks.com https://network.americanexpress.com/globalnetwork/atm_locator/en",,,,,,,,,
17492035,2550306,"2020-09-27 06:37:54","Bank of America",https://www.bankofamerica.com,,"(863) 676-4906","1100 State Road 60 E","Lake Wales",FL,33853,"1100 State Road 60 E,Lake Wales,FL 33853","Banks, ATM Locations, Commercial & Savings Banks, Loans",,,,27.89352,-81.56427,https://i2.ypcdn.com/blob/3a79f235d7941cc9916f72ed93b9c38968b966b8_100x100_crop.jpg?f9d23e1,"Life's better when we're connected.","Welcome to Bank of America in Lake Wales, FL, home to a variety of your financial needs including checking and savings accounts, online banking, mobile and text banking, student banking and credit cards. You have full access to your Bank of America accounts at any of our more than 5,000 banking centers nationwide. When you visit our financial centers, our knowledgeable associates and welcoming environment will make you feel at home.Easy access for everyone: Handicap accessible parking spaces, Handicap accessible restrooms and Braille signage (where available), Ramps in locations with steps, Easy-to-open doors, Handicap accessible safe deposit box rooms.","Sun:- Mon:9-4 Tue:9-4 Wed:9-4 Thu:9-4 Fri:9-5 Sat:9-12","Phone: (863) 678-0833 Fax: (863) 455-1045 Fax Number: (863) 455-1045 TollFree: (800) 432-1000",,debit,,"Bank of America Financial Center",https://www.bankofamerica.com,,,,,,,,,
17492043,2550308,"2020-09-27 06:37:54","Bank of America",https://www.bankofamerica.com,,"(516) 292-7730","3 Main St",Hempstead,NY,11550,"3 Main St,Hempstead,NY 11550","Banks, ATM Locations, Commercial & Savings Banks, Loans",,,,40.70636,-73.62373,https://i2.ypcdn.com/blob/3a79f235d7941cc9916f72ed93b9c38968b966b8_100x100_crop.jpg?f9d23e1,"LIFE'S BETTER WHEN WE'RE CONNECTED","Welcome to Bank of America in Hempstead, NY, home to a variety of your financial needs including checking and savings accounts, online banking, mobile and text banking, student banking and credit cards. You have full access to your Bank of America accounts at any of our more than 5,000 banking centers nationwide. When you visit our financial centers, our knowledgeable associates and welcoming environment will make you feel at home.Easy access for everyone: Handicap accessible parking spaces, Handicap accessible restrooms and Braille signage (where available), Ramps in locations with steps, Easy-to-open doors, Handicap accessible safe deposit box rooms.","Sun:- Mon:9-4 Tue:9-4 Wed:9-4 Thu:9-4 Fri:9-6 Sat:9-1","Phone: (516) 921-1825 Fax Number: (516) 505-4146 Fax: (516) 505-4146 TollFree: (800) 841-4000 TollFree: (800) 432-1000",,"master card, visa, debit",,"Bank of America ATM Bank of America Financial Center",https://www.bankofamerica.com,,,,,,,,,
17492055,2550315,"2020-09-27 06:37:54","Bank of America",https://www.bankofamerica.com,,"(316) 261-4216","411 S Topeka St",Wichita,KS,67202,"411 S Topeka St,Wichita,KS 67202","Banks, ATM Locations, Commercial & Savings Banks, Loans",,,,37.68212,-97.33464,https://i2.ypcdn.com/blob/3a79f235d7941cc9916f72ed93b9c38968b966b8_100x100_crop.jpg?f9d23e1,"LIFE'S BETTER WHEN WE'RE CONNECTED","Welcome to Bank of America in Wichita, KS, home to a variety of your financial needs including checking and savings accounts, online banking, mobile and text banking, student banking and credit cards. You have full access to your Bank of America accounts at any of our more than 5,000 banking centers nationwide. When you visit our financial centers, our knowledgeable associates and welcoming environment will make you feel at home.Easy access for everyone: Handicap accessible parking spaces, Handicap accessible restrooms and Braille signage (where available), Ramps in locations with steps, Easy-to-open doors, Handicap accessible safe deposit box rooms.","Sun:- Mon:9-5 Tue:9-5 Wed:9-5 Thu:9-5 Fri:9-5 Sat:-","Fax Number: (316) 265-5167 Fax: (316) 265-5167 TollFree: (800) 432-1000",,debit,,"Bank of America Financial Center",https://www.bankofamerica.com,,,,,,,,,
17492063,2550318,"2020-09-27 06:37:54","Bank of America Financial Center",https://www.bankofamerica.com,,"(480) 824-1048","6026 S 7th Ave",Phoenix,AZ,85041,"6026 S 7th Ave,Phoenix,AZ 85041","Banks, ATM Locations, Commercial & Savings Banks, Loans",,,,33.3908,-112.08242,https://i2.ypcdn.com/blob/3a79f235d7941cc9916f72ed93b9c38968b966b8_100x100_crop.jpg?f9d23e1,"LIFE'S BETTER WHEN WE'RE CONNECTED","Welcome to Bank of America in Phoenix, AZ, home to a variety of your financial needs including checking and savings accounts, online banking, mobile and text banking, student banking and credit cards. You have full access to your Bank of America accounts at any of our more than 5,000 banking centers nationwide. When you visit our financial centers, our knowledgeable associates and welcoming environment will make you feel at home.Easy access for everyone: Handicap accessible parking spaces, Handicap accessible restrooms and Braille signage (where available), Ramps in locations with steps, Easy-to-open doors, Handicap accessible safe deposit box rooms.","Sun:- Mon:9-5 Tue:10-5 Wed:10-5 Thu:10-5 Fri:9-6 Sat:9-1","Phone: (602) 395-5996 Fax: (480) 824-1025 Fax Number: (480) 824-1025 TollFree: (800) 432-1000",,debit,,"Bank of America ATM",https://www.bankofamerica.com,,,,,,,,,
17492073,2550323,"2020-09-27 06:37:54","City National Bank",http://www.citynational.com,web@www.citynationalcm.com,"(561) 243-3710","1120 S Federal Hwy Ste 100","Delray Beach",FL,33483,"1120 S Federal Hwy Ste 100,Delray Beach,FL 33483","Commercial & Savings Banks, ATM Locations, Banks",,,,26.44588,-80.06813,,,,"Mon - Thu: 8:30 am - 5:00 pm Fri: 8:30 am - 5:30 pm","Phone: (561) 243-3648 Phone: (561) 921-0963 Fax: (561) 243-3770 TollFree: (800) 762-2489",,"visa, master card",,"City National Bank Of Florida City National Bank Of Florida ATM","http://www.citynational.com http://citynationalcm.com https://www.citynationalcm.com",,,,,,,,,
17492079,2550325,"2020-09-27 06:37:54",BB&T,https://www.bbt.com/locator/search.page,,"(540) 298-2400","250 S Stuart Ave",Elkton,VA,22827,"250 S Stuart Ave,Elkton,VA 22827","Banks, ATM Locations, Commercial & Savings Banks, Financing Services, Loans, Mortgages",,,,38.40698,-78.61922,https://i2.ypcdn.com/blob/d4c0633234e29f779c9f6b32e94be15f65f329cd_100x100_crop.jpg?f9d23e1,,"BB&T is one of the largest financial services holding companies in the U.S. Based in Winston-Salem, N.C., the company operates 2,139 financial centers in 15 states and Washington, D.C., and offers a full range of consumer and commercial banking, securities brokerage, asset management, mortgage and insurance products and services. A Fortune 500 company, BB&T is consistently recognized for outstanding client satisfaction by the U.S. Small Business Administration, Greenwich Associates and others. BB&T has also been named one of the WorldВ’s Strongest Banks by Bloomberg Markets Magazine, one of the top three in the U.S. and in the top 15 globally. More information about BB&T and its full line of products and services is available on our website.","Mon - Thu: 9:00 am - 5:00 pm Fri: 9:00 am - 6:00 pm Sat: 9:00 am - 12:00 pm Sun Closed","Fax: (540) 298-1781",,"master card, visa, debit",,,https://www.bbt.com/locator/search.page,,,,,,,,,
17492083,2550326,"2020-09-27 06:37:54","Amalgamated Bank",http://www.amalgamatedbank.com,customerservice@aboc.com,"(212) 413-8775","619 Main St","New York",NY,10044,"619 Main St,New York,NY 10044","Commercial & Savings Banks, ATM Locations, Banks",,,,40.76329,-73.94881,,,,"Mon - Wed: 9:00 am - 4:00 pm Thu: 9:00 am - 6:00 pm Fri: 9:00 am - 4:00 pm Sat: 9:00 am - 1:00 pm",,,"master card, visa",,"Amalgamated Bank ATM","http://www.amalgamatedbank.com https://www.amalgamatedbank.com",,,,,,,,,
17492099,2550331,"2020-09-27 06:37:54","Northwest Savings Bank",http://www.northwest.com,,"(724) 228-8320","1265 W Chestnut St",Washington,PA,15301,"1265 W Chestnut St,Washington,PA 15301","Banks, ATM Locations, Commercial & Savings Banks",,,,40.16531,-80.2722,,,,"Mon - Thu: 9:00 am - 4:00 pm Fri: 9:00 am - 6:00 pm Sat: 9:00 am - 12:00 pm","TollFree: (877) 672-5678",,"all major credit cards, mastercard, visa, amex",,"Northwest, Bank","http://www.northwest.com http://www.northwestsavingsbank.com",,,,,,,,,
17492122,2550342,"2020-09-27 06:37:54","Communityone Bank ATM",,,"(828) 441-1600","3244 Sulphur Springs Rd NE",Hickory,NC,28601,"3244 Sulphur Springs Rd NE,Hickory,NC 28601","ATM Locations, Banks, Commercial & Savings Banks, Loans",,,,35.77268,-81.25996,,,,"Friday 9:00 AM - 6:00 PM",,,,,,,,,,,,,,,
17492132,2550344,"2020-09-27 06:37:54","Community Bank Of Elmhurst",http://www.communityelmhurst.com,kbartels@communityelmhurst.com,"(630) 782-1234","330 W Butterfield Rd",Elmhurst,IL,60126,"330 W Butterfield Rd,Elmhurst,IL 60126","Financing Services, ATM Locations, Banks, Commercial & Savings Banks, Holding Companies",,,A+,41.8649,-87.94861,https://i2.ypcdn.com/blob/7476b1e83b163306921edfb85b1f8aef5f37520e_100x100_crop.jpg?f9d23e1,"Elmhurst's Original Community Bank","Community Bank of Elmhurst, in Elmhurst, IL, is one of the area's leading banks serving Elmhurst, Villa Park, Oak Brook and surrounding areas since 1993. We specialize in checking and savings accounts, personal and commercial banking, mobile and internet banking, credit and debit cards, wire transfers, cashiers checks, coin counting and much more. For all your banking needs, contact Community Bank of Elmhurst in Elmhurst.","Mon - Thu: 9:00 am - 5:00 pm Fri: 9:00 am - 6:00 pm Sat: 9:00 am - 1:00 pm Sun Closed","Fax: (630) 782-1232",,"cash, visa, amex, check, discover, all major credit cards, mastercard",,,"Primary Website Facebook",,,,,,,,,
17492146,2550349,"2020-09-27 06:37:54","Bank of America",https://www.bankofamerica.com,,"(561) 659-0032","140 N County Rd","Palm Beach",FL,33480,"140 N County Rd,Palm Beach,FL 33480","Banks, ATM Locations, Commercial & Savings Banks, Loans",,,,26.71987,-80.03815,https://i2.ypcdn.com/blob/3a79f235d7941cc9916f72ed93b9c38968b966b8_100x100_crop.jpg?f9d23e1,"LIFE'S BETTER WHEN WE'RE CONNECTED","Welcome to Bank of America in Palm Beach, FL, home to a variety of your financial needs including checking and savings accounts, online banking, mobile and text banking, student banking and credit cards. You have full access to your Bank of America accounts at any of our more than 5,000 banking centers nationwide. When you visit our financial centers, our knowledgeable associates and welcoming environment will make you feel at home.Easy access for everyone: Handicap accessible parking spaces, Handicap accessible restrooms and Braille signage (where available), Ramps in locations with steps, Easy-to-open doors, Handicap accessible safe deposit box rooms.","Sun:- Mon:9-4 Tue:9-4 Wed:9-4 Thu:9-4 Fri:9-4 Sat:-",,,,,,https://www.bankofamerica.com,,,,,,,,,
17492156,2550353,"2020-09-27 06:37:54","BMO Harris Bank",http://harrisbank.com,,"(815) 741-5600","801 Essington Rd",Joliet,IL,60435,"801 Essington Rd,Joliet,IL 60435","ATM Locations, Banks, Commercial & Savings Banks",,,,41.53657,-88.16077,,,"BMO Harris Bank provides a broad range of personal banking products and solutions. Come to us for everyday banking, financing, investing, as well as a full suite of integrated commercial and financial advisory services.","Mon - Thu: 9:00 am - 5:00 pm Fri: 9:00 am - 6:00 pm Sat: 9:00 am - 1:00 pm",,,"master card, visa, debit",,"N A Harris",http://harrisbank.com,,,,,,,,,
17492167,2550359,"2020-09-27 06:37:54","BB & T",http://www.bbt.com,askbbt@bbandt.com,"(954) 514-1800","1580 Sawgrass Corporate Pkwy Ste 120",Sunrise,FL,33323,"1580 Sawgrass Corporate Pkwy Ste 120,Sunrise,FL 33323","Banks, ATM Locations, Commercial & Savings Banks, Financing Services, Loans",,,,26.14253,-80.33949,https://i2.ypcdn.com/blob/d4c0633234e29f779c9f6b32e94be15f65f329cd_100x100_crop.jpg?f9d23e1,"SOLID PERFORMANCE. SOLID HISTORY. SOLID BANK",,"Monday:9AM-3PM , Tuesday:9AM-3PM , Wednesday:9AM-3PM , Thursday:9AM-3PM , Friday:9AM-3PM , Saturday: CLOSED , Sunday: CLOSED","Phone: (954) 835-0573 Primary Phone: (954) 835-0573 Phone: (954) 835-2759 Fax: (954) 835-2759",,"master card, visa, debit",,"BB&T (Branch Banking and Trust) Bb&T Corporation Bb&T Bank BB&T ATM",http://www.bbt.com,,,,,,,,,
17492177,2550362,"2020-09-27 06:37:54","Northwest Bank",http://www.northwest.com,info@northwest.com,"(440) 282-9196","3660 Oberlin Ave",Lorain,OH,44053,"3660 Oberlin Ave,Lorain,OH 44053","Banks, ATM Locations, Commercial & Savings Banks, Loans, Mortgages",,,,41.43774,-82.18556,https://i2.ypcdn.com/blob/5110cf26188125443abfd765b874f7d60c4dcf04_100x100_crop.jpg?f9d23e1,"Northwest Bank is a bank headquartered in Warren, Pennsylvania. It operates 172 branches in central",,"Mon - Thu: 9:00 am - 5:00 pm Fri: 9:00 am - 5:30 pm Sat: 9:00 am - 12:00 pm","Phone: (440) 282-7867 Fax: (440) 282-7867 TollFree: (877) 672-5678",,debit,,,http://www.northwest.com,,,,,,,,,
17492183,2550364,"2020-09-27 06:37:54","Frost Bank",https://www.frostbank.com,,"(830) 249-2551","2016 Columbiana Rd","Vestavia Hills",AL,35216,"2016 Columbiana Rd,Vestavia Hills,AL 35216","Banks, ATM Locations, Commercial & Savings Banks, Financial Planners, Financial Services, Internet Banking, Loans, Mortgages",,,,33.43924,-86.80857,,,,,,,,,,https://www.frostbank.com,,,,,,,,,
17492206,2550372,"2020-09-27 06:37:54","Alpine Bank",https://www.alpinebank.com/who-we-are/location-details.html?id=10134&location-information=frisco-701-n.-summit-boulevard-po-box-4457-frisco-co-80443,onlinebanking@alpinebank.com,"(970) 668-0186","701 N Summit Blvd",Frisco,CO,80443,"701 N Summit Blvd,Frisco,CO 80443","Commercial & Savings Banks, ATM Locations, Banks, Financial Services, Financing Services, Investments, Loans, Mortgages, Mutual Funds, Real Estate Loans",,,,39.584522,-106.094,https://i2.ypcdn.com/blob/23ea178d11d4a761ebe722e49a33d2426fb0ccb5_100x100_crop.jpg?f9d23e1,,"Employee-owned and locally operated, Alpine Bank has been a part of Colorado since 1973. With 40 convenient locations, most recently including Denver and Boulder. Alpine Bank serves more than 145,000 customers with retail, business, wealth management, mortgage and electronic banking services. While we are a growing company, weВ’re also forever committed to remaining the true community bank weВ’ve always been. At Alpine Bank, the employees and the culture make the difference. Many of our employees and managers have been with Alpine Bank for 10 years or longer. This dedication allows us to build long-term community and customer relationships В– in fact, much of our original Board of Directors still serve, including Alpine Bank Founder and Chairman Bob Young. We have a strong sense of social and environmental responsibility that affects all areas of our operation at Alpine Bank. Our commitment to the communities we serve is substantial, and our employees give generously of their time and talents.","Mon - Thu: 9:00 am - 5:00 pm Fri: 9:00 am - 6:00 pm Sat: 9:00 am - 12:00 pm","Fax: (970) 668-9907 TollFree: (800) 551-6098",,"visa, master card, amex, discover, debit",,,https://www.alpinebank.com/frisco,,,,,,,,,
17492218,2550373,"2020-09-27 06:37:54","Carolina Foothills Federal Credit Union",https://www.carolinafoothillsfcu.coop,,"(800) 922-4403","1609 E North St",Greenville,SC,29607,"1609 E North St,Greenville,SC 29607","Banks, ATM Locations, Commercial & Savings Banks, Credit Unions, Financial Services, Loans, Savings & Loan Associations","2,5","5 Reviews",,34.8603,-82.37712,https://i2.ypcdn.com/blob/1d73e910c9fc5001bacef0596e3d9f82000839b9_100x100_crop.jpg?f9d23e1,,"Carolina Foothills Federal Credit Union provides banking services through out South Carolina, with 6 branches in Greenville, Spartanburg, Gaffney & Simpsonville. CFFCU is a great solution when looking for a car or personal loan, but we can also help with mortgage and home equity loans. We have all your typical bank services like savings and checking accounts (and business accounts) along with credit cards, but did you know we also have a loan calculator right on our website? You can calculate your loan rates and brush up on your financial education and health right on our website.","M-Th 9am-5pm, F 8am-6pm, Sa-Su Closed (Dirve Thru hours are the same as listed above, but open till 6 pm on Fridays)",,,"amex, cash, check, debit, discover, master card, visa",,,https://www.carolinafoothillsfcu.coop/,,"Michelle B.",08/04/2016,five,"Have been a member for several years now. Their Web Branch online site is outstanding, full featured and easy to use. So much so in fact that I seldom have the need to visit a physical branch location (especially since they've implemented mobile check deposit feature...so easy!). Past interactions with representatives have all been positive experiences. Haven't encounter any who've not been courteous and knowledgeable.","James S.","Edited: 07/29/2016",five,"I have to highly disagree with the reviews below. I've been a member of Carolina Foothills FCU since the 80's and have received noting but superior service. Yes, when you go to the office you do have to fill out a slip letting them know what you would like to do. They are tellers not mind readers... It is your responsibility to know your accounts and what you would like to do when you go to any bank or credit union. Love my Greenville gals!"
17492228,2550375,"2020-09-27 06:37:54","BB & T",http://www.bbt.com,,"(434) 432-2292","2 N Main St",Chatham,VA,24531,"2 N Main St,Chatham,VA 24531","Banks, ATM Locations, Commercial & Savings Banks, Financing Services, Loans",,,,36.82645,-79.39867,https://i2.ypcdn.com/blob/d4c0633234e29f779c9f6b32e94be15f65f329cd_100x100_crop.jpg?f9d23e1,,,"Thu: 9:00 am - 5:00 pm Fri: 9:00 am - 6:00 pm",,,,,"BB&T ATM",http://www.bbt.com,,,,,,,,,
17492233,2550376,"2020-09-27 06:37:54","Bank of America At Medley",https://www.bankofamerica.com,,"(305) 805-5218","7400 NW 72nd Ave",Medley,FL,33166,"7400 NW 72nd Ave,Medley,FL 33166","Banks, ATM Locations, Commercial & Savings Banks, Loans",,,,25.84122,-80.31449,https://i2.ypcdn.com/blob/3a79f235d7941cc9916f72ed93b9c38968b966b8_100x100_crop.jpg?f9d23e1,"LIFE'S BETTER WHEN WE'RE CONNECTED","Welcome to Bank of America in Medley, FL, home to a variety of your financial needs including checking and savings accounts, online banking, mobile and text banking, student banking and credit cards. You have full access to your Bank of America accounts at any of our more than 5,000 banking centers nationwide. When you visit our financial centers, our knowledgeable associates and welcoming environment will make you feel at home.Easy access for everyone: Handicap accessible parking spaces, Handicap accessible restrooms and Braille signage (where available), Ramps in locations with steps, Easy-to-open doors, Handicap accessible safe deposit box rooms.","Sun:- Mon:9-4 Tue:9-4 Wed:9-4 Thu:9-4 Fri:9-6 Sat:-",,,,,,https://www.bankofamerica.com,,,,,,,,,
17492237,2550377,"2020-09-27 06:37:54",BB&T,https://www.bbt.com/bbtdotcom/locator/details/1000_Berryville_Ave_Winchester_VA_22601?ReferralSource=GV&CampIDMaj=AQA&CampIDMin=AR&cmpid=4513,svanbuskirk@bbandt.com,"(540) 667-8561","1000 Berryville Ave",Winchester,VA,22601,"1000 Berryville Ave,Winchester,VA 22601","Banks, ATM Locations, Commercial & Savings Banks, Financing Services, Loans, Mortgages",,,,39.18612,-78.14374,https://i2.ypcdn.com/blob/d4c0633234e29f779c9f6b32e94be15f65f329cd_100x100_crop.jpg?f9d23e1,,"BB&T is one of the largest financial services holding companies in the U.S. Based in Winston-Salem, N.C., the company operates 2,139 financial centers in 15 states and Washington, D.C., and offers a full range of consumer and commercial banking, securities brokerage, asset management, mortgage and insurance products and services. A Fortune 500 company, BB&T is consistently recognized for outstanding client satisfaction by the U.S. Small Business Administration, Greenwich Associates and others. BB&T has also been named one of the WorldВ’s Strongest Banks by Bloomberg Markets Magazine, one of the top three in the U.S. and in the top 15 globally. More information about BB&T and its full line of products and services is available on our website.","Mon - Thu: 9:00 am - 5:00 pm Fri: 9:00 am - 6:00 pm Sat: 9:00 am - 12:00 pm Sun Closed","Fax: (540) 667-9187",,"debit, master card, visa",,,http://www.bbt.com/bbtdotcom/locator/details/,"Specialties: Online Banking, Financial Planning, Checking Accounts, Business Checking Accounts, Business Loans, Business Credit Cards, Savings Accounts, Personal Loans, Home Equity Lines of Credit, Credit Cards, Mortgages",,,,,,,,
17492246,2550381,"2020-09-27 06:37:54","Tuscola National Bank",http://www.tuscolanational.com,support@tuscolanational.com,"(217) 253-4711","900 Progress Blvd",Tuscola,IL,61953,"900 Progress Blvd,Tuscola,IL 61953","ATM Locations, Banks, Commercial & Savings Banks, Loans",,,,39.79155,-88.27026,,,,"Mon - Sun: Open 24 Hours","Phone: (217) 256-4711 TollFree: (800) 952-3186",,,,"Tuscola National Bank Atm",http://www.tuscolanational.com,,,,,,,,,
17492255,2550385,"2020-09-27 06:37:54","Sterling Bank",http://www.bankwithsterling.com,customer.care@bankwithsterling.com,"(360) 759-3506","415 SE 177th Ave",Vancouver,WA,98683,"415 SE 177th Ave,Vancouver,WA 98683","Commercial & Savings Banks, ATM Locations, Banks",,,,45.61901,-122.48959,,,,,,,,,"Sterling Bank ATM","http://www.bankwithsterling.com http://sterlingbank.com",,,,,,,,,
17492283,2550394,"2020-09-27 06:37:54","Midwest Independent Bank",,contact.us@mibanc.com,"(573) 636-9555","910 Weathered Rock Rd","Jefferson City",MO,65101,"910 Weathered Rock Rd,Jefferson City,MO 65101","Commercial & Savings Banks, ATM Locations, Banks, Financial Services, Loans, Savings & Loan Associations",,,,38.54148,-92.1922,https://i2.ypcdn.com/blob/6ecd56bbc2af859981ecd66e3cf8585a0fba3298_100x100_crop.jpg?f9d23e1,,"MIB is a В“bankersВ’ bankВ” which provides a wide array of correspondent banking services to close to 525 financial institutions throughout the Midwest. Based in Jefferson City, MIBВ’s banking services are provided exclusively to financial institutions.","Mon Closed Tue - Fri: 8:00 am - 5:00 pm Sat - Sun Closed","TollFree: (800) 347-4642",,,,,,,,,,,,,,