business_x_category.id,business.id,business.ts,business.business_name,business.home_page,business.email_address,business.phone,business.street,business.city,business.state,business.zip_code,business.full_address,business.category,business.rating,business.number_of_reviews,business.bbb_rating_or_license,business.latitude,business.longitude,business.cover_image,business.slogan,business.general_info,business.regular_hours,business.extra_phones,business.services_products,business.payment,business.price_range,business.aka,business.other_links,business.other_information,business.review_1_name,business.review_1_date,business.review_1_rating,business.review_1_text,business.review_2_name,business.review_2_date,business.review_2_rating,business.review_2_text
17492573,2550505,"2020-09-27 06:37:54","CB&S Bank",,cbsbank@cbsbank.com,"(205) 993-5315","2975 Hough Rd",Florence,AL,35630,"2975 Hough Rd,Florence,AL 35630","Banks, ATM Locations, Commercial & Savings Banks, Financial Services, Financing Services, Investments, Loans, Mortgages, Real Estate Loans",,,,34.83653,-87.62769,https://i2.ypcdn.com/blob/9043d3f73a07cd2925dda26ec5be572b86a659d1_100x100_crop.jpg?f9d23e1,,,"Mon - Tue: 8:00 am - 5:00 pm Wed: 8:00 am - 4:00 pm Thu: 8:00 am - 5:00 pm Fri: 8:00 am - 6:00 pm Sat: 8:00 am - 12:00 pm Sun: Open 24 Hours","Phone: (256) 314-4340 Phone: (256) 764-4757 Phone: (256) 760-9004 Phone: (256) 314-4370 TollFree: (888) 331-2232",,,,,,,,,,,,,,
17492581,2550507,"2020-09-27 06:37:54","Banterra Bank",http://www.banterra.com,careers@banterra.com,"(618) 242-9070","3520 Broadway St","Mount Vernon",IL,62864,"3520 Broadway St,Mount Vernon,IL 62864","Commercial & Savings Banks, ATM Locations, Banks, Financing Services, Loans",,,,38.3147,-88.93733,,,,"Mon - Fri: 8:30 am - 4:00 pm Sat - Sun Closed","Phone: (618) 242-9245 Fax: (618) 242-9245 Fax Number: (618) 242-9245 TollFree: (877) 541-2265",,"master card, visa",,"Bantera Bank Banterra Bank ATM Bantera Corporation","http://www.banterra.com http://www.banterrabank.com",,,,,,,,,
17492591,2550509,"2020-09-27 06:37:54","National Exchange Bank & Trust",http://nebat.com,,"(920) 398-2193","N1894 State Road 44 73",Markesan,WI,53946,"N1894 State Road 44 73,Markesan,WI 53946","Commercial & Savings Banks, ATM Locations",,,,43.6977,-89.05118,,,,,,,"master card, visa, debit",,"National Exchange Bank ATM",http://nebat.com,,,,,,,,,
17492601,2550512,"2020-09-27 06:37:54","Bank of America Financial Center",https://www.bankofamerica.com,,"(703) 913-4220","8332 Old Keene Mill Rd",Springfield,VA,22152,"8332 Old Keene Mill Rd,Springfield,VA 22152","Banks, ATM Locations, Commercial & Savings Banks, Loans",,,,38.78048,-77.23312,https://i2.ypcdn.com/blob/3a79f235d7941cc9916f72ed93b9c38968b966b8_100x100_crop.jpg?f9d23e1,"LIFE'S BETTER WHEN WE'RE CONNECTED","Welcome to Bank of America in Springfield, VA, home to a variety of your financial needs including checking and savings accounts, online banking, mobile and text banking, student banking and credit cards. You have full access to your Bank of America accounts at any of our more than 5,000 banking centers nationwide. When you visit our financial centers, our knowledgeable associates and welcoming environment will make you feel at home.Easy access for everyone: Handicap accessible parking spaces, Handicap accessible restrooms and Braille signage (where available), Ramps in locations with steps, Easy-to-open doors, Handicap accessible safe deposit box rooms.","Sun:- Mon:9-5 Tue:9-5 Wed:9-5 Thu:9-5 Fri:9-6 Sat:9-12","Phone: (571) 421-7259 Fax: (703) 866-3875 Fax Number: (703) 866-3875 TollFree: (800) 432-1000",,,,"Bank of America ATM Bank of America Mortgage",https://www.bankofamerica.com,,,,,,,,,
17492608,2550514,"2020-09-27 06:37:54",BB&T,https://www.bbt.com/locator/search.page,,"(757) 229-4191","300 Second St",Williamsburg,VA,23185,"300 Second St,Williamsburg,VA 23185","Banks, ATM Locations, Commercial & Savings Banks, Financing Services, Loans, Mortgages",,,,37.27434,-76.68477,https://i2.ypcdn.com/blob/d4c0633234e29f779c9f6b32e94be15f65f329cd_100x100_crop.jpg?f9d23e1,,"BB&T is one of the largest financial services holding companies in the U.S. Based in Winston-Salem, N.C., the company operates 2,139 financial centers in 15 states and Washington, D.C., and offers a full range of consumer and commercial banking, securities brokerage, asset management, mortgage and insurance products and services. A Fortune 500 company, BB&T is consistently recognized for outstanding client satisfaction by the U.S. Small Business Administration, Greenwich Associates and others. BB&T has also been named one of the WorldВ’s Strongest Banks by Bloomberg Markets Magazine, one of the top three in the U.S. and in the top 15 globally. More information about BB&T and its full line of products and services is available on our website.","Mon - Thu: 9:00 am - 5:00 pm Fri: 9:00 am - 6:00 pm Sat - Sun Closed","Fax: (757) 565-5897",,debit,,,https://www.bbt.com/locator/search.page,,,,,,,,,
17492615,2550516,"2020-09-27 06:37:54","Bank of America",https://www.bankofamerica.com,,"(425) 355-0116","3800 Harbour Pointe Blvd SW",Mukilteo,WA,98275,"3800 Harbour Pointe Blvd SW,Mukilteo,WA 98275","Banks, ATM Locations, Commercial & Savings Banks, Loans",,,,47.88908,-122.28534,https://i2.ypcdn.com/blob/3a79f235d7941cc9916f72ed93b9c38968b966b8_100x100_crop.jpg?f9d23e1,"Life's better when we're connected.","Welcome to Bank of America in Mukilteo, WA, home to a variety of your financial needs including checking and savings accounts, online banking, mobile and text banking, student banking and credit cards. You have full access to your Bank of America accounts at any of our more than 5,000 banking centers nationwide. When you visit our financial centers, our knowledgeable associates and welcoming environment will make you feel at home.Easy access for everyone: Handicap accessible parking spaces, Handicap accessible restrooms and Braille signage (where available), Ramps in locations with steps, Easy-to-open doors, Handicap accessible safe deposit box rooms.","Sun:- Mon:10-6 Tue:10-6 Wed:10-6 Thu:10-6 Fri:10-6 Sat:10-1","Phone: (425) 350-8650 Primary Phone: (425) 789-3427 Phone: (425) 361-3823 Fax: (425) 493-6426 Fax Number: (425) 493-6426 TollFree: (800) 432-1000",,"debit, master card, visa",,"Bank of America Financial Center Bank of America Mortgage",https://www.bankofamerica.com,,,,,,,,,
17492625,2550521,"2020-09-27 06:37:54","Bank of America",https://www.bankofamerica.com,,"(203) 852-6643","50 N Main St",Norwalk,CT,06854,"50 N Main St,Norwalk,CT 06854","Banks, ATM Locations, Commercial & Savings Banks, Loans",,,,41.10021,-73.41932,https://i2.ypcdn.com/blob/3a79f235d7941cc9916f72ed93b9c38968b966b8_100x100_crop.jpg?f9d23e1,"LIFE'S BETTER WHEN WE'RE CONNECTED","Welcome to Bank of America in Norwalk, CT, home to a variety of your financial needs including checking and savings accounts, online banking, mobile and text banking, student banking and credit cards. You have full access to your Bank of America accounts at any of our more than 5,000 banking centers nationwide. When you visit our financial centers, our knowledgeable associates and welcoming environment will make you feel at home.Easy access for everyone: Handicap accessible parking spaces, Handicap accessible restrooms and Braille signage (where available), Ramps in locations with steps, Easy-to-open doors, Handicap accessible safe deposit box rooms.","Sun:- Mon:9-4 Tue:9-4 Wed:9-4 Thu:9-4 Fri:9-6 Sat:9-12","Phone: (203) 523-4653 Fax Number: (203) 523-4653 Fax: (203) 523-4653 TollFree: (800) 432-1000",,debit,,"Bank of America Financial Center Bank of America ATM",https://www.bankofamerica.com,,,,,,,,,
17492635,2550528,"2020-09-27 06:37:54","First Commonwealth Bank",http://www.fcbanking.com,cbc@fcbanking.com,"(724) 463-5655","1164 Philadelphia St",Indiana,PA,15701,"1164 Philadelphia St,Indiana,PA 15701","Commercial & Savings Banks, ATM Locations, Banks",,,,40.62284,-79.16249,,,,"Mon - Fri: 8:30 am - 6:00 pm Sat: 8:30 am - 12:00 pm","Phone: (724) 463-5748 Fax Number: (724) 463-5748 Fax: (724) 463-5748",,,,"First Commonwealth Bank ATM","http://www.fcbanking.com http://fcbanking.com/INDEX.HTML",,,,,,,,,
17492641,2550530,"2020-09-27 06:37:54","BankFirst Financial Services",http://www.bankfirstfs.com,lmanning@bankfirstfs.com,"(662) 323-3995","1000 Highway 12 W",Starkville,MS,39759,"1000 Highway 12 W,Starkville,MS 39759","Banks, ATM Locations, Commercial & Savings Banks, Credit Card Companies, Credit Card-Merchant Services, Financial Services, Financing Services, Internet Banking, Loans, Money Transfer Service, Mortgages, Real Estate Loan Processing, Real Estate Loans",,,,33.44409,-88.84889,,,"Founded in 1888, BankFirst is driven by strong values and a long-term, disciplined perspective that emphasizes our commitment to providing high-quality financial products and services as well as delivering exceptional customer service. We are passionate about supporting our communities through socially responsible leadership and cultivating a strong and positive corporate culture. Backed with a long history of strength and security, BankFirst continues to provide innovative products and services designed to meet customersВ’ needs, while helping communities to prosper and grow.",Hours,"Client Contact Center: (877) 441-2784",,"all major credit cards, visa, mastercard",,"BankFirst ATM BankFirst Equipment Finance","Primary Website",,,,,,,,,
17492666,2550535,"2020-09-27 06:37:54","Bank Of America",https://www.bankofamerica.com,,"(336) 721-4500","1300 E 5th St","Winston Salem",NC,27101,"1300 E 5th St,Winston Salem,NC 27101","Banks, ATM Locations, Commercial & Savings Banks, Loans",,,,36.0997,-80.22996,https://i2.ypcdn.com/blob/3a79f235d7941cc9916f72ed93b9c38968b966b8_100x100_crop.jpg?f9d23e1,,,"Mon - Thu: 10:00 am - 5:00 pm Fri: 9:00 am - 6:00 pm",,,debit,,,https://www.bankofamerica.com,,,,,,,,,
17492677,2550540,"2020-09-27 06:37:54","Frost - Tarrytown",https://www.frostbank.com/locations#gid=72,webhelp@frostbank.com,"(512) 473-4343","2425 Exposition Blvd",Austin,TX,78703,"2425 Exposition Blvd,Austin,TX 78703","Banks, ATM Locations, Commercial & Savings Banks, Financial Planners, Financial Services, Internet Banking, Loans, Mortgages, Real Estate Loans",,,,30.29746,-97.76714,,"Banking. Investments. Insurance.","Texas roots. World-class service. From banking and insurance to all your investment needs, Frost is here for you. Literally. If you're in Texas, chances are there's a Frost nearby with folks you can trust to navigate you through any financial decision, no matter how simple or complicated. And because we put people first, you'll get the kind of customer service Frost has been known for since we first started serving this great state six generations ago. You'll also be able to take advantage of our time-tested, disciplined approach to helping you make the right financial decisions for your money.","Mon - Fri: 9:00 am - 6:00 pm Sat: 9:00 am - 2:00 pm",,,"debit, cash",,,https://www.frostbank.com/locations#gid=72,,,,,,,,,
17492684,2550541,"2020-09-27 06:37:54","First Merchants Bank",http://www.firstmerchants.com,customerservice@firstmerchants.com,"(812) 988-1200","189 Commercial St",Nashville,IN,47448,"189 Commercial St,Nashville,IN 47448","Commercial & Savings Banks, ATM Locations, Banks, Financial Services, Insurance, Mortgages",,,,39.20905,-86.24346,,,,,"TollFree: (800) 205-3464",,,,,http://www.firstmerchants.com,,,,,,,,,
17492701,2550549,"2020-09-27 06:37:54","Citizens Bank",http://www.greenleaf-fg.com,gisprod@citizensbank.com,"(401) 437-2363","965 County Rd",Barrington,RI,02806,"965 County Rd,Barrington,RI 02806","Commercial & Savings Banks, ATM Locations, Banks",,,,41.75908,-71.34034,,,"At Citizens Bank, we are here to help you bank better. So, if you have a question about buying a house, paying for college, saving for retirement, taking on debt in a smart way or any other question about money, donВ’t keep it to yourself. Ask a Citizen. We have approximately 1,150 Citizens Bank branches in 11 states and approximately 3,300 ATMs. In addition, our customers stay connected with us 24/7 online, through our award-winning mobile app and via our round-the-clock customer contact center. Member FDIC. Equal Housing Lender.","Mon - Thu: 9:00 am - 5:00 pm Fri: 9:00 am - 6:00 pm Sat: 9:00 am - 1:00 pm",,,"debit, all major credit cards",,,http://www.greenleaf-fg.com,,,,,,,,,
17492707,2550552,"2020-09-27 06:37:54","Chattahoochee Bank of Georgia",https://www.entegrabank.com/myentegrabank/welcome,,"(770) 536-0607","643 Ee Butler Pkwy",Gainesville,GA,30501,"643 Ee Butler Pkwy,Gainesville,GA 30501","ATM Locations, Commercial & Savings Banks",,,,34.29668,-83.81936,,,,,"Primary Phone: (770) 535-0780 TollFree: (800) 388-6686",,"amex, cash, check, debit, diners club, discover, master card, visa",,"Chattahoochee Bank of Georgia ATM Chattahoochee Bank Of Ga","https://www.entegrabank.com/myentegrabank/welcome http://www.chattahoocheebank.com",,,,,,,,,
17492712,2550555,"2020-09-27 06:37:54","Heritage Bank",https://local.heritagebanknw.com/wa/stanwood/26317-72nd-avenue-nw,Support@HeritageBankNW.com,"(360) 629-9800","26317 72nd Avenue Northwest",Stanwood,WA,98292,"26317 72nd Avenue Northwest,Stanwood,WA 98292","Commercial & Savings Banks, ATM Locations, Banks, Financial Services, Financing Services, Mortgages, Real Estate Loans",,,,48.23511,-122.33017,https://i2.ypcdn.com/blob/0e09fc26030e75fce3d5591e12376b29dc3f06c8_100x100_crop.jpg?f9d23e1,,"Heritage Bank serves customers like you. Your neighbors. The couple who owns the storefront across town. The customers we serve bring their unique heritageВ—and unique needsВ—to our bank. To help our customers achieve their goals, we offer a complete array of banking services and tools for businesses as well as individuals. Our focus is on our communities: helping customers who haveВ—or will buildВ—their heritage in our local markets.","Mon - Thu: 9:00 am - 5:00 pm Fri: 9:00 am - 5:30 pm","Fax: (888) 360-0059 TollFree: (800) 455-6126",,,,,website,,,,,,,,,
17492725,2550557,"2020-09-27 06:37:54",ATM,http://maps.capitalone.com/locator/LocationDetail.action?id=82888&address&city&state&zip=20742&searchType=atmSearch&accountType=capitaloneAcct&locationType=capitalOne&useRadius=25,,"(800) 262-5689","7603 Baltimore Ave","College Park",MD,20740,"7603 Baltimore Ave,College Park,MD 20740","ATM Locations, Banks, Commercial & Savings Banks",,,,38.996304,-76.92989,https://i2.ypcdn.com/blob/2b4b3152857dbec63168e930087be84043f66ba5_100x100_crop.jpg?f9d23e1,,,,,,debit,,"Capital One Bank ATM","http://maps.capitalone.com/locator/LocationDetail.action?id=82888&address&city&state&zip=20742&searchType=atmSearch&accountType=capitaloneAcct&locationType=capitalOne&useRadius=25 https://network.americanexpress.com/globalnetwork/atm_locator/en https://locations.capitalone.com",,,,,,,,,
17492729,2550561,"2020-09-27 06:37:54","Academy Bank",https://www.academybank.com/locations/locations.cfm,,"(877) 712-2265","301 E Cooper Blvd",Warrensburg,MO,64093,"301 E Cooper Blvd,Warrensburg,MO 64093","Commercial & Savings Banks, ATM Locations, Banks, Loans",,,,38.78053,-93.73531,https://i2.ypcdn.com/blob/e98b69be71f596b3d342b6021d840449a2d034f8_100x100_crop.jpg?f9d23e1,,"Enjoy fast, easy personal banking in Warrensburg, MO , with Academy Bank. Academy Bank offers checking and savings accounts, money markets, CDs, mortgage loans, home equity lines of credit, business loans, commercial banking and more. Bank in person at this branch located in Walmart. Convenient online and mobile banking also available.","Mon - Fri: 9:00 am - 7:00 pm Sat: 9:00 am - 5:00 pm Sun: 11:00 am - 4:00 pm",,,"financing available",,,https://www.academybank.com/locations/locations.cfm,,,,,,,,,
17492737,2550565,"2020-09-27 06:37:54","Southern Bank - Wilson",https://www.southernbank.com,customerservice@carterbankandtrust.com,"(252) 206-5510","1701 Forest Hills Rd W",Wilson,NC,27893,"1701 Forest Hills Rd W,Wilson,NC 27893","Commercial & Savings Banks, ATM Locations, Banks, Financial Services, Loans, Mortgages, Real Estate Loans",,,,35.72104,-77.95274,https://i2.ypcdn.com/blob/f87c0202aaeda87f871758d1a0e0bddac5024ea2_100x100_crop.jpg?f9d23e1,,"Genuine concern for the customer is our top priority, striving to create and deliver superior value in the financial services we provide by exceeding the expectations of our customers. We are dedicated to the communities we serve, both in spirit and support. We provide a progressive and rewarding working environment for our employees that encourages the investment of their time, energy, and talents to the betterment of their communities. We embrace sound banking philosophies that incorporate dedication to relationships, strong business values, and financial integrity while advocating the maintenance of quality assets and reasonable return on shareholder investment.","Mon - Thu: 9:00 am - 5:00 pm Fri: 9:00 am - 6:00 pm Sat - Sun Closed",,,debit,,,https://www.southernbank.com/,,,,,,,,,
17492749,2550567,"2020-09-27 06:37:54","Umpqua Bank",https://www.umpquabank.com,creativeservices@umpquabank.com,"(530) 623-6901","641 S Miner St",Weaverville,CA,96093,"641 S Miner St,Weaverville,CA 96093","Banks, ATM Locations, Commercial & Savings Banks, Credit Card-Merchant Services, Internet Banking, Investment Management, Loans",,,,40.7317,-122.9353,,,,"Mon - Fri: 9:00 am - 5:00 pm",,,"visa, amex, discover, mastercard",,,https://www.umpquabank.com,,,,,,,,,
17492755,2550569,"2020-09-27 06:37:54","Academy Bank",https://www.academybank.com/location/ozark?utm_source=ExtNet&utm_medium=Yext,,"(877) 712-2265","2004 W Marler Ln",Ozark,MO,65721,"2004 W Marler Ln,Ozark,MO 65721","Commercial & Savings Banks, ATM Locations, Banks, Mutual Funds",1,"1 Review",,37.00192,-93.22815,https://i2.ypcdn.com/blob/1c9464ce71f21e048b5bb202ccf6c66cef037ed2_100x100_crop.jpg?f9d23e1,,"Enjoy fast, easy personal banking in Ozark, MO , with Academy Bank. Academy Bank offers checking and savings accounts, money markets, CDs, mortgage loans, home equity lines of credit, business loans, commercial banking and more. Bank in person at this branch located in Walmart. Convenient online and mobile banking also available.","Mon - Fri: 9:00 am - 7:00 pm Sat: 9:00 am - 5:00 pm Sun: 11:00 am - 4:00 pm",,,"financing available",,,https://www.academybank.com/location/ozark,,"Danny B.",03/04/2016,one,"they suck.can't get them on the phone there are new people working every month.atm card has takinen over 3 weeks.",,,,
17492768,2550574,"2020-09-27 06:37:54","Frost - McAllen Nolana",http://www.frostbank.com/locations,webhelp@frostbank.com,"(956) 668-3100","1301 E Nolana Ave",McAllen,TX,78504,"1301 E Nolana Ave,McAllen,TX 78504","Banks, ATM Locations, Commercial & Savings Banks, Financial Planners, Financial Services, Internet Banking, Loans, Mortgages, Real Estate Loans",,,,26.23977,-98.22766,,"Banking. Investments. Insurance.","Texas roots. World-class service. From banking and insurance to all your investment needs, Frost is here for you. Literally. If you're in Texas, chances are there's a Frost nearby with folks you can trust to navigate you through any financial decision, no matter how simple or complicated. And because we put people first, you'll get the kind of customer service Frost has been known for since we first started serving this great state six generations ago. You'll also be able to take advantage of our time-tested, disciplined approach to helping you make the right financial decisions for your money.","Mon - Thu: 9:00 am - 5:00 pm Fri: 9:00 am - 6:00 pm Sat: 9:00 am - 2:00 pm Sun Closed",,,debit,,,http://www.frostbank.com/locations,,,,,,,,,
17492779,2550576,"2020-09-27 06:37:54","Bank of America Financial Center",https://www.bankofamerica.com,,"(770) 491-5420","4144 Lavista Rd",Tucker,GA,30084,"4144 Lavista Rd,Tucker,GA 30084","Banks, ATM Locations, Commercial & Savings Banks, Loans",,,,33.84694,-84.24934,https://i2.ypcdn.com/blob/259ab436af59daa8db29138788f9749407e5697b_100x100_crop.jpg?f9d23e1,"LIFE'S BETTER WHEN WE'RE CONNECTED","Welcome to Bank of America in Tucker, GA, home to a variety of your financial needs including checking and savings accounts, online banking, mobile and text banking, student banking and credit cards. You have full access to your Bank of America accounts at any of our more than 5,000 banking centers nationwide. When you visit our financial centers, our knowledgeable associates and welcoming environment will make you feel at home.Easy access for everyone: Handicap accessible parking spaces, Handicap accessible restrooms and Braille signage (where available), Ramps in locations with steps, Easy-to-open doors, Handicap accessible safe deposit box rooms.","Sun:- Mon:9-4 Tue:9-4 Wed:9-4 Thu:9-4 Fri:9-6 Sat:9-1","Phone: (678) 274-2391 Fax: (678) 502-5776 Fax Number: (678) 502-5776 TollFree: (800) 432-1000",,"all major credit cards, debit, master card, visa",,"Bank of America Mortgage",https://www.bankofamerica.com,,,,,,,,,
17492785,2550578,"2020-09-27 06:37:54","RBFCU - Credit Union",https://www.rbfcu.org/BranchMaps/branches.do?recordId=BR00000017,memberservices@rbfcu.org,"(830) 221-1080","1870 W State Highway 46","New Braunfels",TX,78132,"1870 W State Highway 46,New Braunfels,TX 78132","Credit Unions, ATM Locations, Banks, Commercial & Savings Banks, Financial Planning Consultants, Financial Services, Loans, Mortgages",,,,29.72035,-98.16566,https://i2.ypcdn.com/blob/dde7337d61f9d28b63e79f727549d8587b6d8e01_100x100_crop.jpg?f9d23e1,"Save Time, Save Money, Earn Money","Randolph-Brooks Federal Credit Union (RBFCU), is a credit union and financial cooperative operating across Texas. RBFCU is committed to serving our members` financial needs and providing low-cost, high-value financial resources. Our many locations offer drive-thru ATMs, mobile banking, loans, checking, savings, CDs, credit cards, safety deposit boxes and more. RBFCU also offers a variety of loan options for credit union members to meet all of your personal loan needs. We provide auto loans, home equity loans, business loans, mortgage loans and credit cards. Use our loan calculators to determine the loan that`s right for you. And, with RBFCU, you have access to fast and secure online banking and mobile banking in addition to brick and mortar locations. RBFCU is a non-for-profit financial cooperative, owned by our members and devoted to helping them save time, save money and earn money. Visit our website to become a member of RBFCU and start saving today!","Mon - Fri: 9:00 am - 5:00 pm Sat: 9:00 am - 4:00 pm Sun Closed","TollFree: (800) 580-3300",,"mastercard, visa, amex, discover, check, all major credit cards, financing available, insurance, travelers checks, cash, atm",,,"Primary Website","Services: Online Banking, Checking Accounts, Savings Accounts, Credit Union&#10.Accounts, Auto Loans, Home Equity Loans, Credit Cards, Mortgage Loans, Business&#10.Loans, Student Loans, Signature Loans, Line of Credit Loans, Member Discounts, 20&#10.Year Mortgage Loans, 30 Year Mortgage Loans, Title Insurance Services, Investments,&#10.Auto Insurance, Life Insurance, Travel Insurance, Financial Consulting, Business&#10.Services, Business Lending, Retirement Consulting, Loan Calculators",,,,,,,,