business_x_category.id,business.id,business.ts,business.business_name,business.home_page,business.email_address,business.phone,business.street,business.city,business.state,business.zip_code,business.full_address,business.category,business.rating,business.number_of_reviews,business.bbb_rating_or_license,business.latitude,business.longitude,business.cover_image,business.slogan,business.general_info,business.regular_hours,business.extra_phones,business.services_products,business.payment,business.price_range,business.aka,business.other_links,business.other_information,business.review_1_name,business.review_1_date,business.review_1_rating,business.review_1_text,business.review_2_name,business.review_2_date,business.review_2_rating,business.review_2_text
520499,176216,"2020-09-27 02:47:36","Somali Community Ctr-Illinois",http://www.scci-us.org,,"(773) 961-7511","6355 N Broadway St Ste 17",Chicago,IL,60660,"6355 N Broadway St Ste 17,Chicago,IL 60660","Community Centers, Community Organizations",,,,41.99794,-87.66038,,,,,,,,,,http://www.scci-us.org,,,,,,,,,
520505,176219,"2020-09-27 02:47:36","A.V. Sorensen Community Center",http://www.cityofomaha.org/parks/community-centers/av-sorensen,,"(402) 444-5900","4808 Cass St",Omaha,NE,68132,"4808 Cass St,Omaha,NE 68132","Community Centers, Community Organizations, Recreation Centers",,,,41.26349,-95.98627,,,,"Mon - Tue: 9:00 am - 7:00 pm Wed - Thu: 9:00 am - 8:30 pm Fri: 9:00 am - 5:00 pm","Reserve Picnic Shelters: (402) 444-6733 Open Space Rental: (402) 444-4653 Park Maintenance: (402) 444-5955 Volunteering: (402) 444-6733 Wedding Reservations: (402) 444-5920 Fax: (402) 444-4921",,,,"City of Omaha Parks Department","http://www.cityofomaha.org/parks/community-centers/av-sorensen Resevation URL",,,,,,,,,
520512,176222,"2020-09-27 02:47:36","Tulare Community Ctr",,,"(559) 685-2380","846 W Prosperity Ave",Tulare,CA,93274,"846 W Prosperity Ave,Tulare,CA 93274","Community Centers",,,,36.22609,-119.36001,,,,"Mon - Fri: 4:00 pm - 8:00 pm",,,,,,,,,,,,,,,
520513,176223,"2020-09-27 02:47:36","Hanska Community Ctr",http://cityofhanska.com,hanskarp@hotmail.com,"(507) 439-6248","201 Broadway",Hanska,MN,56041,"201 Broadway,Hanska,MN 56041","Community Centers, City, Village & Township Government, Community Organizations, Recreation Centers",,,,44.1488,-94.49427,,,,"Mon: 9:00 am - 5:00 pm Tue - Wed: 12:00 pm - 5:00 pm Thu: 2:00 pm - 6:00 pm",,,,,,"http://cityofhanska.com http://cityofhanska.com/community-library",,,,,,,,,
520518,176224,"2020-09-27 02:47:36","Bethlehem Community Center",,,"(803) 807-9585","2500 Elmwood Ave",Columbia,SC,29204,"2500 Elmwood Ave,Columbia,SC 29204","Community Centers, Recreation Centers",,,,34.01878,-81.0176,,,,,,,,,,,,,,,,,,,
520571,176248,"2020-09-27 02:47:36","Love Community Ctr",,,"(260) 420-5061","1331 E Berry St","Fort Wayne",IN,46803,"1331 E Berry St,Fort Wayne,IN 46803","Community Centers, Community Organizations",,,,41.081047,-85.12074,,,,,,,,,,,,,,,,,,,
520575,176250,"2020-09-27 02:47:36","Restorative Justice Community Center",,,"(575) 534-0336","505 N Bullard St Ste A","Silver City",NM,88061,"505 N Bullard St Ste A,Silver City,NM 88061","Community Centers",,,,32.772057,-108.27617,,,,,,,,,,,,,,,,,,,
520587,176256,"2020-09-27 02:47:36","Woodlake Community Ctr",http://portal.cityofsacramento.org/ParksandRec/Community-Centers/WoodlakeClubhouse,,"(916) 808-1571","500 Arden Way",Sacramento,CA,95815,"500 Arden Way,Sacramento,CA 95815","Community Centers, Banquet Halls & Reception Facilities, City, Village & Township Government, Halls, Auditoriums & Ballrooms, Wedding Reception Locations & Services",,,,38.60553,-121.45505,https://i3.ypcdn.com/blob/e18ff3196220b5e3f3004db2ed8999da65593d38_100x100_crop.jpg?d9a04b5,,,,,,"amex, cash, check, discover, master card, visa",,"South Natomas Community Ctr Woodlake Community Center",http://portal.cityofsacramento.org/ParksandRec/Community-Centers/WoodlakeClubhouse,,,,,,,,,
520620,176270,"2020-09-27 02:47:36","Jewish Community Ctr",http://www.dsnlive.org,club@ronklingerbridge.com,"(732) 531-9100","100 Grant Ave",Deal,NJ,07723,"100 Grant Ave,Deal,NJ 07723","Community Centers, Community Organizations, Recreation Centers",,,,40.25539,-74.00435,,,,"Mon - Thu: 6:00 am - 11:00 pm Fri: 6:00 am - 7:00 pm Sat: 9:00 pm - 12:00 am Sun: 7:00 am - 10:00 pm",,,,,,"http://www.dsnlive.org http://www.jccjerseyshore.org",,,,,,,,,
520642,176277,"2020-09-27 02:47:36","Loretto Community Center",,,"(814) 472-8995","187 Saint Marys St",Lilly,PA,15938,"187 Saint Marys St,Lilly,PA 15938","Community Centers",,,,40.42089,-78.61823,,,,,,,,,,,,,,,,,,,
520649,176280,"2020-09-27 02:47:36","Home City Community Center",,,"(785) 799-3715","209 N Elm St",Frankfort,KS,66427,"209 N Elm St,Frankfort,KS 66427","Community Centers",,,,39.702366,-96.42062,,,,,,,,,,,,,,,,,,,
520669,176287,"2020-09-27 02:47:36","Northside Community Ctr",,,"(817) 871-5820","1801 Harrington Ave","Fort Worth",TX,76164,"1801 Harrington Ave,Fort Worth,TX 76164","Community Centers, Community Organizations",,,,32.77735,-97.36145,,,,"Mon - Fri: 9:00 am - 9:00 pm Sat - Sun Closed",,,,,,,,,,,,,,,
520671,176288,"2020-09-27 02:47:36","Weidman Community Ctr",,,"(989) 644-2183","5918 W Bridge St",Weidman,MI,48893,"5918 W Bridge St,Weidman,MI 48893","Community Centers, Recreation Centers",,,,43.68869,-84.96661,,,,,,,,,,,,,,,,,,,
520681,176293,"2020-09-27 02:47:36","Redeemer Community Partnership",https://www.redeemercp.org,admin@redeemercp.org,"(323) 733-6173","PO Box 180499","Los Angeles",CA,90018,"PO Box 180499,Los Angeles,CA 90018","Community Centers",,,,34.028973,-118.31517,,,,,,,"paypal, check",,,"https://www.redeemercp.org http://redeemercp.org",,,,,,,,,
520692,176297,"2020-09-27 02:47:36","Stoneybrook Community Center",http://stoneybrookwebsite.com,,"(239) 948-1787","11800 Stoneybrook Golf Dr",Estero,FL,33928,"11800 Stoneybrook Golf Dr,Estero,FL 33928","Community Centers",,,,26.436356,-81.76226,,,,"Mon - Fri: 9:00 am - 5:00 pm",,,"visa, all major credit cards, amex, mastercard, discover",,,"http://stoneybrookwebsite.com http://www6.stoneybrookwebsite.com?s_token=1572455115.0011317494&kw=home&term=search%20real%20estate%20inventory%20management%20software&term=real%20estate%20loans&term=contact%20real%20estate%20agent&backfill=0&tdfs=0","Wheelchair Accessible: Yes Parking: Lot, Free",,,,,,,,
520693,176298,"2020-09-27 02:47:36","El Pueblo De Abiquiu Library and Community Center",,,"(505) 685-4884","PO Box 838",Abiquiu,NM,87510,"PO Box 838,Abiquiu,NM 87510","Community Centers",,,,36.17692,-106.24486,,,,,,,,,,,,,,,,,,,
520701,176301,"2020-09-27 02:47:36","Fisher Community Ctr",http://www.richmondgov.com,,"(804) 646-5609","3701 Garden Rd",Richmond,VA,23235,"3701 Garden Rd,Richmond,VA 23235","Community Centers, Community Organizations",,,,37.54661,-77.58276,,,,"Mon: 8:00 am - 5:00 pm Tue - Thu: 7:30 am - 5:00 pm Fri: 8:00 am - 5:00 pm",,,,,,http://www.richmondgov.com,,,,,,,,,
520703,176302,"2020-09-27 02:47:36","Peppermill Community Center",http://www.pgparks.com,,"(301) 350-8410","610 Hill Rd",Hyattsville,MD,20785,"610 Hill Rd,Hyattsville,MD 20785","Community Centers, Community Organizations, Parks, Recreation Centers",,,,38.89851,-76.88432,,,,"Mon: 10:00 am - 9:00 pm Tue: 12:00 pm - 9:00 pm Wed: 10:00 am - 9:00 pm Thu: 12:00 pm - 9:00 pm Fri: 10:00 am - 9:00 pm Sat: 9:00 am - 1:00 pm Sun Closed",,,"amex, cash, discover, master card, visa",,,http://www.pgparks.com,,,,,,,,,
520709,176305,"2020-09-27 02:47:36","Sebastopol Community Center",http://www.seb.org,scc@seb.org,"(707) 823-1511","390 Morris St",Sebastopol,CA,95472,"390 Morris St,Sebastopol,CA 95472","Community Centers, City, Village & Township Government, Community Organizations, Recreation Centers",,,,38.40646,-122.81993,,,,"Tue - Fri: 10:00 am - 4:00 pm",,,"visa, amex, cash, discover, master card",,,"http://www.seb.org https://seb.org",,,,,,,,,
520714,176306,"2020-09-27 02:47:36","Community Center",,,"(320) 967-4594","MAIN St",Raymond,MN,56282,"MAIN St,Raymond,MN 56282","Community Centers, Community Organizations",,,,44.955074,-95.366234,,,,"Mon - Fri: 8:00 am - 5:00 pm",,,,,,,,,,,,,,,
520716,176307,"2020-09-27 02:47:36","Open Arms Community Center",,,"(305) 263-3259","5840 SW 8th St","West Miami",FL,33144,"5840 SW 8th St,West Miami,FL 33144","Community Centers",,,,,,,,,,,,,,,,,,,,,,,,
520722,176309,"2020-09-27 02:47:36","Pioneer Community Ctr",http://orcity.org,,"(503) 657-8287","615 5th St","Oregon City",OR,97045,"615 5th St,Oregon City,OR 97045","Community Centers, Community Organizations",,,,45.35502,-122.60576,https://i3.ypcdn.com/blob/0bd7a2452cecfc7e9e7412d65334d33d008aa1f6_100x100_crop.jpg?d9a04b5,,,"Mon - Fri: 8:00 am - 5:00 pm Sat: 10:00 am - 6:00 pm Sun: 12:00 pm - 5:00 pm",,,,,,http://orcity.org,,,,,,,,,
520729,176311,"2020-09-27 02:47:36","Holland Community Center",http://www.townofhollandny.com/community-center-and-town-park,,"(716) 537-9401","3 Legion Dr",Holland,NY,14080,"3 Legion Dr,Holland,NY 14080","Community Centers, Community Organizations, Recreation Centers",,,,42.647038,-78.543884,,,,,,,,,,http://www.townofhollandny.com/community-center-and-town-park,,,,,,,,,
520737,176315,"2020-09-27 02:47:36","San Lorenzo Community Center Park",,,"(510) 317-2309","1970 Via Buena Vis","San Lorenzo",CA,94580,"1970 Via Buena Vis,San Lorenzo,CA 94580","Community Centers, Campgrounds & Recreational Vehicle Parks, Community Organizations, County & Parish Government, Recreation Centers",,,,37.664814,-122.141174,,,,,,,,,,,,,,,,,,,
520745,176318,"2020-09-27 02:47:36","Rothsay Community Center",http://www.rothsay.org,isp@rothsay.us,"(218) 867-2254","115 2nd St SW",Rothsay,MN,56579,"115 2nd St SW,Rothsay,MN 56579","Community Centers, Community Organizations",,,,46.474243,-96.28368,,,,"Mon - Fri: 8:00 am - 5:00 pm",,,,,,http://www.rothsay.org,,,,,,,,,
520754,176321,"2020-09-27 02:47:36","Northeast Community Center",http://www.necommunitycenter.org,info@necommunitycenter.org,"(503) 284-3377","1630 NE 38th Ave",Portland,OR,97232,"1630 NE 38th Ave,Portland,OR 97232","Community Centers, Community Organizations, Recreation Centers","4,5","6 Reviews",,45.53491,-122.62367,,,"The Northeast Community Center is a nonprofit organization that offers recreational, educational and physical activities for individuals of all ages. Located in Portland, Ore., the center s facility features a swimming pool, gymnasium, sauna room, cardiovascular equipment unit and free weight area with cable, barbell and dumbbell equipment. It conducts aquatics classes, including arthritis exercise, water fitness, deep water workout and first aid assistance. The Northeast Community Center additionally hosts seasonal camps for youths that include outdoor adventures, movie outings, sports activities, crafts, swimming lessons and creative writing sessions. The center also organizes classes in yoga, hapkaido and tai chi. It offers several confidence building activities, such as unicycling, juggling and stilt walking.","Mon - Fri: 5:30 am - 9:00 pm Sat: 7:00 am - 5:00 pm Sun: 9:00 am - 4:00 pm",,,"all major credit cards, visa, discover, mastercard, amex",,,"http://www.necommunitycenter.org https://necommunitycenter.org","Parking: Free","Mickey Harnage",07/26/2010,five,"This is an all ages facility: FREE child care with activities, children's camps and classes, experienced swim instructors, not teen-agers, zumba, pilates, yoga and aerobics classes for mothers, a full-size gym for basketball for all, and for seniors the best instructor ever who makes exercising fun. NECC is a true community center with a summer arts and crafts fair, fall festival, Halloween party for all kids, a spring flower sale,and a book club open to all members. Prices compare with lesser facilities and no contract and no initiation fee. From a three year member.",yall,07/26/2010,five,"NECC board, staff, volunteers and members are working hard to make the Center the most it can be. Come by and check us out and maybe you too will find it rewarding to take part."
520757,176322,"2020-09-27 02:47:36","Greene Township Community Center",,,"(574) 234-0429","24600 Roosevelt Rd","South Bend",IN,46614,"24600 Roosevelt Rd,South Bend,IN 46614","Community Centers, Community Organizations, Recreation Centers",,,,41.5923,-86.34283,,,,,,,,,,,,,,,,,,,
520764,176325,"2020-09-27 02:47:36","Randolph Community Center",http://www.randolphnj.org/services/senior_general,,"(973) 989-7084","30 Calais Rd",Randolph,NJ,07869,"30 Calais Rd,Randolph,NJ 07869","Community Centers",,,,40.82678,-74.59109,,,,"Mon - Fri: 8:30 am - 4:30 pm","TollFree: (866) 802-0837",,"master card, visa, amex, cash, discover",,"Randolph Community Ctr","http://www.randolphnj.org/services/senior_general http://randolphnj.org",,,,,,,,,
520773,176330,"2020-09-27 02:47:36","International Community Ctr",,,"(574) 534-9403","312 S Main St",Goshen,IN,46526,"312 S Main St,Goshen,IN 46526","Community Centers, Community Organizations, Recreation Centers",,,,41.58306,-85.83395,,,,,,,,,,,,,,,,,,,
520776,176331,"2020-09-27 02:47:36","J Chislom Youth Community Ctr",,,"(518) 357-8583","34 Colby St # 2",Albany,NY,12206,"34 Colby St # 2,Albany,NY 12206","Community Centers",,,,42.67539,-73.78019,,,,,,,,,,,,,,,,,,,
520777,176332,"2020-09-27 02:47:36","Nevin Community Ctr",http://www.ci.richmond.ca.us/2190/Nevin,eric_yee@ci.richmond.ca.us,"(510) 620-6813","598 Nevin Ave",Richmond,CA,94801,"598 Nevin Ave,Richmond,CA 94801","Community Centers, City, Village & Township Government, Community Organizations",,,,37.93683,-122.36373,https://i3.ypcdn.com/blob/d70e70bb108d0522e196ab8bb6e6275af7830181_100x100_crop.jpg?d9a04b5,,,"Mon - Fri: 10:00 am - 5:30 pm Sat: 9:00 am - 10:00 am Sun Closed",,,"cash, check, visa",,,"http://www.ci.richmond.ca.us/2190/Nevin http://ci.richmond.ca.us",,,,,,,,,
520784,176334,"2020-09-27 02:47:36","Allison Jukebox Community Ctr",,shrakea@bloomington.in.gov,"(812) 349-3731","351 S Washington St",Bloomington,IN,47401,"351 S Washington St,Bloomington,IN 47401","Community Centers",,,,39.16328,-86.53238,,,,,,,,,,,"Parking: Street, Lot, Free Wheelchair Accessible: Yes",,,,,,,,
520785,176335,"2020-09-27 02:47:36","Richland County Recreation Commission Community Centers",,,"(803) 754-6720","6429 Bishop Ave",Columbia,SC,29203,"6429 Bishop Ave,Columbia,SC 29203","Community Centers, Community Organizations",,,,34.06666,-81.06082,,,,"Mon - Fri: 8:30 am - 5:00 pm",,,,,,,,,,,,,,,
520791,176338,"2020-09-27 02:47:36","Somali Community Center Of Nashville",,,"(615) 360-9696","295 Plus Park Blvd Ste 102",Nashville,TN,37217,"295 Plus Park Blvd Ste 102,Nashville,TN 37217","Community Centers",,,,36.1309,-86.72545,,,,,,,,,,,,,,,,,,,
520800,176342,"2020-09-27 02:47:36","Orange County Community Center",http://www.extension.purdue.edu/orange,,"(812) 723-9300","1075 N Sandy Hook Rd",Paoli,IN,47454,"1075 N Sandy Hook Rd,Paoli,IN 47454","Community Centers, Community Organizations",,,,38.569,-86.47285,,,,"Mon - Fri: 8:30 am - 4:30 pm",,,"amex, cash, check, discover, master card, visa",,,"http://www.extension.purdue.edu/orange http://occf-in.org",,,,,,,,,
520802,176343,"2020-09-27 02:47:36","Edgemont Community Center",,,"(919) 530-1700","923 Ramseur St",Durham,NC,27701,"923 Ramseur St,Durham,NC 27701","Community Centers, Community Organizations, Recreation Centers",,,,35.986137,-78.892654,,,,,,,,,,,,,,,,,,,
520805,176344,"2020-09-27 02:47:36","Honeybrook Lions Club Community Center - CLOSED",http://www.honeybrooklions.com,,"(610) 273-0300","14 Mount Pleasant Rd","Honey Brook",PA,19344,"14 Mount Pleasant Rd,Honey Brook,PA 19344","Community Centers, Community Organizations",,,,40.07442,-75.917,,,,,,,,,,http://www.honeybrooklions.com,,,,,,,,,
520816,176348,"2020-09-27 02:47:36","Coverdale Community Center",,,"(302) 337-7102","11575 Fisher Cir",Bridgeville,DE,19933,"11575 Fisher Cir,Bridgeville,DE 19933","Community Centers, Community Organizations, Recreation Centers",,,,38.69265,-75.550095,,,,"Mon - Fri: 8:00 am - 5:00 pm",,,,,,,,,,,,,,,
520823,176351,"2020-09-27 02:47:36","Beryl Community Center",,,"(435) 439-5682","291 N Beryl Hwy",Beryl,UT,84714,"291 N Beryl Hwy,Beryl,UT 84714","Community Centers, Community Organizations",,,,37.71272,-113.65615,,,,,,,,,,,,,,,,,,,
520834,176355,"2020-09-27 02:47:36","Jamaica Plain Community Ctr",http://www.jpcommunitycenters.com,online@ymcaboston.org,"(617) 635-5244","144 McBride St","Jamaica Plain",MA,02130,"144 McBride St,Jamaica Plain,MA 02130","Community Centers, Community Organizations",,,,42.30572,-71.10939,,,,,,,,,,"http://www.jpcommunitycenters.com http://jpccalp.wordpress.com",,,,,,,,,
520839,176357,"2020-09-27 02:47:36","Lake Lynn Community Ctr",,,"(919) 870-2911","7921 Ray Rd",Raleigh,NC,27613,"7921 Ray Rd,Raleigh,NC 27613","Community Centers, Community Organizations, Parks, Shelters",,,,35.889366,-78.69598,,,,"Mon - Fri: 9:00 am - 9:00 pm",,,,,,,,,,,,,,,
520845,176360,"2020-09-27 02:47:36","Holy Temple Community Ctr",http://holytemplecogic334.weebly.com/contact.html,htccogic@yahoo.com,"(215) 747-2266","334 N 60th St",Philadelphia,PA,19139,"334 N 60th St,Philadelphia,PA 19139","Community Centers, Camps-Recreational, Community Organizations",,,,39.96767,-75.23987,,,,,"Primary Phone: (215) 476-4999 Phone: (215) 747-2766",,,,,http://holytemplecogic334.weebly.com/contact.html,,,,,,,,,
520853,176363,"2020-09-27 02:47:36","College Park Community Center",http://www.insideview.com/directory/national-park-community-college,scochran@memphispolice.org,"(901) 946-3440","990 College Park Dr",Memphis,TN,38126,"990 College Park Dr,Memphis,TN 38126","Community Centers, Community Organizations",,,,35.1199,-90.03333,,,,,,,check,,,http://www.insideview.com/directory/national-park-community-college,,,,,,,,,
520855,176364,"2020-09-27 02:47:36","Community Center",,,"(503) 769-3425","400 W Virginia St",Stayton,OR,97383,"400 W Virginia St,Stayton,OR 97383","Community Centers, Community Organizations",,,,44.800022,-122.79769,,,,,,,,,,,,,,,,,,,
520858,176366,"2020-09-27 02:47:36","Community Center of Humphrey",http://www.humphreycc.com,,"(402) 923-9000","608 County Rd",Tarnov,NE,68642,"608 County Rd,Tarnov,NE 68642","Community Centers, Community Organizations, Recreation Centers",,,,41.68561,-97.48804,,,,,,,,,,http://www.humphreycc.com,,,,,,,,,
520878,176374,"2020-09-27 02:47:36","Friends Community Center",https://www.friendscommunitycenter.org,,"(323) 463-1601","6910 Santa Monica Blvd.","Los Angeles",CA,90038,"6910 Santa Monica Blvd.,Los Angeles,CA 90038","Community Centers, Community Organizations, Recreation Centers",,,,34.0904,-118.34093,https://i3.ypcdn.com/blob/7cf4c4728d1e57afd7b11d818583cd739afc2b47_100x100_crop.jpg?d9a04b5,,"We work with gay and bisexual men, other men who have sex with men, and transgender individuals who are experiencing multiple health disparities. Our objective is to reduce HIV transmission and acquisition and the risks that can result from substance use.","Mon - Sun: 9:00 am - 5:30 pm",,,,,,"Primary Website",,,,,,,,,
520890,176378,"2020-09-27 02:47:36","Green Cove Community Center",,,"(276) 388-3660","41221 Green Cove Rd",Damascus,VA,24236,"41221 Green Cove Rd,Damascus,VA 24236","Community Centers, Community Organizations, Recreation Centers",,,,36.61902,-81.64484,,,,,,,,,,,,,,,,,,,
520893,176379,"2020-09-27 02:47:36","Centennial Community Center",,,"(715) 678-2000","412 E Fremont Ave",Stetsonville,WI,54480,"412 E Fremont Ave,Stetsonville,WI 54480","Community Centers, Community Organizations",,,,45.07925,-90.31033,,,,,,,"cash only",,,,"Parking: Lot Attire: Casual",,,,,,,,
520900,176381,"2020-09-27 02:47:36","Southern Meadows Community Center",,southernmeadow@i-realty.com,"(302) 751-1227","109 Lavender Dr",Magnolia,DE,19962,"109 Lavender Dr,Magnolia,DE 19962","Community Centers, Community Organizations, Recreation Centers",,,,39.05275,-75.500275,,,,"Mon - Fri: 9:00 am - 5:00 pm",,,,,,,,,,,,,,,
520903,176382,"2020-09-27 02:47:36","Ruby Hill Community Center",http://www.rubyhill.com,membership@rubyhill.com,"(925) 417-0568","2900 Ruby Hill Dr",Pleasanton,CA,94566,"2900 Ruby Hill Dr,Pleasanton,CA 94566","Community Centers, Community Organizations, Recreation Centers",,,,37.645836,-121.81915,,,,"Mon - Fri: 9:00 am - 5:00 pm",,,,,,"http://www.rubyhill.com https://www.rubyhill.com",,,,,,,,,
