business_x_category.id,business.id,business.ts,business.business_name,business.home_page,business.email_address,business.phone,business.street,business.city,business.state,business.zip_code,business.full_address,business.category,business.rating,business.number_of_reviews,business.bbb_rating_or_license,business.latitude,business.longitude,business.cover_image,business.slogan,business.general_info,business.regular_hours,business.extra_phones,business.services_products,business.payment,business.price_range,business.aka,business.other_links,business.other_information,business.review_1_name,business.review_1_date,business.review_1_rating,business.review_1_text,business.review_2_name,business.review_2_date,business.review_2_rating,business.review_2_text
697973,240815,"2020-09-27 02:53:34","Suburban Sealcoating and Snow Plowing",http://suburbansealcoating.com,info@suburbansealcoating.com,"(847) 548-3440","967 Timber Lake Dr",Antioch,IL,60002,"967 Timber Lake Dr,Antioch,IL 60002","Snow Removal Service, Asphalt Paving & Sealcoating, Concrete Contractors, Driveway Contractors, General Contractors, Masonry Contractors, Parking Lot Maintenance & Marking, Paving Contractors",,,,42.45504,-88.04527,,,"Suburban Sealcoating & Snowplowing Inc provides Sealcoating and Paving and Snow Removal to the Antioch, Illinois area.","Mon - Sun: Open 24 Hours",,,"cash, check",,,http://suburbansealcoating.com,,,,,,,,,
698006,240824,"2020-09-27 02:53:34","Public Works Maintenance Division",http://www.ci.benicia.ca.us,jtrimble@ci.benicia.ca.us,"(707) 746-4296","2400 E 2nd St",Benicia,CA,94510,"2400 E 2nd St,Benicia,CA 94510","Parking Lot Maintenance & Marking, Concrete Contractors",,,,38.06236,-122.14688,https://i3.ypcdn.com/blob/598cd51ac33533d324473d66ecdc41f009831100_100x100_crop.jpg?63f80dd,,,,"Fax: (707) 745-5154",,,,,http://www.ci.benicia.ca.us,,,,,,,,,
698016,240831,"2020-09-27 02:53:34","Warrensburg Street Department",http://www.warrensburg-mo.com,,"(660) 747-8274","448 W North St",Warrensburg,MO,64093,"448 W North St,Warrensburg,MO 64093","Parking Lot Maintenance & Marking, Concrete Contractors",,,,38.76784,-93.74952,,,,"Mon - Fri: 5:30 am - 8:30 pm Sat: 8:00 am - 8:00 pm Sun: 12:00 pm - 6:00 pm","TollFree: (800) 276-6287",,"check, debit, discover, master card, visa, cash",,"Warrensburg Street Dept",http://www.warrensburg-mo.com,,,,,,,,,
698020,240832,"2020-09-27 02:53:34","Wep Asphalt",http://wepasphalt.com,sales@wepasphalt.com,"(618) 884-1110","19800 State Route 33 E",Lawrenceville,IL,62439,"19800 State Route 33 E,Lawrenceville,IL 62439","Parking Lot Maintenance & Marking, Asphalt, Asphalt Paving & Sealcoating, Concrete Contractors, Fill Contractors, Snow Removal Service",,,A+,38.73086,-87.6784,,,"RR # 2 , Box 44, 62439","Mon - Fri: 8:00 am - 5:00 pm Sat - Sun Closed","Rick Weidig: (812) 887-9629 Bill Poe - Owner: (812) 890-9000",,"all major credit cards, check",,"Wep Electronics",http://wepasphalt.com,,,,,,,,,
698026,240833,"2020-09-27 02:53:34","Atlantic Advanced Property Services, LLC",,,"(904) 612-0198","549 Acornridge Ln","Orange Park",FL,32065,"549 Acornridge Ln,Orange Park,FL 32065","Parking Lot Maintenance & Marking, Asphalt, Asphalt Paving & Sealcoating, Concrete Contractors, Property Maintenance",,,,30.18511,-81.82132,,,,,,,,,,,,,,,,,,,
698170,240874,"2020-09-27 02:53:34","Advance Asphalt Maintenance",,info@advanceamllc.com,"(614) 276-1000",,Columbus,OH,43204,"Columbus,OH 43204","Parking Lot Maintenance & Marking, Asphalt Paving & Sealcoating, Concrete Contractors, Driveway Contractors, Snow Removal Service",,,,,,,,,"Mon - Wed: 7:00 am - 5:00 pm Thu: 7:00 am - 5:00 am Fri - Sat: 7:00 am - 5:00 pm Sun: 7:00 am - 12:00 pm","Fax: (614) 272-6720",,"company card, amex, discover, all major credit cards, visa, mastercard, diners club, carte blanche, jcb",,,,,,,,,,,,
698195,240883,"2020-09-27 02:53:34","M & A Pavement Striping Co",,,"(225) 927-2611","9409 Wesson St","Baton Rouge",LA,70809,"9409 Wesson St,Baton Rouge,LA 70809","Parking Lot Maintenance & Marking, Concrete Contractors, Parking Lots & Garages, Pavement & Floor Marking Services",,,,30.42525,-91.0838,,,,,,,,,,,,,,,,,,,
698209,240886,"2020-09-27 02:53:34","Four Season Maintenance",http://fourseasonmaintenance.com,fourseason@springgrove.coop,"(507) 498-3567","410 3rd Ave SW","Spring Grove",MN,55974,"410 3rd Ave SW,Spring Grove,MN 55974","Paving Contractors, Asphalt, Asphalt Paving & Sealcoating, Building Contractors-Commercial & Industrial, Concrete Contractors, General Contractors, Masonry Contractors-Commercial & Industrial, Parking Lot Maintenance & Marking, Pavement & Floor Marking Services, Paving Materials, Road Building Contractors, Waterproofing Contractors",,,,43.55531,-91.64311,https://i3.ypcdn.com/blob/940933cd9fcfbafa6b1a3db4677cdb51ff66d1f1_100x100_crop.jpg?63f80dd,,,"Mon - Fri: 8:00 am - 5:00 pm",,,,,,http://fourseasonmaintenance.com,,,,,,,,,
698230,240893,"2020-09-27 02:53:34","Summit Asphalt",,,"(801) 201-1760","1196 Eastridge Rd","Salt Lake City",UT,84157,"1196 Eastridge Rd,Salt Lake City,UT 84157","Asphalt, Asphalt Paving & Sealcoating, Concrete Contractors, Parking Lot Maintenance & Marking, Pavement & Floor Marking Services, Paving Contractors, Paving Materials",,,,40.74309,-111.9581,,,,,"Phone: (801) 990-7269 Phone: (801) 347-9018 Primary Phone: (801) 990-7269",,,,,,,,,,,,,,
698265,240903,"2020-09-27 02:53:34","Markings Inc",http://markingsinc.com,alicia@markingsinc.com,"(781) 826-5171","30 Riverside Dr",Pembroke,MA,02359,"30 Riverside Dr,Pembroke,MA 02359","Pavement & Floor Marking Services, Concrete Contractors, Parking Lot Maintenance & Marking, Paving Contractors",,,A+,42.11087,-70.77531,,,,"Mon - Fri: 8:00 am - 4:30 pm","Primary Phone: (781) 826-6015 Phone: (781) 826-1121 Fax: (781) 826-1121 TollFree: (800) 826-5171",,,,"Markings Incorporated","http://markingsinc.com https://markingsinc.com",,,,,,,,,
698270,240904,"2020-09-27 02:53:34","Par Inc",http://www.parincasphaltmaintenance.com,christy.eriksen@par2asphalt.com,"(937) 322-0324","2890 Springfield Xenia Rd",Springfield,OH,45506,"2890 Springfield Xenia Rd,Springfield,OH 45506","Asphalt, Asphalt Paving & Sealcoating, Concrete Contractors, Driveway Contractors, Parking Lot Maintenance & Marking, Pavement & Floor Marking Services, Paving Contractors, Paving Materials",,,,39.88401,-83.83767,,,,"Mon - Sat: 9:00 am - 6:00 pm","Phone: (937) 322-1782",,,,"Par Inc Asphalt Maintenance & Marking Par II LLC Par II","http://www.parincasphaltmaintenance.com http://parinc.biz",,,,,,,,,
698283,240907,"2020-09-27 02:53:34","Mike Johns Asphalt Sealcoat",http://www.mikejohnssealcoating.com,,"(309) 692-7502","7210 N Manning Dr",Peoria,IL,61614,"7210 N Manning Dr,Peoria,IL 61614","Asphalt, Asphalt Paving & Sealcoating, Concrete Contractors, General Contractors, Parking Lot Maintenance & Marking, Paving Contractors",,,A+,40.77591,-89.60732,,,"Welcome to Mike Johns Asphalt Sealcoat. We're proud to serve the Peoria-Tri County, IL area and the surrounding communities. Mike Johns specializes in asphalt sealcoating and we look forward to working with you. Our dedicated team is available for both residential and commercial jobs. We work hard to get the job done right the first time and not to disrupt your tenants or customers. Mike Johns strives to provide service that you can always rely on. We'd be glad to assist you with: Sealcoating, Lot striping, Parking lots, Driveways, Repairs, Apartments, Motels/hotels and so much more! Our expertise and exceptional work ethic have allowed us to become the thriving business we are today. Need references? No problem! Just ask and we'll be glad to oblige. Quality doesn't have to be expensive. Call Mike John's Asphalt Sealcoat today for affordable rates.","by appointment only",,,,,,http://www.mikejohnssealcoating.com/,,,,,,,,,
698379,240932,"2020-09-27 02:53:34","Odessa Street Department",https://www.odessa-tx.gov,,"(432) 335-3241","801 E Pool Rd",Odessa,TX,79761,"801 E Pool Rd,Odessa,TX 79761","Parking Lot Maintenance & Marking, Concrete Contractors",,,,31.857944,-102.35225,,,,"Mon - Fri: 8:00 am - 5:00 pm","Phone: (432) 335-4840 Primary Phone: (432) 335-4840 Fax: (432) 335-4853",,"check, discover, master card, visa, amex",,"City of Odessa Odessa Street Dept Odessa-City Departments",https://www.odessa-tx.gov,"Parking: Street Wheelchair Accessible: Yes",,,,,,,,
698385,240935,"2020-09-27 02:53:34","J Mize",https://meyersjmizeco.com,fdmeyers@aol.com,"(217) 629-9746","5524 Turkey Run Rd",Sherman,IL,62684,"5524 Turkey Run Rd,Sherman,IL 62684","Asphalt, Asphalt Paving & Sealcoating, Concrete Contractors, Driveway Contractors, Parking Lot Maintenance & Marking, Paving Contractors, Paving Materials",,,,39.88077,-89.54751,,"Make the right choice for your next project!",,"Mon - Fri: 8:00 am - 5:00 pm","Primary Phone: (217) 629-9741 Phone: (217) 741-0742 MobilePhone: (217) 741-0742",,"cash, check, amex, discover, master card, visa",,"J. Mize Co. Meyers J Mize Co J Mize Company Meyers J. Mize",https://meyersjmizeco.com,,,,,,,,,
698459,240958,"2020-09-27 02:53:34","East Tennessee Pavement Services",http://easttnpavement.com,,"(865) 983-8612","4923 Wildwood Rd",Maryville,TN,37804,"4923 Wildwood Rd,Maryville,TN 37804","Paving Contractors, Asphalt Paving & Sealcoating, Concrete Contractors, General Contractors, Masonry Contractors-Commercial & Industrial, Parking Lot Maintenance & Marking, Road Building Contractors",,,,35.8,-83.85993,,,"With over 25 years of experience, East Tennessee Pavement Services is committed to providing quality paving work in a timely manner at a competitive price.","Mon - Fri: 8:00 am - 4:30 pm","Phone: (865) 983-1601 Fax: (865) 983-1601",,"all major credit cards, amex, discover, master card, visa",,"East Tennessee Pavement Svc",http://easttnpavement.com,,,,,,,,,
698472,240962,"2020-09-27 02:53:34","Indiana Asphalt",,john@indianaasphatlinc.com,"(219) 263-6384","4411 Evans Ave",Valparaiso,IN,46383,"4411 Evans Ave,Valparaiso,IN 46383","Asphalt Paving & Sealcoating, Asphalt, Concrete Contractors, Driveway Contractors, Parking Lot Maintenance & Marking, Paving Contractors",,,,41.47853,-87.00668,,,,,"Phone: (219) 548-8850 TollFree: (866) 732-5488",,"amex, discover, visa, mastercard",,,,,,,,,,,,
698478,240964,"2020-09-27 02:53:34","Cheektowaga Town",http://www.tocny.org/departments/highway.aspx,,"(716) 686-3450","3145 Union Rd",Cheektowaga,NY,14227,"3145 Union Rd,Cheektowaga,NY 14227","Parking Lot Maintenance & Marking, Concrete Contractors, General Contractors, Parking Stations & Garages-Construction",,,,42.89923,-78.75412,,,,"Mon - Fri: 7:00 am - 2:00 pm","Phone: (716) 681-3049 Primary Phone: (716) 681-3049 Phone: (716) 686-3995",,,,"Cheektowaga Highway Dept Town of Cheektowaga Town Of Cheektowago Cheektowaga Highway Department",http://www.tocny.org/departments/highway.aspx,,,,,,,,,
698495,240970,"2020-09-27 02:53:34","D & M Owens Inc",https://www.dmowensinc.com/home,,"(830) 625-7205","4741 W State Highway 46","New Braunfels",TX,78132,"4741 W State Highway 46,New Braunfels,TX 78132","Pavement & Floor Marking Services, Concrete Contractors, General Contractors, Parking Lot Maintenance & Marking, Paving Contractors",,,,29.74319,-98.22178,,,,"Mon - Fri: 9:00 am - 5:00 pm Sat - Sun Closed","Fax: (830) 625-4006 TollFree: (866) 625-7205",,,,"D And M Owens Inc",https://www.dmowensinc.com/home,,,,,,,,,
698524,240977,"2020-09-27 02:53:34","Topps Asphalt Sealing & Paving",http://www.toppsasphalt.com,pkribs@aol.com,"(314) 739-3993","11502 Dorsett Rd","Maryland Heights",MO,63043,"11502 Dorsett Rd,Maryland Heights,MO 63043","Asphalt, Asphalt Paving & Sealcoating, Building Contractors, Concrete Contractors, Drainage Contractors, Driveway Contractors, Parking Lot Maintenance & Marking, Parking Stations & Garages-Construction, Paving Contractors, Paving Materials",,,A+,38.71411,-90.42295,https://i3.ypcdn.com/blob/ab057349b7b62896a836a374a858c169b7dcbc66_100x100_crop.jpg?63f80dd,"Paving The Way In St. Louis For Over 25 Years!","Topps Asphalt located in St Louis provides asphalt paving, milling, seal coating, concrete and drainage solutions for the past 25 years. With the combination of updated equipment, experienced labor and quality material, we provide professional paving and seal coating at competitive prices.","Mon - Fri: 7:00 am - 6:00 pm",,,"master card, visa",,"Topps Asphalt Sealing & Paving Inc",http://www.toppsasphalt.com,"Services: Driveways, Concrete Sealing, Driveways",,,,,,,,
698596,241005,"2020-09-27 02:53:42","Mustang Pavement",http://www.mustangpavement.com,sales@mustangpavement.com,"(214) 202-7699",,,,,,"Paving Contractors, Asphalt, Concrete Contractors, Parking Lot Maintenance & Marking, Road Building Contractors",,,,,,,,,,,,,,,http://www.mustangpavement.com,,,,,,,,,
698632,241013,"2020-09-27 02:53:42","Czars of Tar",http://www.czarsoftar.com,,"(763) 267-5055","1345 157th Ave NE",Andover,MN,55304,"1345 157th Ave NE,Andover,MN 55304","Asphalt, Asphalt Paving & Sealcoating, Concrete Contractors, Driveway Contractors, General Contractors, Parking Lot Maintenance & Marking, Paving Contractors, Paving Materials","1,5","2 Reviews",,45.25639,-93.23584,,"PAVING THE WAY YOU EXPECT","PARKING LOT PAVING AND MAINTENANCE. PAVING , SEAL COATING , CRACK FILLING , POT HOLE PATCHING , MILLING , LINE STRIPING , MARKING , OVERLAY , FULL REPLACEMENT , CURB AND GUTTER , ASPHALT MAINTENANCE , COMMERCIAL , RESIDENTIAL , TOWN HOME , PROPERTY MAINTENANCE , ASSOCIATION","Mon - Fri: 8:00 am - 5:00 pm Sat - Sun Closed",,,"mastercard, discover, visa, all major credit cards, check",,,http://www.czarsoftar.com,"Parking: Lot, Free Services: Driveways","Chad S.",06/22/2016,two,"Decent job. My driveway cracked in 3 months but they did come back and fix it the following summer..",kwncr,09/14/2012,one,"I would not use Czars of Tar. Their warranty apparently means nothing. I have a driveway that was just completed and needs repair already and after three weeks of trying to call and set up an appointment for them to do the maintenance (I was told they would be out within two weeks but no one showed) I am now being told they will not do the repairs/maintenance until they have a job scheduled in the area. The owner is refusing to put me on the calendar and the office gal doesn't know what to do about it. BEWARE BEWARE BEWARE BEWARE!~ I WOULD NEVER RECOMMEND!"
698644,241017,"2020-09-27 02:53:42","Topline Distributors",http://www.topline.tv/distributors/distlist.cfm,,"(717) 766-2196","5222 E Trindle Rd",Mechanicsburg,PA,17050,"5222 E Trindle Rd,Mechanicsburg,PA 17050","Pavement & Floor Marking Services, Concrete Contractors, Parking Lot Maintenance & Marking",,,,40.21987,-76.98348,,,,,,,,,"Topline Services",http://www.topline.tv/distributors/distlist.cfm,,,,,,,,,
698652,241022,"2020-09-27 02:53:42","Jasper Street Department Office",http://www.jasperindiana.gov,jjudd63@yahoo.com,"(812) 482-1130","305 Clay St",Jasper,IN,47546,"305 Clay St,Jasper,IN 47546","Parking Lot Maintenance & Marking, Concrete Contractors, Paving Contractors",,,,38.38371,-86.93855,,,,"Mon - Wed: 9:00 am - 5:00 pm Thu: 9:00 am - 7:00 pm Fri: 9:00 am - 5:00 pm Sun: 12:00 pm - 3:00 pm","Phone: (812) 634-1060 Fax: (812) 634-1060",,,,"Jasper Street Dept Office",http://www.jasperindiana.gov,,,,,,,,,
698715,241045,"2020-09-27 02:53:42","Asphalt Company",,benjamin0673@global.net,"(323) 253-7602","1709 E Gage Ave","Los Angeles",CA,90001,"1709 E Gage Ave,Los Angeles,CA 90001","Asphalt Paving & Sealcoating, Asphalt, Building Contractors, Concrete Contractors, General Contractors, Parking Lot Maintenance & Marking, Parking Stations & Garages-Construction, Paving Contractors, Road Building Contractors",5,"1 Review",,33.98229,-118.24292,,"Serving Los Angeles & Surrounding Areas","Visit our website for more information",,,,,,,,,mezacompany,01/04/2013,five,,,,,
698798,241068,"2020-09-27 02:53:42","Hamden Highway Department",http://www.hamdenny.com,,"(607) 746-6890","123 Covert Hollow Rd",Hamden,NY,13782,"123 Covert Hollow Rd,Hamden,NY 13782","Parking Lot Maintenance & Marking, Concrete Contractors",,,,42.2108,-74.98252,,,,,"TollFree: (877) 809-0458",,,,"Hamden Highway Dept",http://www.hamdenny.com,,,,,,,,,
698806,241074,"2020-09-27 02:53:42","New Albany Street Dept",,,"(614) 855-0076","7800 Bevelhymer Rd","New Albany",OH,43054,"7800 Bevelhymer Rd,New Albany,OH 43054","Parking Lot Maintenance & Marking, Concrete Contractors, Paving Contractors",,,,40.084686,-82.79879,,,,"Mon - Fri: 8:00 am - 5:00 pm",,,,,,,,,,,,,,,
698824,241079,"2020-09-27 02:53:42","Diehl Paving Inc",http://diehlpaving.com,troynrhodadiehl@yahoo.com,"(610) 760-9451",,,,,,"Paving Contractors, Concrete Contractors, Parking Lot Maintenance & Marking, Paving Materials, Waterproofing Contractors",1,"1 Review",,,,,"""Diehl or no Deal""","At Diehl Paving Inc., our services cover all types of projects including commercial and residential. We are dedicated to providing our clients with prompt, professional and friendly service. Our goal at Diehl Paving Inc. is to stay in touch with any changes in our industry, so that we can always offer you the latest and most current information and services. Our mission is ""to serve our customers with the extensive knowledge and expertise we have gained in our industry, while continually offering them the finest in customer service."" In order to attain our company goals, we offer special services such as immediate free estimates and senior discounts. Give us a call today and allow us to answer any questions or concerns that you may have. We look forward to speaking with you. Our Reputation Is Everything.",,"Phone: (484) 602-3348 Phone: (570) 794-4000 Phone: (610) 794-4000",,"check, master card, visa",,,http://diehlpaving.com,,"Tim Y.",12/18/2016,one,"DIEHL OR NO DIEHL!!!!! NO pride in their work. NO consideration for your property. NO one gives a CRAP. NO call back from DICK. NO STAR ?? NO DIEHL!!!!!!!!!!!!",,,,
698832,241081,"2020-09-27 02:53:42","Westfall, Construction & Garage Doors",http://www.westfallbuilders.com,service@westfallbuilders.com,"(740) 373-4642","30789 State Route 7",Marietta,OH,45750,"30789 State Route 7,Marietta,OH 45750","Building Contractors-Commercial & Industrial, Building Contractors, Building Maintenance, Concrete Contractors, Doors, Frames, & Accessories, Drilling & Boring Contractors, Garage Doors & Openers, General Contractors, Moving Services-Labor & Materials, Overhead Doors, Parking Lots & Garages",,,A+,39.35153,-81.35212,,"Creating quality for over 20 years!.","We are a team of general contractors that specialize in garage doors, rolling steel doors, concrete doors for both commercial and industrial buildings.","Mon - Fri: 8:00 am - 5:00 pm",,,"mastercard, discover, visa",,,http://www.westfallbuilders.com,,,,,,,,,
698891,241092,"2020-09-27 02:53:42","Rose Paving",https://www.rosepaving.com/parking-lot-paving-denver,tkasprzak@rosepaving.com,"(303) 745-4100","4404 E 60th Ave Ste B","Commerce City",CO,80022,"4404 E 60th Ave Ste B,Commerce City,CO 80022","Asphalt Paving & Sealcoating, Asphalt, Concrete Contractors, Driveway Contractors, General Contractors, Parking Lot Maintenance & Marking, Pavement & Floor Marking Services, Paving Contractors, Paving Equipment",,,,39.805,-104.93663,https://i4.ypcdn.com/blob/2bd5add05a00671aceb8663d7c97d4819ded305c_100x100_crop.jpg?63f80dd,,,"Mon - Fri: 8:00 am - 4:30 pm","Primary Phone: (303) 286-2519 Phone: (303) 286-2519",,,,"Rose Paving Llc Rose Paving - Denver",https://www.rosepaving.com/parking-lot-paving-denver,,,,,,,,,
698899,241093,"2020-09-27 02:53:42","Vienna Public Information",http://www.viennava.gov,pio@viennava.gov,"(703) 255-6330","127 Center St S",Vienna,VA,22180,"127 Center St S,Vienna,VA 22180","Parking Lot Maintenance & Marking, Concrete Contractors",,,,38.90054,-77.26455,,,,"Mon - Fri: 8:00 am - 4:30 pm","Phone: (703) 255-6381",,"debit, discover, amex, master card, visa, cash",,,http://www.viennava.gov,,,,,,,,,
698910,241100,"2020-09-27 02:53:42","Road Maintenance Div",http://honolulu.gov,,"(808) 621-5241","127 California Ave",Wahiawa,HI,96786,"127 California Ave,Wahiawa,HI 96786","Parking Lot Maintenance & Marking, Concrete Contractors",,,,21.49319,-158.0364,,,,"Mon - Fri: 7:45 am - 4:30 pm",,,"cash, check, master card, visa",,,http://honolulu.gov,,,,,,,,,
698962,241114,"2020-09-27 02:53:42","Maul Paving, Sealcoating & Concrete",https://api.superpages.com/xml/search?SRC=ypintfeed&subaffiliate=DXC&PGID=e02.7182.8182845904523&SPGID=1583708488709.96b85b4b&ADID=11896251&DEST=http%3A%2F%2Fmaulasphalt.mydex.com%2FKwPHXM9WXBI&C=parking&T=Plainfield&S=IL&PH=(630)%20703-2004&FL=url&TL=off&position=77&PS=30&PI=3&Results=FEED_CLCK&uid=96b85b4b-e0ae-4775-a650-080d2b6e4d34&REF=&IP=163.172.12.193&UserAgent=Mozilla%2F5.0%20(Windows%20NT%206.1%3B%20rv%3A60.0)%20Gecko%2F20100101%20Firefox%2F60.0,info@maulasphalt.com,"(630) 703-2004","10201 Clow Creek Rd",Plainfield,IL,60585,"10201 Clow Creek Rd,Plainfield,IL 60585","Asphalt Paving & Sealcoating, Asphalt, Concrete Contractors, Driveway Contractors, General Contractors, Masonry Contractors, Parking Lot Maintenance & Marking, Paving Contractors, Road Building Contractors",,,,41.6965,-88.23631,https://i4.ypcdn.com/blob/d0703496d5f19335d5945227680f4ec7aa696505_100x100_crop.jpg?63f80dd,,"Since the summer of В’86, Maul has provided paving, concrete, and sealcoating services to businesses of all sizes: from townhome & condo associations to national retailers, from local businesses to industrial and governmental agencies, no job is too big or too small. ThatВ’s because in over 30 years, our Respect for clients has never changed, never faded, and itВ’s made us the unbeatable choice in an industry where Respect is a rare commodity. With over 30 years of experience under our belt, we use a mix of expertise and grit to strengthen your ground. We know what it takes, and the customerВ’s needs are the foundation of everything we do. A parking lot is your businessesВ’ first impression, and Maul makes it last. Our comprehensive asphalt, sealcoating, crack-sealing, and more without interruption, and we donВ’t stop until the job is done. So pave the way forward for your business. Seal the deal for your success. And tell your parking lot puddles to get packing.","Mon - Fri: 7:00 am - 5:00 pm",,,"invoicing available, master card, visa, amex, cash, check, debit, discover, financing available",,,"http://www.maulasphalt.com https://maulasphalt.com/",,,,,,,,,
699065,241149,"2020-09-27 02:53:42","Asphalt Sealing",http://www.dexknows.com/rd?dku=,dwyatt@embarqmail.com,"(423) 929-1010","1463 Milligan Hwy","Johnson City",TN,37601,"1463 Milligan Hwy,Johnson City,TN 37601","Asphalt Paving & Sealcoating, Concrete Contractors, Masonry Contractors-Commercial & Industrial, Parking Lot Maintenance & Marking, Pavement & Floor Marking Services, Paving Contractors, Road Building Contractors",,,,36.29828,-82.30605,,,,"Mon - Fri: 8:00 am - 5:00 pm",,,,,"Asphalt Sealing & Striping Inc",http://www.dexknows.com/rd?dku=,,,,,,,,,