business_x_category.id,business.id,business.ts,business.business_name,business.home_page,business.email_address,business.phone,business.street,business.city,business.state,business.zip_code,business.full_address,business.category,business.rating,business.number_of_reviews,business.bbb_rating_or_license,business.latitude,business.longitude,business.cover_image,business.slogan,business.general_info,business.regular_hours,business.extra_phones,business.services_products,business.payment,business.price_range,business.aka,business.other_links,business.other_information,business.review_1_name,business.review_1_date,business.review_1_rating,business.review_1_text,business.review_2_name,business.review_2_date,business.review_2_rating,business.review_2_text
464373,159748,"2020-09-27 02:45:52","W Entertainment Corporation",,worldentertainmentco@gmail.com,"(713) 657-0145",,Houston,TX,77027,"Houston,TX 77027","Disc Jockeys, Audio-Visual Production Services, Meeting & Event Planning Services, Party & Event Planners, Wedding Music & Entertainment",,,,,,,,,,,,,,,,,,,,,,,,
464628,159815,"2020-09-27 02:45:53","Sound Waves Pro DJs",http://www.facebook.com/soundwavesprodjs,booking@soundwavesprodjs.com,"(727) 645-3644","10105 Barnett Loop","Port Richey",FL,34668,"10105 Barnett Loop,Port Richey,FL 34668","Disc Jockeys, Audio-Visual Production Services, Party & Event Planners, Wedding Music & Entertainment, Wedding Planning & Consultants",5,"1 Review",,28.30374,-82.6798,https://i2.ypcdn.com/blob/5c8f185fb8932e181a4115d8eac2416e5f7fcfb7_100x100_crop.jpg?f9d23e1,"We bring the party to YOU!","Professional, mobile DJ and lighting service. Servicing Pasco County, Hillsborough County, Hernando County, Pinellas County and all of Central West Florida.","Mon - Sun: 8:00 am - 10:00 pm",,,"check, cash, no credit cards",,,"Professional DJs on Facebook, Wedding DJ Facebook Professional Mobile Wedding Disc Jockey Service Follow Sound Waves Pro DJs on twitter",,maurvyp,10/25/2013,five,"My NEW WIFE MICHELLE would recommend Sound Waves to anybody! The owner Jose' personally DJd and MCd our wedding. From start to finish he helped us organize our wedding.",,,,
464669,159824,"2020-09-27 02:45:53",Sound-N-Glo,http://www.soundnglo.com,info@soundnglo.com,"(561) 654-8075","9873 Lawrence Rd","Boynton Beach",FL,33436,"9873 Lawrence Rd,Boynton Beach,FL 33436","Sound Systems & Equipment-Renting, Audio-Visual Equipment-Renting & Leasing, Disc Jockeys, Karaoke, Wedding Music & Entertainment, Wedding Supplies & Services",,,,26.52964,-80.10773,https://i2.ypcdn.com/blob/5af8c975ccc59404a6ad840fa3ab44e5a81f233a_100x100_crop.jpg?e66d351,,"Sound-N-Glo is an event sound and lighting company in South Florida. Our services include sound equipment rentals, mobile DJ's, Karaoke service,table lighting, up-lighting and more. We service the local area, including Palm Beach, Broward, and Miami-Dade Counties..Weddings, birthdays and everything in between, we do it all. We have many equipment packages and multiple DJ's to make sure your needs and budget are met. Please call us today for a consult and quote.","Mon - Sun: Open 24 Hours","MobilePhone: (561) 654-8075",,"debit, paypal, cash, all major credit cards, mastercard, discover, amex, visa",,,"Visit Us On The Web",,,,,,,,,
464756,159853,"2020-09-27 02:45:53","E&S Light and Sound",,,"(610) 413-1242","1636 Cortland Ave",Reading,PA,19607,"1636 Cortland Ave,Reading,PA 19607","Disc Jockeys, Audio-Visual Production Services, Party Planning",,,,40.30418,-75.94366,,,,"Mon - Sun: 9:00 am - 8:00 pm",,,"check, paypal, no credit cards",,,,,,,,,,,,
464978,159922,"2020-09-27 02:45:53","DJ J. Loops",http://www.jloops412.com,JLoops412@gmail.com,"(412) 812-8689","2070 Woodward Ave",Pittsburgh,PA,15226,"2070 Woodward Ave,Pittsburgh,PA 15226","Disc Jockeys, Audio-Visual Production Services, Entertainment Agencies & Bureaus, Party & Event Planners, Wedding Music & Entertainment",,,,40.4027,-80.01923,,,,,,,,,,Main,,,,,,,,,
465062,159942,"2020-09-27 02:45:53","Trey Dawg Productions",http://treydawg.com,,"(707) 350-7073","19100 Yokayo Ranch Rd",Ukiah,CA,95482,"19100 Yokayo Ranch Rd,Ukiah,CA 95482","Audio-Visual Creative Services, Audio-Visual Equipment-Renting & Leasing, Disc Jockeys, Security Control Systems & Monitoring, Security Guard & Patrol Service, Wedding Music & Entertainment",,,,39.151917,-123.20069,,,"What you need is what we have. Looking for a DJ or a talented entertainerВ… YouВ’re at the right place. Nothing but Pure Inspiration rhyming and DJ services for your audio needs.You wonВ’t be let down. Guarantee quality and satisfaction.",,,,,,,http://treydawg.com,,,,,,,,,
465482,160062,"2020-09-27 02:45:54","Boogie Down DJ Services",http://www.boogiedowndjservices.com,cfletcher1@verizon.net,"(562) 833-1191","101 W Mission Blvd Ste 110",Pomona,CA,91766,"101 W Mission Blvd Ste 110,Pomona,CA 91766","Disc Jockeys, Audio-Visual Creative Services, Carpet & Rug Cleaners, Entertainment Agencies & Bureaus, Family & Business Entertainers, Karaoke, Wedding Music & Entertainment, Wedding Supplies & Services",,,,34.05535,-117.75052,,"You Name It We Do It","**Contact Me:** If you are in need of a quality, experienced, reputable DJ who will insure that your function is a success, feel free to use the contact form on my web site to send me a detailed message. If you already know the date of your event, and you have taken a moment to check out my calendar to see if the date needed is available, include as much detail in the message so that I can hopefully secure that day / time for you.","Mon - Sun: Open 24 Hours","Fax: (909) 868-0835",,"all major credit cards, cash, check",,,http://www.boogiedowndjservices.com,,,,,,,,,
465751,160138,"2020-09-27 02:45:54","Music Now DJ",http://www.musicnowdj.com,info@musicnowdj.com,"(831) 423-4423","230 Mount Hermon Rd","Scotts Valley",CA,95066,"230 Mount Hermon Rd,Scotts Valley,CA 95066","Disc Jockeys, Audio-Visual Creative Services, Audio-Visual Equipment-Renting & Leasing, Family & Business Entertainers, Party Supply Rental, Photo Booth Rental, Wedding Music & Entertainment",,,,37.04591,-122.02794,,,"Music Now DJs have performed at over 35,000 events in the Santa Cruz, Monterey and San Jose Bay Area since 1987! With Music Now, you get special attention to your needs. Music Now has helped 1000's of clients and their guests create a warm, elegant and enthusiastic atmosphere. We customize your music from our CD and computer based library of over 250,000 song titles. You have control, so your favorites are played. At your request, our formally attired Disc Jockey will serve as Master of Ceremonies coordinating both events & announcements. Our goal is to handle the details, allowing you to enjoy your special day. ASSOCIATION We are one of the most requested DJ Entertainment services in the area. Referred by virtually all wedding sites and planners.","Mon - Fri: 9:00 am - 5:00 pm Sun Closed","Phone: (831) 423-7945 Phone: (831) 421-4300 TollFree: (877) 423-4423",,"all major credit cards, check, debit, financing available, travelers checks",,,http://www.musicnowdj.com,"Parking: Lot",,,,,,,,
465817,160155,"2020-09-27 02:45:54","Quality Audio Productions LLC",http://www.qualityaudioproductions.com,,"(573) 216-1322",,Eldon,MO,65026,"Eldon,MO 65026","Wedding Music & Entertainment, Audio-Visual Creative Services, Audio-Visual Equipment-Wholesale & Manufacturers, Audio-Visual Production Services, Consumer Electronics, Disc Jockeys, Karaoke, Party & Event Planners, Party Planning, Sound Systems & Equipment, Television & Radio Stores",5,"4 Reviews",,,,https://i2.ypcdn.com/blob/ead9816b3d6881e0b6799a35af12e4eb6401c84a_100x100_crop.jpg?e66d351,,,"Mon - Sat: 9:00 am - 5:00 pm Sun Closed",,,"check, paypal, cash, mastercard",,"email: qualityaudio@charter.net",http://www.qualityaudioproductions.com,,"Ashley M.",07/19/2017,five,"Bob did a great job for our wedding reception! He did a great job with the lighting and sound system! He knew what he was doing and knew how to keep the crowd going. Thank you so much!!!",bestmomma1,03/24/2012,five,"I hired this company for my daughters Birthday party. The lights were great, music even better! These guys really know how to read a crowd and keep them dancing! Will hire again for her wedding!"
465947,160195,"2020-09-27 02:45:54","Platinum Sound Works",http://www.platinumsoundworks.com,carl@platinumsoundworks.com,"(913) 568-4559","5639 Russell St",Mission,KS,66202,"5639 Russell St,Mission,KS 66202","Disc Jockeys, Audio-Visual Production Services, Party & Event Planners, Sound Systems & Equipment-Renting, Wedding Chapels & Ceremonies",5,"1 Review",,39.02626,-94.65921,,,"Digital Disk Jockey for All Your Party's & Special Events State of the Art Sound and Lighting Systems that can make Your Party the Best of the Year!!! Go to platinumsoundworks.com for more info and pricing.","Mon - Fri: 9:00 am - 9:00 pm Sat: 9:00 am - 5:00 pm",,,"visa, master card, amex, discover, debit, check, paypal, diners club, carte blanche, company card, jcb",,,http://www.platinumsoundworks.com,,carlmig,03/25/2008,five,"The service was professional in every respect, and all at a very affordable price. Platinum Sound Works offered a tremendous library of songs and played just the right music for every phase of our event. I was extremely pleased with the service and would certainly use PSW again for my next event.",,,,
466025,160216,"2020-09-27 02:45:54","Rocky Mountain Roll",,john@rockymountainroll.com,"(208) 887-5468","601 S Meridian Rd",Meridian,ID,83642,"601 S Meridian Rd,Meridian,ID 83642","Disc Jockeys, Audio-Visual Equipment, Consumer Electronics, Entertainment Agencies & Bureaus, Family & Business Entertainers, Party & Event Planners, Party Favors, Supplies & Services, Party Planning, Party Supply Rental, Television & Radio Stores, Wedding Music & Entertainment",,,,43.59905,-116.39442,,"We don't just bring the music... We bring the PARTY!!!",,"Mon - Fri: 9:00 am - 5:30 pm Sat - Sun Closed","Fax: (208) 887-6900",,"cash, all major credit cards, check, debit, paypal",,,,"Services: Disc Jockeys & Entertainment Audio Visual Sales & Rentals Photo Booth",,,,,,,,
466038,160217,"2020-09-27 02:45:54","Sound Guard Events Sound Sytems",http://soundguardeventssoundsystems.com,dj00007@aol.com,"(201) 982-4957",,Teaneck,NJ,07666,"Teaneck,NJ 07666","Audio-Visual Equipment-Renting & Leasing, Disc Jockeys, Party & Convention Decorating, Party Supply Rental, Sound Systems & Equipment",,,,,,https://i3.ypcdn.com/blob/5a24d3548a585a2a9a57a61e0130b99b3af04beb_100x100_crop.jpg?e66d351,"WE MAKE IT HAPPEN!!!","DJ GEAR RENTAL,SOUND SYSTEMS, AV PRESENTATIONS,SOUNDMAN FOR LIVE BANDS, PARADE FLOAT SOUND SYSTEMS & HONDA GENERATORS, RCF POWERED SOUND SYSTEMS , JBL SRX 722 & 718 SOUND SYSTEMS OWNER OF LARGE INDOOR OR OUTDOOR SOUND PA COMPANY FOR LIVE & PRERECORDED EVENTS. SOUND & VIDEO EQUITMENT RENTALS, LIGHTING RENTALS, DJ'S FOR WEDDINGS SCHOOL DANCES, & FOR ALL THE DISC JOCKEYS OUT THERE WE DO MOBILE DJ SOUND SETUP RENTALS, JUST BRING YOUS CD'S OR VINYLE OR DJ COMPUTER AND WE DO THE SETUP AND TEARDOWN FOR YOU. CALL ME FOR PRICE WE HAVE 6 SOUND SYSTEMS TO PICK FROM TO HANDLE 50 TO 5000 PEOPLE. AUDIO EQUITMENT & GENERATORS FOR PARADE FLOATS, SOUND INSTALLS FOR CLUBS OR BAR PLEASE CALL DJ HENRY 201-357-8745 OR 201-982-4957 CELL DJ00007@AOL.COM (EMAIL) WE ARE IN THE NEW JERSEY,NEW YORK CITY,PA, CONN. AREA","Mon - Sun: Open 24 Hours","OFFICE: (201) 357-8745 CELL OR TEXT: (201) 982-4957",,"visa, master card, debit, paypal, cash, company card, insurance",,,"DJ GEAR RENTAL,SOUND SYSTEMS,",,,,,,,,,
466159,160254,"2020-09-27 02:45:54","Complete Weddings & Events",http://www.completemusic1.com,dave@completemusic1.com,"(308) 237-5247","301 Central Ave",Kearney,NE,68847,"301 Central Ave,Kearney,NE 68847","Wedding Photography & Videography, Audio-Visual Creative Services, Disc Jockeys, Video Production Services, Wedding Music & Entertainment",,,,40.67667,-99.0817,,"Our DJ's make the difference!","Complete Music entertains for almost any type of function including: Weddings, Schools, Mitzvahs, Reunions, Corporate Functions, Picnics, Summer Pool and Block Parties as well as providing sound, lighting and MC'ing, for major conferences and events.",,,,"check, discover, amex, cash, master card, visa",,,http://www.completemusic1.com,,,,,,,,,
466328,160301,"2020-09-27 02:45:54","Stitt Sound",,,"(620) 491-8093","Private Address","Colorado Springs",CO,80904,"Private Address,Colorado Springs,CO 80904","Disc Jockeys, Audio-Visual Production Services, Recording Service-Sound & Video, Wedding Music & Entertainment",,,,38.83345,-104.82181,,,,"Mon - Sun: Open 24 Hours",,,"debit, check, all major credit cards",,,,,,,,,,,,
467340,160592,"2020-09-27 02:45:54","Alphabeat Entertainment",http://www.alphabeatentertainment.com,,"(314) 898-2668","139 Keystone Dr",Fenton,MO,63026,"139 Keystone Dr,Fenton,MO 63026","Disc Jockeys, Audio-Visual Production Services, Karaoke, Party & Event Planners, Wedding Music & Entertainment",5,"1 Review",,38.49344,-90.43516,,,"Your professional entertainment specialists, catering to every need for your event.","Mon - Sun: 9:00 am - 3:00 am",,,"visa, discover, mastercard, all major credit cards, check, debit, paypal",,,http://www.alphabeatentertainment.com,,"Aaron B.",02/24/2016,five,"We had a blast! Thank you so much! We highly recommend Alphabeat. Top notch professional and very nice and easy to deal with. Great job!",,,,
467459,160632,"2020-09-27 02:45:54","Magnolia Rhapsody",http://www.magnoliarhapsody.com,cho@magnoliarhapsody.com,"(360) 507-4787",,Shoreline,WA,98155,"Shoreline,WA 98155","Disc Jockeys, Audio-Visual Production Services, Meeting & Event Planning Services, Party & Event Planners, Wedding Supplies & Services",,,,,,,,,,,,"all major credit cards, check, paypal",,,"Premier Mobile DJ Service in Seattle",,,,,,,,,
468271,160874,"2020-09-27 02:45:54","Kramer Events",http://www.kramerevents.com,,"(805) 544-9900","202 Tank Farm Rd Ste E","San Luis Obispo",CA,93401,"202 Tank Farm Rd Ste E,San Luis Obispo,CA 93401","Disc Jockeys, Audio-Visual Production Services, Entertainment Agencies & Bureaus, Lighting Consultants & Designers, Party & Event Planners, Photo Booth Rental, Wedding Music & Entertainment, Wedding Photography & Videography, Wedding Planning & Consultants, Wedding Reception Locations & Services, Wedding Supplies & Services",,,,35.2478,-120.66858,,"Amazing events start here","Kramer Events is a full time wedding and event production company. We serve men and women all over the central coast including main areas like San Luis Obispo, Santa Barbara, and San Francisco. We provide you with everything from wedding coordination, DJs, photo booths, lighting design, and more. Our mission is to raise the public's expectation of even professionals as well as be an awesome place to work. Please visit our website for more detailed information.",,,,"check, visa, mastercard",,,http://www.kramerevents.com,"Parking: Lot",,,,,,,,
468413,160917,"2020-09-27 02:45:54","Roman Candles Mobile DJ & MC Services",http://www.djromancandles.com,djromancandles@gmail.com,"(808) 371-5560","24 Sand Island Access Rd Apt 13",Honolulu,HI,96819,"24 Sand Island Access Rd Apt 13,Honolulu,HI 96819","Audio-Visual Equipment-Renting & Leasing, Children's Party Planning & Entertainment, Disc Jockeys, Wedding Music & Entertainment",,,,21.34877,-157.87595,https://i2.ypcdn.com/blob/8aff161f37a244d83dfce1aa7b6e47936758a9cd_100x100_crop.jpg?e66d351,"Lighting parties on fire since 2009!","When I'm not mixing a funky fresh live set, I like to sail, SCUBA, lounge on the beach, and explore my surroundings. In the next 5 years I plan to travel the world under sail in search of the perfect reef, wind, waves, sands, and jams.","Mon - Sun: Open 24 Hours","Business Phone: (808) 371-5560",,"check, paypal, cash",,,"Lighting parties on fire since 2009!",,,,,,,,,
468694,160999,"2020-09-27 02:45:54","Eight Men Media: Live Event Production",http://www.eightmenmedia.com,contact@eightmenmedia.com,"(219) 873-6994",,"Michigan City",IN,46360,"Michigan City,IN 46360","Disc Jockeys, Audio-Visual Production Services, Theatrical & Stage Lighting Equipment-Services",,,,,,,,,,,,"check, paypal",,,http://www.eightmenmedia.com,,,,,,,,,
469203,161164,"2020-09-27 02:46:00","Paradise Entertainment and DJ Service",http://www.paradiseentertainmentservice.com,Paradiseentertainment@Live.Com,"(616) 322-4534","PO Box 341",Jenison,MI,49429,"PO Box 341,Jenison,MI 49429","Disc Jockeys, Audio-Visual Production Services, Entertainment Agencies & Bureaus, Party & Event Planners, Wedding Music & Entertainment",,,,42.907223,-85.79195,,,"Hello! Thank you for taking the time to review our services. We have been serving West Michigan and surrounding regions for over 10 years. We are dedicated to quality, professionalism, creativity and reliability. We have a genuine desire to make your event a wonderful experience. No matter what size or type of party, we promise professional, experienced, on time, enthusiastic and customized service with professional equipment.",,"MobilePhone: (616) 322-4534",,"check, all major credit cards",,,http://www.paradiseentertainmentservice.com,,,,,,,,,
469932,161375,"2020-09-27 02:46:00","5 Star DJ Karaoke & Rental",http://www.5starkaraokeandsound.com/,sales@5starkaraoke.com,"(951) 609-9106",,,,,,"Party Supply Rental, Audio-Visual Creative Services, Audio-Visual Equipment-Renting & Leasing, Disc Jockeys, Family & Business Entertainers, Karaoke, Wedding Supplies & Services",5,"3 Reviews",,,,https://i2.ypcdn.com/blob/c1e6dfc0b28ec0c990a4e3afe57d8505e3643820_100x100_crop.jpg?e66d351,"DJ services.","Dj Services for all Occassions,Rental Service,and Karaoke Disc ,Equipment for Sale ,Brands Behringer,Jbl,Alto,Mr.Dj,American Dj & More","Mon - Fri: 9:00 am - 4:00 pm Sat: 10:00 am - 2:00 pm","MobilePhone: (951) 741-3395 TollFree: (800) 970-8538",,"mastercard, visa, amex, discover, debit, company card",,,"http://www.5starkaraokeandsound.com http://www.5stardjkaraokeandrental.com http://5starkaraokeandsound.com","Parking: Street","Debby z D.",09/05/2014,five,"Awesome! Amazing and expert. Really knows his stuff, gives great service and is loyal. Love Howard! My profession depends on him and even all the way from Kansas City he takes great care of me.",lisacort,06/03/2013,five,"I used Thumbtack.com to get quotes for a DJ and Karaoke and I must have talked to 6 different people and they ranged from $1400 to $300. I chose 5 Star Karaoke because he was just straight forward... no over selling me on anything. He and his wife arrived right on time and set up and did an amazing job. Everyone complemented on the service. We all had a blast. I will for sure be using them in the future! Thank you very much!"
471180,161753,"2020-09-27 02:46:00","Sounds Unlimited Productions",http://www.supdis.com,,"(812) 949-0589",,"New Albany",IN,47150,"New Albany,IN 47150","Stereo, Audio & Video Equipment-Renting & Leasing, Audio-Visual Equipment-Renting & Leasing, Disc Jockeys",,,,,,,,,,,,,,,"http://www.supdis.com http://www.supdjs.com",,,,,,,,,
471265,161778,"2020-09-27 02:46:00","Eisenacher Audio Visual Services",http://www.eisenacheraudiovisualservices.com,,"(267) 994-0151",,Levittown,PA,19056,"Levittown,PA 19056","Audio-Visual Creative Services, Audio-Visual Equipment, Audio-Visual Equipment-Renting & Leasing, Disc Jockeys, Inflatable Party Rentals",,,,,,,,,"Mon - Sat: 9:00 am - 9:00 pm Sun: 10:30 am - 7:30 pm",,,"check, paypal",,"Big Screen Outdoor Movies Movie Presentations","Basic and helpful information about our services.",,,,,,,,,
471575,161865,"2020-09-27 02:46:00","Atlantic Coast Entertainment",http://www.atlanticcoastentertainment.com,Ace@AceEvents.pro,"(860) 448-3548","524 Long Hill Rd",Groton,CT,06340,"524 Long Hill Rd,Groton,CT 06340","Disc Jockeys, Audio-Visual Creative Services, Audio-Visual Production Services, Commercial Photographers, Graphic Designers, Music Producers, Musicians, Party & Event Planners, Party Favors, Supplies & Services, Party Supply Rental, Photo Booth Rental, Photo Retouching & Restoration, Photography & Videography, Portrait Photographers, Video Production Services, Video Production Services-Commercial, Video Tape Editing Service, Wedding Music & Entertainment, Wedding Photography & Videography, Wedding Supplies & Services",,,A+,41.35322,-72.05895,https://i2.ypcdn.com/blob/2c94ccc9c10efdc41844bf952de140e605dbc31d_100x100_crop.jpg?f9d23e1,"Helping You Create And Capture Life's Moments...For A Lifetime.","Atlantic Coast Entertainment has been providing DJ, Disc Jockey, Uplighting, Event Lighting, Architectural Lighting, Photography, Videography and Photo Booth Rental Services in New England for over 20 years. A.C.E. (a.k.a. ACE) proudly serves Connecticut, Rhode Island and Massachusetts. Atlantic Coast Entertainment is a Multi-System Company, so we can help you with a Wedding DJ, Wedding Photographer, Wedding Videographer, Video Taping Services, Event Lighting, Uplighting, Photo Booth Rentals and many more event services, even at the last minute. A.C.E. can also provide you with music Music Video Dance Parties, Video Screen and Video Projector Rentals, Karaoke, Monograms, Laser Light Shows, Theme Party Decorations, Games, Game Shows, Cake Mapping and much more! Atlantic Coast Entertainment will take all the guess work out of your planning and goes the extra distance to ensure that your next event is a success.","Hours Appointment Only Hours Mon Closed Tue - Thu 5:30 pm - 9:00 pm Fri - Sun Closed Regular Hours Mon - Thu: 10:00 am - 4:00 pm Fri: 10:00 am - 1:00 pm Sat - Sun Closed Holiday Hours 2020/01/01 Closed Holiday Hours 2020/11/26 Closed Holiday Hours 2020/12/25 Closed",,,"check, no credit cards, cash",,"Ace Events A.C.E. Events AceProDJ AceProPhoto A.C.E. AceProVideo AceProPhotoBooth","Primary Website New A.C.E. Website Wedding Photo Booth Wedding Photography Ace Events facebook Wedding Videography Wedding Photography Wedding Photo Booth Wedding Videography A.C.E. facebook","Specialties: Weddings, Corporate Events, Dances, Business, Anniversaries, School Events, Holidays, Bodas, Reunions, Companies, Theme Parties",,,,,,,,