business_x_category.id,business.id,business.ts,business.business_name,business.home_page,business.email_address,business.phone,business.street,business.city,business.state,business.zip_code,business.full_address,business.category,business.rating,business.number_of_reviews,business.bbb_rating_or_license,business.latitude,business.longitude,business.cover_image,business.slogan,business.general_info,business.regular_hours,business.extra_phones,business.services_products,business.payment,business.price_range,business.aka,business.other_links,business.other_information,business.review_1_name,business.review_1_date,business.review_1_rating,business.review_1_text,business.review_2_name,business.review_2_date,business.review_2_rating,business.review_2_text
10485,3870,"2020-09-27 02:30:47","FFS Model & Talent Agency",http://www.ffsmodelandtalentagency.info,columbia@ffsmodelandtalentagency.info,"(704) 412-8337",,Columbia,SC,29201,"Columbia,SC 29201","Fashion Designers, Acting Schools & Workshops, Casting Directors, Commercials-Radio & Television, Entertainment Agencies & Bureaus, Make-Up Artists, Modeling Agencies, Modeling Schools, Photography & Videography, Talent Agencies",5,"10 Reviews",,,,https://i4.ypcdn.com/blob/3308db5fa0428d9840c3749131afc3053f31b143_100x100_crop.jpg?11da137,"FFS Model and Talent Agency The First Step to Making Your Dreams Come True!","FFS is a full service model and talent agency here in the Southeast. We are a family owned agency of former actors, models and performers who now focus on the business side of entertainment. Our models and talent have booked local, regional and national assignments. We pride ourselves on the fact that our agency consistently books our talent paying assignments. We provide neccessary training and instruction and all graphic design, photography and comp cards are done in house in a successful attempt to make our neccessary services affordable to the talent.","Mon - Sun: Open 24 Hours","Fax: (606) 775-1424",,"all major credit cards, financing available",,,"http://www.ffsmodelandtalentagency.info https://www.facebook.com/#!/pages/FFS-Model-and-Talent-Agency-Columbia/136254826385216",,"Janet G.",08/08/2014,five,"I was just recently signed to FFS and I already love it! Everyone who works there is so nice and they have helped me with every step! I cannot wait to further my modeling career with FFS.","Tameika B.",08/06/2014,five,"I've been with FFS for under a year and I already feel like I am at home. They are very understanding about my busy work schedule with my ""day"" job and every single time I have talked to someone, they have been nothing short of helpful. Mrs. Zeigler took a chance on me when I felt like no one else would. I am so thankful for her and the entire staff."
10507,3882,"2020-09-27 02:30:47","Charlies Talent Management",http://www.charliestalentmgmt.com,,"(586) 362-3561","236 Adelaide St",Detroit,MI,48201,"236 Adelaide St,Detroit,MI 48201","Entertainment Agencies & Bureaus, Talent Agencies",,,,42.34272,-83.05086,,,,"Mon - Fri: 9:00 am - 6:00 pm Sat: 9:00 am - 5:00 pm",,,,,,"http://www.charliestalentmgmt.com http://charliestalentmedia.wordpress.com",,,,,,,,,
10519,3887,"2020-09-27 02:30:47","Elite Models And Events",http://www.elitemodelsandevents.com,info@elitemodelsandevents.com,"(646) 580-3574","244 5th Ave Fl C86","New York",NY,10001,"244 5th Ave Fl C86,New York,NY 10001","Modeling Agencies, Entertainment Agencies & Bureaus, Meeting & Event Planning Services, Party & Event Planners, Talent Agencies",,,,40.74458,-73.98761,,,,"Mon - Sun: 10:00 am - 11:00 pm",,,,,,"Promotional & Atmosphere Models, Events Party",,,,,,,,,
10525,3890,"2020-09-27 02:30:47","Three Fourteen Entertainment",http://www.314ent.com,info@314ent.com,"(405) 593-0232","2525 NW Expressway Ste 512","Oklahoma City",OK,73112,"2525 NW Expressway Ste 512,Oklahoma City,OK 73112","Entertainment Agencies & Bureaus, Family & Business Entertainers, Talent Agencies",,,A+,35.52598,-97.55811,,"Your answer to entertainment.","OUR vision AT three fourteen entertainment is to Bring a small piece of LAS vegas and It's historical entertainment to Oklahoma city. OUR management team is made UP of entertainers WHO have been part of the industry for decades with over 50 years of combined experience in stage productions. Cruise ship entertainment. Casino entertainment. Television. And many other facets of the entertainment world. OUR custom designs are molded to your event to give your guests the feeling of a cohesive package that will leave them in AWE. OUR team of performers and their outgoing personalities accompany a dazzling visual concept designed and created through a collaborative effort with OUR clients. We CAN make your event dreams become REALITY. THROUGH partnerships with some of the best entertainment companies in the nation. Nothing is OUT of reach. From small parties to full stage productions. Three fourteen entertainment is your answer to entertainment.","Mon - Fri: 9:00 am - 5:00 pm",,,,,,http://www.314ent.com,,,,,,,,,
10535,3894,"2020-09-27 02:30:47","Carlos Anino Enterprises, LLC.",,Info@CarlosAninoEnterprises.com,"(646) 481-8236","1001 Texas St Ste 1400",Houston,TX,77002,"1001 Texas St Ste 1400,Houston,TX 77002","Artists Agents, Entertainment Agencies & Bureaus, Magazines, Publicity Service, Talent Agencies",,,,29.76004,-95.36211,,,,"Mon - Fri: 10:00 am - 4:00 pm Sat - Sun Closed","TollFree: (877) 409-9373",,"debit, paypal, cash, all major credit cards",,,,,,,,,,,,
10545,3896,"2020-09-27 02:30:47","Entertainment Booking, Promoting, & Consulting Agency",,,"(870) 949-5517","663 Lincoln Ctr",Camden,AR,71701,"663 Lincoln Ctr,Camden,AR 71701","Counseling Services, Entertainment Agencies & Bureaus, Modeling Schools, Music Schools, Sports Motivational Training",,,,33.56962,-92.85022,,"""I Believe So Therefore I Am""","I'm Skye L. Ruffins, the CEO and founder of QCMPRODUCTIONZ. This is an entertainment booking, promoting, & consulting agency with the mission to help students or adults who are interested in the performance arts and entertainment. My goal is to be able to assist these artists with their careers or potential careers to master their skills and potentially prepare them for the industry. This is a home for all music genres, musicians, actors, models, and dancers.","Mon - Fri: 9:00 am - 5:00 pm Sat - Sun Closed",,,paypal,,,,,,,,,,,,
10555,3901,"2020-09-27 02:30:47","Mesmorized Beauty",,,"(866) 400-9783","436 Ingraham St NW",Washington,DC,20011,"436 Ingraham St NW,Washington,DC 20011","Contractor Referral Services, Entertainment Agencies & Bureaus, Modeling Agencies, Modeling Schools, Talent Agencies",,,,38.95398,-77.01905,,,,"Mon - Fri: 8:00 am - 4:00 pm Sat: 10:00 am - 2:00 pm",,,"financing available, visa, master card, amex, discover, debit, paypal",,,,,,,,,,,,
10560,3902,"2020-09-27 02:30:47","Triple I Entertainment Inc.",,Trippleeye@gmail.com,"(702) 608-1187",,"West Covina",CA,91790,"West Covina,CA 91790","Modeling Agencies, Entertainment Agencies & Bureaus, Talent Agencies",,,,,,,,,,,,,,,,,,,,,,,,
10589,3920,"2020-09-27 02:30:47","Central Casting",http://www.centralcasting.com,,"(212) 947-4859","875 Avenue Of The Americas Fl 15","New York",NY,10001,"875 Avenue Of The Americas Fl 15,New York,NY 10001","Talent Agencies, Entertainment Agencies & Bureaus",,,,40.74821,-73.98934,https://i3.ypcdn.com/blob/7c3c5068ac12084acf69b8c64e9455ef781f008d_100x100_crop.jpg?11da137,,,"Mon - Fri: 9:00 am - 5:00 pm","Primary Phone: (662) 528-4076 Primary Phone: (646) 205-8244 Phone: (646) 205-8244 Phone: (662) 528-4076 TollFree: (800) 562-2718",,,,"Central Casting New York","http://www.centralcasting.com https://www.centralcasting.com http://centralcastingnewyork.com http://centralcasting.org",,,,,,,,,
10622,3930,"2020-09-27 02:30:47","Pine Bluff Dance Academy",,NewsPineBluff@GMAIL.COM,"(870) 534-1053","3113 W 28th Ave","Pine Bluff",AR,71603,"3113 W 28th Ave,Pine Bluff,AR 71603","Cheerleading, Adult Education, Business & Vocational Schools, Dancing Instruction, Entertainment Agencies & Bureaus, Gymnastics Instruction, Modeling Schools, Pageant Managers & Producers",5,"2 Reviews",,34.202,-92.03558,,,"Since 1980, Comptition Routines",,,,,,,,,"Selena M.",06/20/2017,five,"Best dance teacher in the state. I can pick Stacy's dancers out anywhere. They are always classy showstoppers!!!","Toi M.",04/13/2015,five,"This is the Best Dance studio with an Awesome instructor. She loves her children and works very well with them."
10671,3953,"2020-09-27 02:30:47","Hi-Class Limousine",http://hi-classlimo.com,HiClassLimo@gmail.com,"(407) 255-4355",,"Lake Mary",FL,32746,"Lake Mary,FL 32746","Airport Transportation, Advertising Specialties, Advertising-Broadcast & Film, Advertising-Promotional Products, Airline Support Services, Airline Ticket Agencies, Airlines, Airports, Bridal Registries, Bridal Shops, Churches & Places of Worship, Commercial Photographers, Consultants Referral Service, Coupon Advertising, Cruises, Entertainment Agencies & Bureaus, Event Ticket Sales, Facilities & Space Planning Consultants, Family & Business Entertainers, Fashion Designers, Funeral Directors, Limousine Service, Marketing Consultants, Marketing Programs & Services, Modeling Agencies, Pageant Managers & Producers, Port Authorities, Radio Program Producers, Sales Promotion Service, Sports Promoters & Managers, Talent Agencies, Tourist Information & Attractions, Tours-Operators & Promoters, Trade Shows, Expositions & Fairs, Trademark Agents & Consultants, Trams, Transit Advertising, Transit Lines, Transportation Consultants, Transportation Providers, Transportation Services, Travel Agencies, Travel Services-Commercial, Wedding Chapels & Ceremonies, Wedding Music & Entertainment, Wedding Photography & Videography, Wedding Planning & Consultants, Wedding Reception Locations & Services",,,,,,https://i3.ypcdn.com/blob/6faf211744e6defbd18d1ee47f77dc69f11aed0e_100x100_crop.jpg?11da137,,"We are a Luxury Limousine transportation company that provides our customers with safe and luxurios service to there destination .","Mon - Sun: Open 24 Hours","Phone: (407) 569-0990",,"visa, master card, discover, paypal, diners club, carte blanche, company card, jcb",,,"Limousine Transportation Orlando",,,,,,,,,
10706,3954,"2020-09-27 02:30:47","Big Cat Entertainment",http://bigcatentertainment.net,mike@bigcatentertainment.net,"(262) 626-2148","N1577 Maple Tree Rd",Adell,WI,53001,"N1577 Maple Tree Rd,Adell,WI 53001","Bands & Orchestras, Entertainment Agencies & Bureaus, Talent Agencies, Wedding Music & Entertainment",,,,43.59654,-88.14059,,,,,,,,,,"Talent Agent for Bands",,,,,,,,,
10805,4020,"2020-09-27 02:30:50","Schiowitz Connor Ankrum Wolf Inc.",,,"(323) 463-8355","1680 Vine St Ste 614","Los Angeles",CA,90028,"1680 Vine St Ste 614,Los Angeles,CA 90028","Modeling Agencies, Entertainment Agencies & Bureaus, Talent Agencies",,,,34.10128,-118.32632,https://i3.ypcdn.com/blob/4c399e79b0dd2df9f7bb22c1b793da1738c04820_100x100_crop.jpg?11da137,,,,"Primary Phone: (323) 463-4259 Phone: (323) 463-7300 Phone: (323) 463-4259 Fax: (323) 463-7355",,,,"Schiowitz, Clay Ankrum & Ross, Inc. Schiowitz Conner Ankrum Wolf",,,,,,,,,,
10807,4021,"2020-09-27 02:30:50","The 9 Firm, Inc.",http://www.the9firm.com,,"(954) 361-4452","1600 E Sunrise Blvd Apt 3315","Fort Lauderdale",FL,33304,"1600 E Sunrise Blvd Apt 3315,Fort Lauderdale,FL 33304","Entertainment Agencies & Bureaus, Marketing Consultants, Public Relations Counselors, Talent Agencies",,,,26.13714,-80.12762,,,,"Mon - Fri: 9:00 am - 5:00 pm Sat: 9:00 am - 12:00 pm Sun Closed",,,"paypal, financing available, visa, discover, mastercard, all major credit cards, check, debit",,,http://www.the9firm.com,,,,,,,,,
10812,4023,"2020-09-27 02:30:50","The Cheyenne Agency",,,"(484) 601-2128","1217 Vine St",Philadelphia,PA,19107,"1217 Vine St,Philadelphia,PA 19107","Entertainment Agencies & Bureaus, Management Consultants, Musicians, Personnel Consultants, Talent Agencies",,,,39.95797,-75.15927,,"business*entertainment*music*sports - ""we will be heard""","The Cheyenne Agency???????В‚В¬???В‚?? is one of the most well respected and eagerly sought after agencies. They are known throughout the industry for offering business to business solutions, marketing, music and sports management along with the most professional talent available in the United States. The Cheyenne Agency???????В‚В¬???В‚?? quickly gained local success with their Philadelphia clients, and soon, was expanding to other markets. Their focus is on business, entertainment, music, sports, marketing and management. The Cheyenne Agency???????В‚В¬???В‚?? is a full service agency, complete with a management division, marketing division, hair and makeup, music, entertainment and Fashion. The Cheyenne Agency???????В‚В¬???В‚?? is very pleased to have relationships with national clients and non-profit agencies. Affectionately named after his daughter the company is operated by Carlow Stanley, President, and his talented and experienced staff. Their dedication to the industry and their tireless work ethic has helped Cheyenne Agency???????В‚В¬???В‚?? build relationships with clients and agencies in other cities. Their clients range from manufacturing and non-profit companies to entertainers and athletes.","Mon - Fri: 7:00 am - 9:00 pm Sat - Sun Closed",,,,,,,,,,,,,,,
10854,4044,"2020-09-27 02:30:50","Infiniti Entertainment",https://www.infinitientertainment.com,contact@infinitientertainment.com,"(256) 822-2333","411 Bank St NE",Decatur,AL,35601,"411 Bank St NE,Decatur,AL 35601","Meeting & Event Planning Services, Business Plans Development, Entertainment Agencies & Bureaus, Music Producers, Photography & Videography, Talent Agencies, Web Site Design & Services",,,A+,34.61088,-86.98763,https://i4.ypcdn.com/blob/8be627f703919617d8cccf0294e2b44aac263ec6_100x100_crop.jpg?11da137,,"Infiniti Entertainment is an agency that specializes in Photography, Videography, Event Planning, Music Production, Web/IT & Business Development services.","Hours Appointment Only Hours Mon - Sun Open 24 Mon Closed Tue - Sat: 4:00 pm - 8:00 pm Sun Closed",,,"all major credit cards, financing available, invoicing available, check",,"Because Talent is Infinite",https://www.infinitientertainment.com,,,,,,,,,
10865,4049,"2020-09-27 02:30:50","Pure Talent Management",http://www.puretalentmanagement.com,,"(818) 358-3882","4624 Cahuenga Blvd","Toluca Lake",CA,91602,"4624 Cahuenga Blvd,Toluca Lake,CA 91602","Talent Agencies, Entertainment Agencies & Bureaus",,,,34.15478,-118.36082,,,,"Mon - Fri: 9:30 am - 6:30 pm","Primary Phone: (818) 358-3830 Phone: (818) 358-3830",,,,,"http://www.puretalentmanagement.com https://www.puretalentmanagement.com",,,,,,,,,
10898,4065,"2020-09-27 02:30:50","Future Faces NYC",http://www.futurefacesnyc.com,info@futurefacesnyc.com,"(917) 528-1458","747 3rd Ave","New York",NY,10017,"747 3rd Ave,New York,NY 10017","Modeling Agencies, Advertising Agencies, Advertising Specialties, Commercial Photographers, Entertainment Agencies & Bureaus, Photography & Videography, Portrait Photographers, Talent Agencies",5,"69 Reviews",,40.75352,-73.97222,https://i3.ypcdn.com/blob/b3e465a2762b032ca009c770844c548e3b2f4ef1_100x100_crop.jpg?11da137,"The secret of success","Future Faces, kids division of Nina Lubarda Model Management LLC was created with a specific vision seen in the beautiful and unique models we represent. Nina Lubarda Model Management and Future Faces division focus is on discovering new talent and transforming them into working children superstars. The agency's signature is a collective approach, leveraging the know-how and industry relationships of the highly professional agents, with a commitment to each client's long-term objectives. Future Faces NYC has a worldwide reputation as one of the top children exclusive agencies. Nina Lubarda Model Management is well known for their great care of their models and excellent representation. Future Faces NYC has maintained a primary focus on marketing and management of a select group of top children fashion models & internationally recognized names who have developed and expanded their careers into different fields of fashion and other areas including cinema, television, music and a specific & exclusive group of both commercial & editorial image models. With looks that embody the most current trends, Future Faces NYC Models' clients are style-setting celebrities gracing renowned fashion publications, television and ad campaigns from New York to Milan. Future Faces has always provided its clients with a selection of models based on quality over quantity as well as very personal and individual talent management. Future Faces's board is composed only of very carefully selected models. Unlike many other agencies in New York, Future Faces NYC has been known for being a ""boutique agency"" with a different approach. Refusing to be a factory, Future Faces NYC does not sign models with a hit or miss approach in hopes of finding a few that will make it out of the many. Instead, Future Faces NYC carefully handpicks each model with the certainty of them succeeding.","Mon - Fri: 9:00 am - 5:00 pm",,,"all major credit cards, check, debit, paypal, travelers checks, visa, mastercard, amex, discover",,,http://www.futurefacesnyc.com,,"Valerie L.",12/19/2019,five,"Future Faces and Nina Lubarda Model Management has been nothing but AMAZING. My son Noah and Daughter Olivia is currently being represented by this agency. Since being part Future Faces , My son Noah has been requested for several Go&sees. Just a week ago he had a Direct booking for PRIMARY.COM campaign! My daughter Olivia got booked for a Carters Major Campaign just one day after signing with this agency. I would definitely recommend Future faces to anyone looking for an agency for their child. Future Faces and Nina Lubarda are truly the best.","Shaina N.",12/19/2019,five,"My son has been with Future Faces for over 2 years now. Nina Lubarda has been amazing to work with and is very professional and caring to her clients. My son has gotten numerous major CAMPAIGN DIRECT bookings for ZARA , DL1961 and others. My son is doing great things with Nina Lubarda and Future Faces."
10923,4082,"2020-09-27 02:30:50","Hands for Hire",http://www.handmodelingandhairremoval-intl.com,dorianna657@gmail.com,"(202) 797-4555",,,,,,"Modeling Agencies, Entertainment Agencies & Bureaus",,,,,,,"Versatility is the key, let these hands take you to a world of glamour, functionality, high tech and beyond.","I have been working in the beauty business as an independent contractor. Thus, this has enabled me to have the flexibility of incoming assignments. My personality is very pleasant while maintaining a professional work ethic. The emphasis is on punctuality and full dedication to the task, at ""hand"". My ring size is 17.8 cm (7 inches), height 178 cm (5' 10 1/2 inches). In all practicality, my nails grow extremely fast, strong and straight. They are conditioned constantly to maintain their youthful, hydrated and photogenic appearance. I look forward to working with all interested professionals domestically, as well as, internationally. References are available upon request.",,,,,,,http://www.handmodelingandhairremoval-intl.com,,,,,,,,,
10955,4095,"2020-09-27 02:30:50","Shapiro-West & Associates Inc",http://www.georgeshapiro.com,,"(310) 278-8896","141 El Camino Dr Ste 205","Beverly Hills",CA,90212,"141 El Camino Dr Ste 205,Beverly Hills,CA 90212","Talent Agencies, Entertainment Agencies & Bureaus",,,,34.06574,-118.40049,https://i3.ypcdn.com/blob/5799761bf892cf94a2ee7c9df53bb3ee1cf662bd_100x100_crop.jpg?11da137,,,"Mon - Fri: 9:00 am - 5:00 pm",,,,,"Shapiro Geo. L Shapiro-West & Assoc Inc. Shapiro West & Assoc Inc Shapiro Geo. L","http://www.georgeshapiro.com http://pobox.com",,,,,,,,,
10959,4097,"2020-09-27 02:30:50","Rare Talent Booking Agency Inc",,,"(661) 266-3838","5632 Van Nuys Blvd","Van Nuys",CA,91401,"5632 Van Nuys Blvd,Van Nuys,CA 91401","Talent Agencies, Entertainment Agencies & Bureaus",,,,34.17301,-118.4482,,,,,,,,,,,,,,,,,,,
10966,4103,"2020-09-27 02:30:50","Steve Cox Talent Agency",,,"(217) 285-9009","507 W Adams St",Pittsfield,IL,62363,"507 W Adams St,Pittsfield,IL 62363","Talent Agencies, Entertainment Agencies & Bureaus",,,,39.60791,-90.81259,,,,,,,,,,,,,,,,,,,
11016,4135,"2020-09-27 02:30:50","Crowd Control Entertainment",http://www.crowdcontrolent.com,ricardo.kelly@crowdcontrolent.com,"(678) 542-9500","1201 Peachtree St NE Ste 200",Atlanta,GA,30361,"1201 Peachtree St NE Ste 200,Atlanta,GA 30361","Entertainment Agencies & Bureaus, Talent Agencies",,,A+,33.78731,-84.38325,,,,"Mon - Sat: 9:00 am - 5:00 pm",,,,,Qrowd,http://www.crowdcontrolent.com,,,,,,,,,
11025,4141,"2020-09-27 02:30:50","Model Management",http://www.dnamodels.com,Justin@empiremodel.com,"(646) 378-2085","16 Penn Plz","New York",NY,10001,"16 Penn Plz,New York,NY 10001","Modeling Agencies, Entertainment Agencies & Bureaus",5,"1 Review",,40.75256,-73.99343,,,,,"Phone: (212) 643-0111 Phone: (212) 239-3539 Primary Phone: (212) 643-0111",,"master card, visa",,"Marilyn Zitner Marilyn Zitner Management INC Model Management Inc. Choice Model Talent Management Model & Talent Management True Model Management","http://www.dnamodels.com http://www.truemodelevents.com",,"YPMobile User",01/24/2013,five,,,,,
11032,4146,"2020-09-27 02:30:50","Steve Gray The Mobile DJ",,SteveGray10@gmail.com,"(408) 255-5332",,,,,,"Entertainment Agencies & Bureaus, Family & Business Entertainers, Musicians, Talent Agencies",,,,,,,,"For over 20 years, I have helped clients plan their weddings and other events. I provide music variety, emphasizing favorite dance music from the 1950s on. I coordinate well with photographers, videographers, and caterers. I've also successfully provided music for class reunions and anniversaries. I also give clients the opportunity to contribute to the music with their own CDs or IPods.",,,,,,,,,,,,,,,,
11063,4163,"2020-09-27 02:30:50","World Class Sports",http://www.worldclass-sports.com,wcsagent@pacbell.net,"(310) 665-9400","5777 W Century Blvd.,Suite 1070","Los Angeles",CA,90045,"5777 W Century Blvd.,Suite 1070,Los Angeles,CA 90045","Talent Agencies, Entertainment Agencies & Bureaus",,,,33.94704,-118.38268,https://i4.ypcdn.com/blob/1937deab70ac6684bf95dd2142d787e09707aca2_100x100_crop.jpg?11da137,,,,"Phone: (310) 665-9844 Phone: (310) 665-9824 Phone: (310) 342-9825",,,,"Sports, World Class",http://www.worldclass-sports.com,,,,,,,,,
11080,4176,"2020-09-27 02:30:50","Reel One Ent",http://www.reeloneent.com,wgiglobalmedia@gmail.com,"(310) 746-9088","9107 Wilshire Blvd","Beverly Hills",CA,90210,"9107 Wilshire Blvd,Beverly Hills,CA 90210","Entertainment Agencies & Bureaus, Disc Jockeys, Family & Business Entertainers, Talent Agencies",,,,34.06719,-118.39058,,,,"Mon - Fri: 9:00 am - 5:00 pm","Primary Phone: (310) 385-8310 Phone: (310) 388-2244 Phone: (310) 888-2244 Phone: (310) 461-3558 Primary Phone: (310) 888-2244 Phone: (253) 435-9200",,,,"3M & Associates True Moon Entertainment Nso Entertainment Stage 3 Entertainment 3 M & Assoc Battalion Entertainment Reel One Entertainment","http://www.reeloneent.com http://seattlehockey.club",,,,,,,,,