business_x_category.id,business.id,business.ts,business.business_name,business.home_page,business.email_address,business.phone,business.street,business.city,business.state,business.zip_code,business.full_address,business.category,business.rating,business.number_of_reviews,business.bbb_rating_or_license,business.latitude,business.longitude,business.cover_image,business.slogan,business.general_info,business.regular_hours,business.extra_phones,business.services_products,business.payment,business.price_range,business.aka,business.other_links,business.other_information,business.review_1_name,business.review_1_date,business.review_1_rating,business.review_1_text,business.review_2_name,business.review_2_date,business.review_2_rating,business.review_2_text
5729643,1716729,"2020-09-27 05:17:46","Biorev, LLC - The Rendering Company",http://www.biorev.us,info@biorev.us,"(770) 572-1828","400 E Royal Ln Ste 290",Irving,TX,75039,"400 E Royal Ln Ste 290,Irving,TX 75039","Animation Services, Computer Software & Services, Executive Search Consultants, Rendering Companies, Web Site Design & Services",,,,32.89502,-96.93944,,,,"Mon - Sun: Open 24 Hours",,,"all major credit cards",,,"Service, Satisfaction, Success",,,,,,,,,
5733543,1718011,"2020-09-27 05:17:53","Alpha Millenium tech",http://www.alphamilleniumtech.com,support@alphamilleniumtech.com,"(301) 235-3033","11140 Rockville Pike",Rockville,MD,20852,"11140 Rockville Pike,Rockville,MD 20852","Internet Marketing & Advertising, Computer Online Services, Executive Search Consultants, Web Site Design & Services, Web Site Hosting",,,,39.0398,-77.11047,,"Search Engine Marketing Done Right","Alpha Millenium Tech empowers small, local businesses through advanced digital solutions that help them grow their brands online. We tailor our local SEO services to suit the needs of your business and the demands of your industry. Rise above the local competition with a solid digital marketing strategy.","Mon - Fri: 9:00 am - 5:00 pm",,,"check, paypal",,,http://www.alphamilleniumtech.com,,,,,,,,,
5745914,1722118,"2020-09-27 05:18:16","Swizzle.Me Mobile Marketing",,getswizzled@gmail.com,"(928) 642-5437","7200 E Goodnight Ln","Prescott Valley",AZ,86314,"7200 E Goodnight Ln,Prescott Valley,AZ 86314","Internet Marketing & Advertising, Executive Search Consultants, Marketing Consultants, Web Site Design & Services, Web Site Hosting",,,,34.56103,-112.33945,,,,,,,"all major credit cards, paypal",,,,,,,,,,,,
5747344,1722570,"2020-09-27 05:18:16","Real Estate Websites LLC",http://realestatewebsites.co.com,,"(602) 842-7033","7756 E Day Break Cir","Prescott Valley",AZ,86315,"7756 E Day Break Cir,Prescott Valley,AZ 86315","Internet Consultants, Executive Search Consultants, Web Site Design & Services, Web Site Hosting",,,,34.65867,-112.32857,,"Affordable Real Estate Solutions","Real Estate Websites LLC is a website development company that caters, primarily, to Real Estate Agents and Realtors.","Mon - Fri: 8:00 am - 5:00 pm",,,"visa, discover, mastercard, all major credit cards, paypal, check",,,http://realestatewebsites.co.com,,,,,,,,,
13475358,1764300,"2020-09-27 05:22:09",Employma,http://www.employma.com,,"(804) 560-3450",,Midlothian,VA,23113,"Midlothian,VA 23113","Internet Marketing & Advertising, Computer Online Services, Employment Agencies, Executive Search Consultants, Internet Products & Services",,,,,,,"Solving the Employment Puzzle","Online matchmaking for employers and jobseekers.","Mon - Fri: 9:00 am - 5:00 pm Sat - Sun Closed",,,,,,http://www.employma.com,,,,,,,,,
13547813,1776565,"2020-09-27 05:23:26","Green Zebra Marketing",http://www.greenzebra-marketing.com,gina.davis@greenzebra-marketing.com,"(978) 618-9565","292 Crawford St",Northborough,MA,01532,"292 Crawford St,Northborough,MA 01532","Internet Marketing & Advertising, Computer Online Services, Executive Search Consultants, Marketing Consultants, Marketing Programs & Services",,,,42.32414,-71.67797,,,,"Mon - Sun: Open 24 Hours",,,,,,"Full Service Digital Marketing",,,,,,,,,
13581186,1782164,"2020-09-27 05:24:04","Acquisitions Marketing",http://acquisitionsmarketing.com,Info@acquisitionsmarketing.com,"(845) 427-1859","968 Monterey St","San Luis Obispo",CA,93401,"968 Monterey St,San Luis Obispo,CA 93401","Internet Marketing & Advertising, Business Coaches & Consultants, Computer Online Services, Executive Search Consultants, Internet Products & Services, Market Research & Analysis, Photography & Videography",,,,35.28167,-120.66177,https://i2.ypcdn.com/blob/8f4689cc28a8b6547e9fc3fd608d89f2ef3fce7e_100x100_crop.jpg?e66d351,"We Make It Our Business To Find The Perfect Customers For Yours.","We cover all your businesses digital needs from websites to social media advertising and search engine optimization. Everything needed to better connect your businesses with your customers online.","Mon - Sun: Open 24 Hours",,,"all major credit cards, cash, check, apple pay, invoicing available",,,http://acquisitionsmarketing.com,,,,,,,,,
13584571,1782819,"2020-09-27 05:24:04","Check A Date Check A Mate",,support@checkadatecheckamate.com,"(949) 329-8118","7211 Haven Ave. Suite 163","Alta Loma",CA,91701,"7211 Haven Ave. Suite 163,Alta Loma,CA 91701","Executive Search Consultants, Internet Service Providers (ISP), Research Services, Searchers Of Records",,,,34.12338,-117.57377,https://i2.ypcdn.com/blob/3e67b1ce04e176bb41528aeaaa590a606eb67abe_100x100_crop.jpg?e66d351,"PROVIDING PEACE OF MIND",,"Mon - Sun: Open 24 Hours",,,"visa, discover, mastercard, all major credit cards, debit, amex, paypal, carte blanche, jcb, diners club, company card",,,,,,,,,,,,
15116385,1918922,"2020-09-27 05:37:07","United Counseling Service Of Bennington County",http://www.ucsvt.org,,"(802) 681-0303","100 Ledgehill Rd",Bennington,VT,05201,"100 Ledgehill Rd,Bennington,VT 05201","Child Care, Career & Vocational Counseling, Child & Adolescent Guidance Counselors, Counseling Services, Day Care Centers & Nurseries, Educational Services, Employment Agencies, Employment Consultants, Employment Opportunities, Executive Search Consultants, Mental Health Services, Physicians & Surgeons, Psychiatry, Psychologists, Youth Organizations & Centers",5,"1 Review",,42.87261,-73.20568,https://i2.ypcdn.com/blob/a38509ba8af4d664cfd031c662c88640b54da416_100x100_crop.jpg?8ad0f92,"We help people improve their quality of life!","The UCS Mission We help people improve their quality of life. We envision a strengthened community where people feel valued, empowered, secure, and purposeful. We respect people's dignity, accept them for who they are, and creatively help them to thrive, with the understanding that helping others helps us all.","Mon - Fri: 8:00 am - 5:00 pm Sat - Sun Closed","Fax: (802) 442-3363",,"master card, visa, check, insurance",,,http://www.ucsvt.org,"Parking: Lot Specialties: Pediatrics, Relationship Issues, Interpersonal Issues, Relational Therapy, Adult Counseling, Mental Health, Family & Relationship Counseling, Kids Counseling, Child Counseling, Children, Pediatric Counseling, Mental Illness","Nancy B.",11/17/2017,five,"I have been affiliated with UCS for over 24yrs. all staff have always supported me with most of my mental health issues, ie, housing, medical equipment, availavile services, in Bennington county. they have always treated me with dignity, compassion, understanding, and patience. they have a execellent, crt program, and crisis service. among other many things.UCS is a true asset in Bennington county for mental health services. this has been my personal experience.",,,,
15117300,1919026,"2020-09-27 05:37:08","Total Nurses Network Chicago",http://www.tn-networks.com,,"(800) 510-0581","7026 W North Ave",Chicago,IL,60707,"7026 W North Ave,Chicago,IL 60707","Home Health Services, Adult Day Care Centers, Assisted Living & Elder Care Services, Career & Vocational Counseling, Clinics, Employment Agencies, Employment Consultants, Employment Opportunities, Executive Search Consultants, Medical Centers, Medical Clinics, Nurses, Nurses-Home Services",,,A+,41.90924,-87.8014,https://i2.ypcdn.com/blob/8591ab768811d771321b9667d54b8bae3c5fbd38_100x100_crop.jpg?8ad0f92,"Private Nursing & In-Home Care.","Total Nurses Network is a supplemental nursing agency servicing Chicago and its surrounding suburbs. We employ nurses and find them positions in hospitals, nursing homes, home health agencies, hospice, and home care/private duty. Total Nurses Network commitment to quality assurance, our obligation to servicing our nurses needs, and our trained office staff make TNN the premier choice of Nurses. With over 35 years of experience in the health care field, Total Nurses Network has developed a very significant private duty service/home care service in the Chicago area. Our Home Care Director is on call 24/7, and our office is open from 6 am to 12 midnight every day. If you have any specific questions about our Chicago Illinois nurse jobs or employment, call us now at (800) 510-8802. You can also fill out the form on our website and wait for our call shortly.","Mon - Sun: 6:00 am - 12:00 am","Phone: (708) 524-3190 Fax: (800) 407-9352",,"check, debit, visa, master card",,,http://www.tn-networks.com,"Parking: Lot By Appointment Only: No Services: Disabled Services",,,,,,,,
16532585,2219608,"2020-09-27 06:06:41","Osi Atlanta",http://osijobs.com,dave@osijobs.com,"(770) 760-7661","3411 Deer Hollow Run SW",Conyers,GA,30094,"3411 Deer Hollow Run SW,Conyers,GA 30094","Executive Search Consultants, Employment Agencies",,,,33.60238,-84.09253,,,,,,,,,,"http://osijobs.com https://osijobs.com",,,,,,,,,
16532608,2219616,"2020-09-27 06:06:41","Henderson Harbor Search",http://www.hhsearch.com,info@hendersonharbor.com,"(201) 432-6027","200 Hudson St","Jersey City",NJ,07311,"200 Hudson St,Jersey City,NJ 07311","Executive Search Consultants, Employment Agencies",1,"1 Review",,40.71722,-74.03425,,,,,"Phone: (201) 332-2620 Primary Phone: (201) 332-2620 TollFree: (877) 296-5201",,,,"Henderson Harbour Search","http://www.hhsearch.com https://www.hugedomains.com/domain_profile.cfm?d=hhsearch&e=com https://hendersonharbor.com http://hendersonharbor.com",,jmslr1954,"Edited: 11/06/2017",one,"The firm is small and definitely doesn't have the expertise that the representative explained on the phone. At first I thought I would be ""taken care of"" particularly on what I was looking for until, the very nice representative left and some senior recruiter who boasted more about his Robert Half experience and connections elsewhere took over my resume. I thought for sure a Senior Recruiter would explain to me what he & his firm could do for me. The worse part, is this Senior Recruiter, was one of the owners of the firm. In the end, I went on two interviews that so remote from my expertise/skills sets. Very disappointing. I eventually ended up calling Robert Half, who placed me immediately with interviews and I was able to find work in South Jersey. Again, I'm sure this company has some talent, too bad, I was working with someone who definitely cared more about the commission check than the customer service. This group is good should you decide to truly extend yourself to every opportunity available, however I wouldn't waste my time.",,,,
16532622,2219623,"2020-09-27 06:06:41","Pacific Recruiting",http://pacificrecruiting.net,,"(936) 597-6500","20821d Eva St",Montgomery,TX,77356,"20821d Eva St,Montgomery,TX 77356","Executive Search Consultants, Employment Agencies",,,,30.38917,-95.69358,,,,,,,,,,http://pacificrecruiting.net,,,,,,,,,
16532664,2219644,"2020-09-27 06:06:41","Appleone Employment Services",http://www.appleone.com,westpalmbeach@appleone.com,"(561) 683-6868","2000 Palm Beach Lakes Blvd Ste 601","West Palm Beach",FL,33409,"2000 Palm Beach Lakes Blvd Ste 601,West Palm Beach,FL 33409","Employment Agencies, Employment Contractors, Employment Opportunities, Executive Search Consultants",,,,26.71515,-80.0918,,,,,"TollFree: (800) 564-5644",,"master card, visa",,"Apple One Employment Svc",http://www.appleone.com,,,,,,,,,
16532673,2219649,"2020-09-27 06:06:41","Atlantic Management Resources",http://www.amrjobs.com,support@amrjobs.com,"(908) 791-9000","5 Mountain Blvd Ste 9",Warren,NJ,07059,"5 Mountain Blvd Ste 9,Warren,NJ 07059","Executive Search Consultants, Employment Agencies",,,,40.62164,-74.48282,,,,"Mon - Fri: 9:00 am - 5:00 pm","Phone: (908) 322-2252 Primary Phone: (908) 322-2252 Fax: (908) 791-9001 TollFree: (800) 917-9241",,,,"Atlantic Management Resources, Inc.","http://www.amrjobs.com https://www.amrjobs.com http://bartonsearch.com",,,,,,,,,
16532695,2219661,"2020-09-27 06:06:41","Fairview Search Group, LLC",http://www.fairviewsearch.com,info@fairviewsearch.com,"(704) 556-3021","5950 Fairview Rd,Ste 300",Charlotte,NC,28210,"5950 Fairview Rd,Ste 300,Charlotte,NC 28210","Executive Search Consultants, Employment Agencies, Employment Opportunities",,,,35.15129,-80.84104,,,"Executive Search Firm specializing in the placement of Accounting, Finance, Tax, Treasury and Audit professionals in the Charlotte North Carolina region.",,,,,,,http://www.fairviewsearch.com,,,,,,,,,
16532711,2219671,"2020-09-27 06:06:41","Advocate First Executive Search",https://www.advocatefirstes.com,,"(612) 363-0803","4108 Del Rey Ave","Marina Del Rey",CA,90292,"4108 Del Rey Ave,Marina Del Rey,CA 90292","Executive Search Consultants, Employment Agencies",,,,33.98824,-118.4448,,,,,,,,,"Advocate First Executive Search LLC",https://www.advocatefirstes.com,,,,,,,,,
16532758,2219691,"2020-09-27 06:06:41","Employers' Recruiting Ctr Inc",http://ercinc.net,,"(630) 469-3423","236 Grandview Ave","Glen Ellyn",IL,60137,"236 Grandview Ave,Glen Ellyn,IL 60137","Executive Search Consultants, Employment Agencies",,,,41.86806,-88.04968,,,,,,,,,"Employers' Recruiting Center Inc",http://ercinc.net,,,,,,,,,
16532785,2219708,"2020-09-27 06:06:41","Contract Recruiters International",http://contractrecruitersinc.com,,"(843) 399-9461","4815a Broadway St",Addison,TX,75001,"4815a Broadway St,Addison,TX 75001","Executive Search Consultants, Employment Agencies",,,,32.95904,-96.82912,,,,,,,,,"Contract Recruiters Intl",http://contractrecruitersinc.com,,,,,,,,,
16532858,2219737,"2020-09-27 06:06:41","Centennial Inc",http://centennialinc.com,mike@centennialinc.com,"(513) 366-3760","8044 Montgomery Rd Ste 260",Cincinnati,OH,45236,"8044 Montgomery Rd Ste 260,Cincinnati,OH 45236","Executive Search Consultants, Employment Agencies",,,,39.20117,-84.36998,,,,,"Phone: (513) 366-3761 TollFree: (888) 366-3760",,"master card, amex, visa",,"Centennial Incorporated","http://centennialinc.com https://centennialinc.com","Specialties: Managers, Career Changes, General Labor, Career Transition, Driving Records, Factory & Industrial, Human Resource, Manufacturing, Hr, Career Management, Managerial, Communications, Career Development, Op, Distribution, Marketing, Fabrication, Motor Vehicle Records",,,,,,,,
16532924,2219768,"2020-09-27 06:06:41",Hci,http://www.nationalhealthrecruiters.com,,"(919) 577-0025","4928 Linksland Dr Ste 301","Holly Springs",NC,27540,"4928 Linksland Dr Ste 301,Holly Springs,NC 27540","Employment Agencies, Executive Search Consultants",,,,35.65749,-78.81054,,,,,"TollFree: (877) 476-6347",,,,,http://www.nationalhealthrecruiters.com,,,,,,,,,
16532927,2219770,"2020-09-27 06:06:41","Chesapeake Search Partners",http://chesapeakesearchpartners.com,,"(443) 275-7348","22 W Pennsylvania Ave",Towson,MD,21204,"22 W Pennsylvania Ave,Towson,MD 21204","Executive Search Consultants, Employment Agencies, Employment Consultants",,,,39.40086,-76.60391,,,,,,,,,,http://chesapeakesearchpartners.com,,,,,,,,,
16532955,2219785,"2020-09-27 06:06:41","Executive Placement Partners",,,"(931) 223-5718",,,,,,"Employment Agencies, Employment Contractors, Employment Screening, Executive Search Consultants, Temporary Employment Agencies",,,,,,,,,,,,,,,,,,,,,,,,
16532983,2219795,"2020-09-27 06:06:41","Express Employment Professionals",https://www.expresspros.com/oxfordnc,jobs.oxfordnc@expresspros.com,"(919) 693-1730","124 Main St",Oxford,NC,27565,"124 Main St,Oxford,NC 27565","Employment Agencies, Employment Consultants, Employment Contractors, Employment Opportunities, Executive Search Consultants, Temporary Employment Agencies",,,A+,36.31098,-78.58831,https://i4.ypcdn.com/blob/7fc24bd5050d7d545deff715dcf3a1b72e183143_100x100_crop.jpg?41e4770,"Respecting People. Impacting Business.","Express Employment Professionals is on a mission to put a million people to work annually. Our recruiters work with local businesses to provide them with the skilled workers that they require. Whether you are looking for your next employee or to open a door to a new career, Express has a solution for you. Express is committed to the vision of helping as many people as possible find good jobs by helping as many clients as possible find good people. For more information, visit ExpressPros.com.","Mon - Fri: 8:00 am - 5:00 pm Sat - Sun Closed","Fax: (919) 693-6540",,"no credit cards, check",,,"Primary Website","Parking: Lot, Free Wheelchair Accessible: Yes",,,,,,,,
16533057,2219830,"2020-09-27 06:06:41",JDHUNTR,,,"(323) 780-0000",,,,,,"Executive Search Consultants, Employment Agencies, Employment Opportunities",,,,,,,,"Post In House Jobs Free Any City and Reach Thousands of Attorneys. Employers Only. Post Law Jobs or a Logo today and reach 1000's of decision makers in corporate law departments and law firms with JDHUNTR.com, the only Law Job site unique to the legal community. Post your Firms logo on JDHUNTR This is a great opportunity to showcase your company's products or law firm profile. The logo is placed on JDHUNTR and linked to your site with unlimited clicks. Includes 2 free article posts per month authored by your firm. E-mail Blasts to Thousands of Attorneys across the U.S We email opportunities to thousands of attorneys and legal professionals across the U.S. This ensures a wide distribution to professional networks and diverse associations, promoting increased visibility.","Mon - Sun: Open 24 Hours",,,"all major credit cards, debit",,,,,,,,,,,,
16533075,2219841,"2020-09-27 06:06:41","Sterling Recruiters & Consolidated",,,"(303) 934-7343","3545 S Tamarac Dr",Denver,CO,80237,"3545 S Tamarac Dr,Denver,CO 80237","Executive Search Consultants, Employment Agencies",,,,39.65177,-104.89921,https://i4.ypcdn.com/blob/5c40dcef0505e3064214b519fcac0979066a865c_100x100_crop.jpg?41e4770,,,,,,,,,,,,,,,,,,
16533077,2219842,"2020-09-27 06:06:41","Ratner Joanne E",http://jrsearch.com,ratner@ix.netcom.com,"(212) 683-1975","10 E 39th St","New York",NY,10016,"10 E 39th St,New York,NY 10016","Executive Search Consultants, Employment Agencies",,,,40.75116,-73.98153,,,,,,,,,,http://jrsearch.com,,,,,,,,,
16533084,2219844,"2020-09-27 06:06:41","Express Employment Professionals",https://www.expresspros.com/clevelandtn,Jobs.ClevelandTN@ExpressPros.com,"(423) 479-1720","213 Ocoee Crossing Northwest",Cleveland,TN,37312,"213 Ocoee Crossing Northwest,Cleveland,TN 37312","Employment Agencies, Employment Consultants, Employment Contractors, Employment Opportunities, Executive Search Consultants, Temporary Employment Agencies",,,,35.19261,-84.85331,https://i3.ypcdn.com/blob/fa3c2e9f1632d17d8c9492c4121bf678afd71a6f_100x100_crop.jpg?d9a04b5,"Respecting People. Impacting Business.","Express Employment Professionals is on a mission to put a million people to work annually. Our recruiters work with local businesses to provide them with the skilled workers that they require. Whether you are looking for your next employee or to open a door to a new career, Express has a solution for you. Express is committed to the vision of helping as many people as possible find good jobs by helping as many clients as possible find good people. For more information, visit ExpressPros.com.","Mon - Fri: 8:00 am - 5:00 pm Sat - Sun Closed","Phone: (423) 479-3435",,"master card, visa",,,"Primary Website",,,,,,,,,
16533109,2219857,"2020-09-27 06:06:41",OfficeTeam,https://www.roberthalf.com/cleveland-akron/office-administrative,,"(330) 253-8311","50 S Main St",Akron,OH,44308,"50 S Main St,Akron,OH 44308","Executive Search Consultants, Employment Agencies",,,,41.08385,-81.51805,,,"Robert Half OfficeTeam in Akron is a staffing service specializing in placing administrative, customer service and office professionals into temporary and temp-to-hire jobs. Visit us at 1 Gojo Plz Ste 260. At Robert Half, our mission is to help businesses grow by matching the right talent to their specialized staffing and consulting needs, and build rewarding careers for the professionals we place. We adhere to a philosophy of Ethics First in everything we do and create a work environment where employees can thrive and innovate. Robert Half is a socially responsible corporate citizen and an active participant in the communities in which we live and work.","Mon - Fri: 8:00 am - 6:00 pm","Phone: (330) 253-8827 Fax: (330) 253-8827 TollFree: (888) 744-9202",,"debit, discover, master card, visa, cash, company card",,,"https://www.roberthalf.com/cleveland-akron/office-administrative http://www.officeteam.com https://www.roberthalf.com/work-with-us/our-services/officeteam",,,,,,,,,
16533112,2219859,"2020-09-27 06:06:41","Mac Arthur Church & Keres",,,"(402) 333-8333",,Omaha,NE,68145,"Omaha,NE 68145","Executive Search Consultants, Employment Agencies",,,,,,,,,,,,,,,,,,,,,,,,
16533177,2219890,"2020-09-27 06:06:41","Robert Half",https://roberthalf.com/locations/fl-boca-raton/2600-n-military-trail,quality.manager@roberthalf.com,"(561) 994-7212","2600 N Military Trl Ste 125","Boca Raton",FL,33431,"2600 N Military Trl Ste 125,Boca Raton,FL 33431","Employment Agencies, Employment Opportunities, Executive Search Consultants, Temporary Employment Agencies",,,A+,26.37531,-80.11984,,,,"Mon - Fri: 8:00 am - 6:00 pm Sat - Sun Closed","TollFree: (844) 267-5061",,"debit, discover, master card, visa, amex, cash, company card",,,website,,,,,,,,,
16533222,2219919,"2020-09-27 06:06:41","The Pacific Firm",http://www.pacfirm.com,,"(510) 647-1000","2835 7th St",Berkeley,CA,94710,"2835 7th St,Berkeley,CA 94710","Executive Search Consultants, Employment Agencies",,,,37.853916,-122.29205,,,,"Mon - Fri: 9:00 am - 5:00 pm",,,,,,"http://www.pacfirm.com http://awningsofdistinction.com",,,,,,,,,
16533277,2219951,"2020-09-27 06:06:41","Diverse Staffing High Point",https://www.diversestaffing.com,,"(336) 804-5942","2107 Chester Ridge Dr Ste 104","High Point",NC,27262,"2107 Chester Ridge Dr Ste 104,High Point,NC 27262","Employment Agencies, Executive Search Consultants",,,,35.98457,-80.01385,,,,"Mon - Tue: 8:00 am - 5:00 pm Wed: 8:00 am - 7:00 pm Thu - Fri: 8:00 am - 5:00 pm Sat - Sun Closed",,,,,,website,,,,,,,,,
16533307,2219969,"2020-09-27 06:06:42","Kevin White & Assoc",http://www.kwasearch.com,kw@kwasearch.com,"(859) 245-8000","2225 Woodburn Hall Rd",Lexington,KY,40515,"2225 Woodburn Hall Rd,Lexington,KY 40515","Executive Search Consultants, Employment Agencies",,,,37.95914,-84.47494,,,,,,,,,"Kevin White & Associates",http://www.kwasearch.com,,,,,,,,,
16533320,2219974,"2020-09-27 06:06:42","Al Stuart Financial Services",,,"(203) 969-1170","1 Dock St",Stamford,CT,06902,"1 Dock St,Stamford,CT 06902","Executive Search Consultants, Employment Agencies",,,,41.0479,-73.53616,,,,,,,,,"Al Stuart Financial Svc",,,,,,,,,,
16533329,2219977,"2020-09-27 06:06:42",Irg,http://www.irgrecruiters.com,,"(732) 218-8247","1480 Us Highway 9 N",Woodbridge,NJ,07095,"1480 Us Highway 9 N,Woodbridge,NJ 07095","Executive Search Consultants, Employment Agencies",,,,40.555973,-74.28454,,,,"Mon - Fri: 9:00 am - 5:00 pm",,,,,,http://www.irgrecruiters.com,,,,,,,,,