business_x_category.id,business.id,business.ts,business.business_name,business.home_page,business.email_address,business.phone,business.street,business.city,business.state,business.zip_code,business.full_address,business.category,business.rating,business.number_of_reviews,business.bbb_rating_or_license,business.latitude,business.longitude,business.cover_image,business.slogan,business.general_info,business.regular_hours,business.extra_phones,business.services_products,business.payment,business.price_range,business.aka,business.other_links,business.other_information,business.review_1_name,business.review_1_date,business.review_1_rating,business.review_1_text,business.review_2_name,business.review_2_date,business.review_2_rating,business.review_2_text
1291404,412769,"2020-09-27 03:10:23","Industrial Welding & Supply",,iws@qwestoffice.net,"(970) 762-4191","140 Cucarola Rd",Sterling,CO,80751,"140 Cucarola Rd,Sterling,CO 80751","General Contractors, Aluminum, Aluminum-Wholesale & Manufacturers, Building Contractors, Castings-Non-Ferrous Metals, Construction & Building Equipment, Crane Service, Cranes, Environmental & Ecological Consultants, Environmental & Ecological Products & Services, Farm Equipment, Farm Equipment Parts & Repair, Fence-Sales, Service & Contractors, Industrial Equipment & Supplies, Metal Tanks, Metal Tubing, Metals, Steel Erectors, Steel Processing",,,,40.6239,-103.19527,,"Custom Fabrication and Manufacturer of Colt ""best-built"" dump bodies & trailers","At Industrial Welding and Supply we manufacture dump bodies and trailers and much, much more. We have been in the manufacturing and fabrication business for over 35 years. Our staff is experienced in all sorts of manufacturing and fabricating from large to small projects. We carry a huge inventory of steel including AR, Plates, Mild Steel, Aluminum, and Stainless. Our main facility includes a 60' wide by 100' long building that includes a complete painting facility for your fleet or individual truck/machinery. Our Parts Department carries everything for the continued maintenance and repair of your equipment. Colt parts and Service is a Full Line Trailer Repair and Trailer parts facility. We offer crane service with an inventory of two 5 ton overhead cranes. We are the manufacturer of the ""best-built"" dump bodies and trailers. At COLT we believe our job is to ensure that the products we design and manufacture are of the highest quality","Mon - Fri: 7:00 am - 5:00 pm Sat: 7:00 am - 11:00 am Sun Closed","Fax: (970) 522-2206",,"amex, master card",,,,,,,,,,,,
1292895,413165,"2020-09-27 03:10:30","Sharpco Inc",http://www.sharpco.com,,"(318) 450-4700","8770 Frontage Rd",Monroe,LA,71202,"8770 Frontage Rd,Monroe,LA 71202","Steel Fabricators, Cleaners Supplies, Contractors Equipment & Supplies, Farm Equipment, Steel Processing, Sweepers-Power, Tractor Equipment & Parts, Tractor Repair & Service",,,,32.49,-92.01845,,,"Since its early beginnings as a small fabrication business in 1972, Sharpco has evolved into a multi-faceted custom manufacturing, fabrication and equipment repair corporation focused primarily, but not exclusively, in the heavy construction, forestry and and plant maintenance industries. From its fully equipped 42,000 square foot facility in Monroe, Louisiana, Sharpco designs and produces a variety of high quality customized heavy equipment attachments including: land clearing V-Blades and brush piling rakes for track type equipment. special application buckets and mechanical material handling thumbs for crawler excavators. and customized protective guards and screens for a variety of other equipment applications.",,,,,,,"http://www.sharpco.com http://www.sharpcosweepershoes.com",,,,,,,,,
1295087,413794,"2020-09-27 03:10:30","Eds mobile welding and fabrication",,,"(440) 344-7791","3866 US Route 6",Andover,OH,44003,"3866 US Route 6,Andover,OH 44003","Farm Equipment, Steel Fabricators, Welders",,,,41.6068,-80.64643,,,,"Mon - Sun: Open 24 Hours",,,"all major credit cards, amex, debit, discover, visa, cash, mastercard",,,,,,,,,,,,
1304674,416483,"2020-09-27 03:10:49","D & B Agro-Systems, Ltd",http://www.dandbsystems.com,tim@dandbsystems.com,"(641) 864-2604","27845 Highway 65",Hubbard,IA,50122,"27845 Highway 65,Hubbard,IA 50122","Steel Erectors, Electric Equipment & Supplies, Farm Buildings, Farm Equipment, Steel Fabricators",,,,42.29868,-93.30975,https://i3.ypcdn.com/blob/e4aa34cc8927ab5912a3ad56605a61a2f86dd77a_100x100_crop.jpg?63f80dd,"We Build Solutions",,"Mon - Fri: 7:00 am - 4:00 pm Sat - Sun Closed",,,"cash, check, debit, discover, master card, visa, all major credit cards, amex, mastercard",,,"http://www.dandbsystems.com http://www.dandbsystems.com/#ndQyLn","Specialties: Farms, Shops",,,,,,,,
1305706,416781,"2020-09-27 03:10:49","Blaisdell Equipment",http://www.facebook.com/blaisdellequipment,blaisdellequipment@gmail.com,"(207) 492-1660","1105 Madawaska Rd","Connor Twp",ME,04736,"1105 Madawaska Rd,Connor Twp,ME 04736","Farm Equipment Parts & Repair, Farm Equipment, Sandblasting, Steel Distributors & Warehouses, Steel Fabricators",,,A+,46.96905,-67.95649,https://i3.ypcdn.com/blob/6846a659e6dfc1ed99789cbff9a1588a4fdc4bda_100x100_crop.jpg?63f80dd,,,"Mon - Fri: 7:00 am - 5:00 pm Sat: 8:00 am - 4:00 pm Sun Closed",,,,,"Blaisdell Equipment LLC",http://www.facebook.com/blaisdellequipment,,,,,,,,,
1308205,417528,"2020-09-27 03:10:58","Richard Hedman Inc.",http://www.richardhedmaninc.com,richard.hedman@comcast.net,"(559) 549-9169","1706 N Woodson Ave",Fresno,CA,93705,"1706 N Woodson Ave,Fresno,CA 93705","Metal Buildings, Altering & Remodeling Contractors, Building Construction Consultants, Building Contractors, Building Contractors-Commercial & Industrial, Carports, Farm Equipment, General Contractors, Steel Erectors",,,A+,36.76572,-119.83642,//i4.ypcdn.com/videos/SP500019711889/SP500019711889.png?63f80dd,"Our Business is Building Yours","Richard Hedman Inc. is a General Contractor specializing in Design/Build commercial, industrial, and agricultural construction throughout the central valley. We are here to help you layout, plan, and design your project every step of the way. We help in all areas of construction from site layout and building permits to landscaping and occupancy. We have a group of dedicated, long-term employees with a low turnover. A large portion of our work is performed by these employees. This allows Richard Hedman Inc. to ensure our customers receive a quality project on time and on budget.","Mon - Fri: 8:00 am - 5:00 pm Sat - Sun Closed",,,"insurance, financing available, amex, visa, discover, mastercard, all major credit cards, check, debit",,,http://www.richardhedmaninc.com,,,,,,,,,
1308603,417646,"2020-09-27 03:10:58","Bulldog Steel Fabrications",http://www.bsfga.net,info@bsfga.com,"(706) 343-9830","1580 Greensboro Rd",Madison,GA,30650,"1580 Greensboro Rd,Madison,GA 30650","Steel Fabricators, Farm Equipment, Manufactured Housing-Distributors & Manufacturers, Metal Rolling & Forming, Metal Stamping, Steel Bar, Sheet, Strip, Tube, Etc, Steel Processing, Tanks-Wholesale & Manufacturers, Trailers-Equipment & Parts-Wholesale & Manufacturers, Utility Trailers",,,,33.611,-83.43368,https://i4.ypcdn.com/blob/6a430d852a0a63c0d61180417f2f683a7206950a_100x100_crop.jpg?63f80dd,,"Bulldog Steel Fabrication is your ""one source"" facility for all your steel fabrication needs. Our specialty is processing structural, flat rolled and coiled steel into customer specific component parts. Our ability to meet and exceed our customer's requirements for stamped, formed, and assembled products makes Bulldog Steel Fabrication a premier supplier in the industry. BSF Core Values - Uncompromising commitment to excellence and quality management. - Encourage employees to promote responsibility, personal growth and integrity. - Ensure open communication to encourage a strong and positive working culture. - Deliver to our customerВ’s products and services of the highest quality to win their respect and loyalty.","Mon - Fri: 7:00 am - 5:00 pm Sun Closed","Phone: (706) 342-8037 Primary Phone: (706) 342-8037",,"cash only",,,http://www.bsfga.net,,,,,,,,,
1308959,417731,"2020-09-27 03:10:58","Custom Agri Systems, Inc",http://custom-agri-systems.com,bstorch@casindustries.com,"(567) 341-4021","255 County Road R",Napoleon,OH,43545,"255 County Road R,Napoleon,OH 43545","Steel Erectors, Aluminum, Brass, Bronze, Construction Engineers, Copper, Electricians, Farm Equipment, Farm Equipment Parts & Repair, Farming Service, Grain Drying, Grain Elevators, Lead, Metals, Professional Engineers, Scrap Metals, Smelters & Refiners-Precious Metals, Steel Processing, Structural Engineers",,,A+,41.39097,-84.14327,,"Quality Grain Handling Equipment.","Custom Agri Systems, Inc., a grain handling company, has been family owned and operated since 1982. In addition to our main office in Napoleon, OH, we have eleven additional locations to better serve you: Upper Sandusky, OH. Attica, OH. Coldwater, MI. Beloit, OH. Columbia City, IN. Washington, IN. Frankfort, IN. Belmont, WI. Mt. Vernon, OH and Cherry, IL. We're more than just a grain handling company-we are the area's leading wind turbine authority. Custom Agri Systems offers: Full-service industrial fabrication, Millwright services, Conveyors and grain handling systems, Full-service electrical and electric motor repair, Grain bins and dryers, Manlift maintenance, Portable augers, Renewable energy turbines, We also provide commercial fire suppression systems to help control grain dryer fires. All of our employees are trained regularly and provided with the newest equipment. Custom Agri Systems, Inc. welcomes the opportunity to serve you in all your grain handling needs. Call Custom Agri Systems today for a quote!","Mon - Fri: 8:00 am - 5:00 pm Sat - Sun Closed",,,"check, cash",,,http://custom-agri-systems.com,,,,,,,,,
1314338,419261,"2020-09-27 03:11:02","Gaterman Mfg Co Inc",http://www.gaterman.com,deanna@gaterman.com,"(920) 682-6108","836 S 15th St",Manitowoc,WI,54220,"836 S 15th St,Manitowoc,WI 54220","Sheet Metal Fabricators, Assembly & Fabricating Service, Farm Equipment, Metal Cutting, Metal Rolling & Forming, Metal Stamping, Pipe Bending & Fabricating, Steel Bar, Sheet, Strip, Tube, Etc, Steel Fabricators, Tube Bending & Fabricating, Welders",,,,44.09065,-87.66763,https://i4.ypcdn.com/blob/3352fee5b3a7979a58a9c1f1ff85a1249cf5b18c_100x100_crop.jpg?63f80dd,"Excellence in Customer Satisfaction...In Business for over 100 years!",,"Mon - Fri: 8:00 am - 5:00 pm",,,amex,,,http://www.gaterman.com,"Specialties: Atvs",,,,,,,,
1315799,419672,"2020-09-27 03:11:02","Blue Collar Welding LLC",http://www.bluecollarwelding.com,info@bluecollarwelding.com,"(512) 781-6636",,Austin,TX,78737,"Austin,TX 78737","Welders, Antique & Classic Cars, Assembly & Fabricating Service, Automobile Restoration-Antique & Classic, Farm Equipment, Gates & Accessories, Metal Cutting, Metal Cutting Machines, Metal Specialties, Metal Tubing, Pipe Bending & Fabricating, Restaurant Equipment-Repair & Service, Sheet Metal Fabricators, Signs, Steel Fabricators, Trailers-Repair & Service, Tube Bending & Fabricating",5,"2 Reviews",,,,,,,"Mon - Thu: 9:00 am - 5:00 pm Fri: 9:00 am - 3:00 pm Emergency Hours","Phone: (830) 609-8735",,"visa, paypal, discover, mastercard, amex",,"Blue Collar Welding",http://www.bluecollarwelding.com,,"Stephanie P.",01/30/2016,five,"These guys are amazing. Great customer service. I received my estimate for my big project in just a few days. They were on time for the job and completed it on time. They really exceeded my expectations.","Marie L.",05/17/2014,five,"I couldn't have asked for a better welding company to help with my project. Justin was very professional about the project and did an amazing job. I would definitely recommend him to everyone who needs any welding done."
1321451,421338,"2020-09-27 03:11:15","Thomas Welding LLC",,unclehims@yahoo.com,"(256) 867-4435","18635 Wire Way",Elkmont,AL,35620,"18635 Wire Way,Elkmont,AL 35620","Welders, Building Contractors, Building Contractors-Commercial & Industrial, Building Maintenance, Farm Equipment, Farming Service, Farms, General Contractors, Iron Ornamental Work-Supplies, Iron Work, Metal Tanks, Metal Tubing, Railings-Manufacturers, Steel Erectors, Steel Processing, Welding Equipment & Supply",,,A+,34.91524,-86.91045,https://i3.ypcdn.com/blob/e1c09d2c1636cf902cf07dc143ccb279d29187c4_100x100_crop.jpg?63f80dd,,"Servicing Decatur, Huntsville, and surrounding areas over 25 years. We do quality work at a reasonable price. We specialize in welding, aluminum, Stainless, Cast Iron and Ornamental Iron.","Mon - Fri: 7:30 am - 4:00 pm",,,"all major credit cards, visa, mastercard, amex, discover, jcb, diners club",,,,,,,,,,,,
1321953,421463,"2020-09-27 03:11:15","Iron Horse Steel",http://www.ironhorsefarmsal.com,,"(334) 683-4450","1355 County Road 6",Marion,AL,36756,"1355 County Road 6,Marion,AL 36756","Steel Fabricators, Farm Equipment, Farm Supplies, Metal Specialties, Steel Distributors & Warehouses, Steel Mills, Steel Processing",,,,32.53461,-87.23827,https://i4.ypcdn.com/blob/c6fe3f14b3e652188c07148218900f3b3bd84374_100x100_crop.jpg?63f80dd,,"We can custom fabricate any small farm project & offer special prices on bulk purchase orders. Call or email us today for more information!","Mon - Fri: 8:00 am - 4:30 pm Sat - Sun Closed",,,,,"Iron Horse Farms",http://www.ironhorsefarmsal.com,,,,,,,,,
1322023,421483,"2020-09-27 03:11:15","Metz Welding, Inc.",http://www.metzproseries.com,metzweldinginc@gmail.com,"(608) 922-6428","10837 Dunbarton Rd",Gratiot,WI,53541,"10837 Dunbarton Rd,Gratiot,WI 53541","Welders, Farm Equipment, Steel Fabricators",,,,42.56315,-90.03414,https://i4.ypcdn.com/blob/295eb06e29a1e9a07c7d1a16416a699383047cbd_100x100_crop.jpg?63f80dd,"Custom steel fabrication and welding","For over 35 years, Metz Welding Inc., located in southern Wisconsin, has provided custom steel fabrication and welding services to the public. Addition to those services, we manufacture superior quality skid steer loader attachments. Our business model has always been to incorporate the highest quality components and providing our customers products that are build to last. We never compromise the steel requirements or cut corners. This philosophy has never been more evident in the shear mass of the Metz Pro Series lineup.","Mon - Fri: 7:30 am - 4:30 pm Sat - Sun Closed",,,"visa, debit, check, cash, all major credit cards, mastercard, discover",,,"Metz Pro Series Skid Steer Attachments",,,,,,,,,
1329895,423693,"2020-09-27 03:11:20","J & S Mobile Welding & Fabrication",,,"(828) 676-8191","920 barnardsville hwy,",Weaverville,NC,28787,"920 barnardsville hwy,,Weaverville,NC 28787","Welders, Farm Equipment, Sheet Metal Fabricators, Steel Erectors, Welding Equipment Repair",,,,35.78196,-82.49887,,"Just call the best don't worry about the rest","J&S Mobile Welding offers a wide variety of services from custom fabrication to structural steel erecting and iron worker. Commercial to residential handrails and stairs to heavy equipment repairs.","Mon - Sat: 7:00 am - 5:00 pm",,,"discover, visa, all major credit cards, check, debit, mastercard",,,,,,,,,,,,
1333121,424619,"2020-09-27 03:11:30","Eastern Equipment & Supply",https://www.easternequipmentandsupply.com,eesco@yucca.net,"(575) 468-0002","42421 Us 70",Portales,NM,88130,"42421 Us 70,Portales,NM 88130","Bearings, Aluminum, Brass, Bronze, Building Contractors, Construction Engineers, Copper, Farm Equipment, Farm Equipment Parts & Repair, Industrial Equipment & Supplies, Lead, Metal Tanks, Metal Tubing, Metals, Professional Engineers, Scrap Metals, Smelters & Refiners-Precious Metals, Steel Bar, Sheet, Strip, Tube, Etc, Steel Erectors, Steel Processing, Structural Engineers, Welding Equipment & Supply",,,,34.179916,-103.33631,,,"Claim your business to immediately update business information, track page views, and more! Categorized under Industrial Gases. Our records show it was established in 1991 and incorporated in NM. Current estimates show this company has an annual revenue of 2000000 and employs a staff of approximately 2.","Mon - Sat: 7:00 am - 5:00 pm",,,"cash, check",,,"https://www.easternequipmentandsupply.com http://easternequipmentandsupply.com",,,,,,,,,
1336483,425525,"2020-09-27 03:11:38","StarMobile Welding Services",https://starmobile-welding-service.business.site/?m=true,billyprince45@gmail.com,"(580) 716-2293","309 S Oak","Ponca City",OK,74601,"309 S Oak,Ponca City,OK 74601","Welders, Construction & Building Equipment, Farm Equipment, Farm Equipment Parts & Repair, Fence Repair, Oil Field Equipment, Oil Refiners, Pipe Fittings, Pipe Line Companies, Pipe Line Contractors, Sheet Metal Fabricators, Steel Detailers Structural, Steel Fabricators, Welding Equipment Repair, Yard Signs",,,,36.70101,-97.08758,,"We Only Do It Right,","Mobile welding Ponca City, and surrounding areas. Mig, Tig, Stick, and Flux core welding. Fabrication, Wrought Iron, fence, auto, machinery, yard art, furniture, custom fabrication ETC. We offer In-House & On-Site welding. No job too small! Also offer: Instructor services, teaching structural & Pipe welding for certification.","Mon - Sun: 7:00 am - 7:00 pm",,,,,,"Primary Website",,,,,,,,,
1337935,425945,"2020-09-27 03:11:38","United Rentals",http://www.ur.com,webcorrespondenceteam@ur.com,"(303) 623-4131","1250 Zuni St",Denver,CO,80204,"1250 Zuni St,Denver,CO 80204","Contractors Equipment Rental, Bulldozers, Cabs-Tractor, Truck, Etc., Compressor Rental, Compressors, Compressors-Wholesale, Concession Supplies & Concessionaires, Concrete Construction Forms & Accessories, Concrete Equipment & Supplies, Concrete Mixer Rental, Concrete Mixers, Concrete Pumping Equipment, Concrete Reinforcements, Construction & Building Equipment, Contractors Equipment & Supplies, Crane Service, Cranes, Cranes-Renting & Leasing, Cutting Tools, Drilling & Boring Equipment & Supplies, Drills, Dump Truck Service, Electric Generators, Electric Tools, Excavating Equipment, Farm Equipment, Farm Supplies, Forklifts & Trucks, Forklifts & Trucks-Rental, Forklifts & Trucks-Repair, Generators, Generators-Electric-Renting, Generators-Electric-Service & Repair, Hand Tools, Hoists, Hydraulic Equipment Manufacturers, Hydraulic Tools, Industrial Forklifts & Lift Trucks, Industrial Truck Rental, Lifts-Automotive & Truck, Machinery Movers & Erectors, Man Lifts, Mobile Cranes, Moving Equipment Rental, Moving-Self Service, Pipe Cutting & Threading, Pipe Cutting & Threading Equipment, Pressure Cleaning Equipment & Supplies, Pressure Washing Equipment & Services, Rental Service Stores & Yards, Rental Supplies-Wholesale & Manufacturers, Scaffolding & Aerial Lifts, Scaffolding-Renting, Steel Erectors, Tool Rental, Tools, Tools-Wholesale & Manufacturers, Tractor Dealers, Tractor Equipment & Parts, Tractor Equipment & Parts-Wholesale, Tractor-Rent & Lease, Trailer Equipment & Parts, Trailer Hitches, Trailer Renting & Leasing, Trailers-Automobile Utility, Trailers-Repair & Service, Transport Trailers, Truck Rental, Truck Trailers, Tube Bending & Fabricating, Used Tools, Utility Trailers, Van Rental & Leasing, Water Pressure Cleaning, Welders, Welding Equipment Rental",,,,39.73607,-105.0154,https://i3.ypcdn.com/blob/fde473b74e139088291c7551a48377af2291c1d7_100x100_crop.jpg?63f80dd,,"With the largest fleet in the industry and over 1,000 locations across North America, United Rentals is your single source to rent equipment. and tools. You can count on our team of industry experts, top-tier equipment & tools, and 24/7 customer service to keep your operations running smoothly, day or night.",,,,"amex, discover, master card, visa, cash, debit",,,http://www.ur.com,"Services: Manned Lifts, Tool & Equipment Rental",,,,,,,,
1341151,426888,"2020-09-27 03:11:40","Mundy's Machine & Welding",,mundys@frontier.com,"(208) 882-5648","2650 Highway 95 S",Moscow,ID,83843,"2650 Highway 95 S,Moscow,ID 83843","Steel Fabricators, Aluminum, Brass, Bronze, Building Contractors, Construction Engineers, Copper, Farm Equipment, Farm Equipment Parts & Repair, Farming Service, Farms, Lead, Metal Specialties, Metal Tanks, Metal Tubing, Metals, Professional Engineers, Scrap Metals, Smelters & Refiners-Precious Metals, Steel Detailers Structural, Steel Erectors, Steel Processing, Structural Engineers, Welders",,,,46.70891,-117.00461,,"We can weld anything","Mundy's Machine & Welding is a full-service welding and fabrication shop located in Moscow, Idaho. We also provide retail steel sales and aluminum fabricating. We can weld all things from small items to farm equipment. Call us today for more information.","Mon - Fri: 8:00 am - 5:00 pm Sat - Sun Closed",,,,,,,,,,,,,,,
1342755,427355,"2020-09-27 03:11:50","Rock River Blacksmith, L.L.C.",https://rockriverblacksmithllc.com,rrblacksmith@att.net,"(920) 261-4399","1014 - B S. Second St.",Watertown,WI,53094,"1014 - B S. Second St.,Watertown,WI 53094","Steel Fabricators, Blacksmiths, Farm Equipment, Farm Equipment Parts & Repair, Farming Service, Iron Ornamental Work-Supplies, Machine Tool Repair & Rebuild, Railings-Manufacturers, Rails, Railings & Accessories Stairway, Sandblasting, Trailers-Repair & Service, Welders",,,,43.18617,-88.72528,https://i3.ypcdn.com/blob/6869751964e2957edef5ae9287f4ea478bfeccc9_100x100_crop.jpg?63f80dd,,"Rock River Blacksmith, L.L.C., in Watertown, Wisconsin, is the areaВ’s fabrication specialist serving all of Dodge County, Jefferson County, Dane County and the surrounding areas since 2013. We specialize in welding, sandblasting, fabrication and more. Call Rock River Blacksmith, L.L.C. in Watertown today for all needs in welding, sandblasting and more.","Mon - Fri: 8:00 am - 4:30 pm Sat - Sun Closed",,,"check, cash",,,"Primary Website Facebook",,,,,,,,,
1343012,427440,"2020-09-27 03:11:50","Florida Metallizing Service",https://fmsmulberry.com,,"(863) 869-6143","1810 State Road 37 S",Mulberry,FL,33860,"1810 State Road 37 S,Mulberry,FL 33860","Milling Machinery, Automation Systems & Equipment, Building Contractors, Farm Equipment, Farm Equipment Parts & Repair, Machine Shops, Manufacturing Engineers, Mechanical Engineers, Metal Cutting Machines, Metal Tanks, Metal Tubing, Oil & Gas Exploration & Development, Professional Engineers, Prototypes, Steel Erectors, Steel Processing",,,,27.88114,-81.97461,,"Serving Polk County since 1958. Call us for all your machine shop needs. Pick Up & Delivery.","Founded in 1959, Florida Metallizing Service, Inc. is a machine shop that provides various related services. The company offers an array of services that include pump shell repair, submerged arc welding cable groove repair, circulating pump impeller repair, and reconditioned gearbox, and much more. Call us today for more information!","Mon - Fri: 8:00 am - 5:00 pm Sat - Sun Closed","Fax: (863) 425-4273",,"master card, amex, discover, visa",,,https://fmsmulberry.com,,,,,,,,,