business_x_category.id,business.id,business.ts,business.business_name,business.home_page,business.email_address,business.phone,business.street,business.city,business.state,business.zip_code,business.full_address,business.category,business.rating,business.number_of_reviews,business.bbb_rating_or_license,business.latitude,business.longitude,business.cover_image,business.slogan,business.general_info,business.regular_hours,business.extra_phones,business.services_products,business.payment,business.price_range,business.aka,business.other_links,business.other_information,business.review_1_name,business.review_1_date,business.review_1_rating,business.review_1_text,business.review_2_name,business.review_2_date,business.review_2_rating,business.review_2_text
17812422,2619862,"2020-09-27 06:44:05","JD Signs",http://www.jdsignage.com,jdsigns@wowway.com,"(734) 522-1888",,Westland,MI,48185,"Westland,MI 48185","Windows, Banners, Flags & Pennants, Sign Lettering, Signs, Vehicle Wrap Advertising",,,,,,,"Creative Signs for Better Signs!",,"Mon - Fri: 9:00 am - 5:00 pm Sat: 10:00 am - 2:00 pm Sun Closed",,,"check, paypal, cash, no credit cards",,,"A look through a window into our creativity.",,,,,,,,,
17846068,2622322,"2020-09-27 06:44:24","Signs N More",http://www.signsnmoreiowa.com,info@signsnmoreiowa.com,"(515) 285-8700","1332 E Madison Ave","Des Moines",IA,50313,"1332 E Madison Ave,Des Moines,IA 50313","Windows, Banners, Flags & Pennants, Service Station Equipment & Supplies, Service Station Equipment Maintenance & Repair, Sign Lettering, Signs, Vinyl Windows & Doors",,,A+,41.63341,-93.60152,https://i4.ypcdn.com/blob/9d884408f90cc8b75313ddc5318e618e6d67878c_100x100_crop.jpg?63f80dd,"Signs N More is family owned and operated. We can handle any job, big or small.","We do wraps for any vehicle imaginable! Boats, Cars, Trucks, Motorcycles, RV, Commercial Vehicles. Get a free quote today! Vehicle lettering is a must for business owners big and small! Promoting your business on your vehicle is one of the best ways to get your name out there. We install all kinds of signs anywhere and everywhere. Channell letters, Raceways, Pole Signs, Monument Signs, and Building Signs.","Mon - Fri: 8:00 am - 4:30 pm Sat - Sun Closed",,,"discover, visa, mastercard, all major credit cards, check, debit, amex",,,http://www.signsnmoreiowa.com,,,,,,,,,
17877539,2624624,"2020-09-27 06:46:59","East. Coast Tinting And Design Inc",https://www.facebook.com/ecttint,,"(772) 287-4200","3574 SE Dixie Hwy",Stuart,FL,34997,"3574 SE Dixie Hwy,Stuart,FL 34997","Windows, Auto Repair & Service, Banners, Flags & Pennants, Door & Window Screens, Draperies, Curtains & Window Treatments, Fine Art Artists, Glass Blowers, Glass Coating & Tinting, Glass Coating & Tinting Materials, Glass-Auto, Plate, Window, Etc, Glass-Beveled, Carved, Etched, Ornamental, Etc, Glass-Block, Metal Windows, Shutters, Signs, T-Shirts, Vehicle Wrap Advertising, Window Tinting, Yard Signs",5,"13 Reviews",A+,27.16143,-80.21533,https://i4.ypcdn.com/blob/54be015634e027f01321bceed85a963cfbb29281_100x100_crop.jpg?63f80dd,""" Why Squint When You Can Tint?""","Auto - Marine - Residential - Commercial - We offer full sign shop services as well. We are a Family Owned and Operated Company.","Mon - Fri: 9:00 am - 4:30 pm",,,"cash, check, debit, visa, mastercard",,"East Coast Tinting And Design Inc",https://www.facebook.com/ecttint,,"Amanda S.",04/30/2015,five,"""Such a pleasure to work with! We use them for all our company veichles and storefronts. They are all about customer service and have impeccable attention to ...""moredetail!""less","Chris C.",04/30/2015,five,"This is by far the best tint place anywhere around they've done all my vehicles and my home very professional clean and priced great. Anthony is great at what he does their wonderful! Thanks again guys for 5 he great work"
17904593,2626633,"2020-09-27 06:47:12","Cliff Sullivan Building Specialties",,,"(318) 487-9220","1219-B Texas Ave",Alexandria,LA,71301,"1219-B Texas Ave,Alexandria,LA 71301","Windows, Banners, Flags & Pennants, Building Contractors, Building Materials, Gutter Covers, Gutters & Downspouts, Home Builders, Home Repair & Maintenance, Siding Contractors, Siding Materials, Signs, Windows-Repair, Replacement & Installation",,,,31.28962,-92.47266,,,,,,,,,,,"Specialties: Vinyl, Spouts Services: Gutter Cover Installation",,,,,,,,
18012463,2634164,"2020-09-27 06:47:53","Airport Sign & Graphics",http://www.airportsignsdsm.com,info@airportsignsdsm.com,"(515) 224-4959","5807 Fleur Dr","Des Moines",IA,50321,"5807 Fleur Dr,Des Moines,IA 50321","Windows, Advertising Specialties, Awnings & Canopies, Banners, Flags & Pennants, Boat Maintenance & Repair, Graphic Designers, Signs",,,A+,41.53185,-93.64451,,"Home of the original ""Non-stop customer service"".",,"Mon - Fri: 8:30 am - 5:00 pm",,,"check, debit, discover, insurance, master card, visa",,,http://www.airportsignsdsm.com,,,,,,,,,
18059004,2637362,"2020-09-27 06:48:06","Made In The Shade Window Tinting",https://amadeintheshade.com,madeintheshadeinc@msn.com,"(480) 985-9293","3820 E Main St Ste 14",Mesa,AZ,85205,"3820 E Main St Ste 14,Mesa,AZ 85205","Automobile Customizing, Banners, Flags & Pennants, Blinds-Venetian & Vertical, Door & Window Screens, Draperies, Curtains & Window Treatments, Glass Coating & Tinting, Glass Coating & Tinting Materials, Glass-Auto, Plate, Window, Etc, Glass-Stained & Leaded, Graphic Designers, Screens, Signs, Window Shades-Equipment & Supplies, Window Tinting, Windows",,,A+,33.41591,-111.74857,https://i4.ypcdn.com/blob/2254f2d7f2642f8ded1b0d9c93568d3119cb53bd_100x100_crop.jpg?63f80dd,"Made In The Shade, Where YOU are the Coolest!","We look forward to Serving You! We have tried to provide thorough information for all of our Services. On our Secured site You will find all your answers for your Auto-Car-Truck-Vehicle Tinting, Residential-Home-House Tinting, Commercial-Office-Building Tinting as well as Residential-Home-Commercial-Office Window Coverings and Exterior Sunscreens or Roller Screens. Made In The Shade Window Tinting Mesa-Phoenix-AZ has been Serving the Valley With Integrity Since 1980! This makes us one of the oldest most established Window Tinting-Film Dealers in Arizona! Over the years we have built up the credentials and referrals to make us a Premier Dealer. The best thing About Us is, when you Buy Solar Control Products from our Team You will receive genuine care and concern to do our best every day for every customer and this guarantees a great experience for You the customer! We provide several Vehicle Window Tint-Film types with the best Discounts available for High Quality Manufacture Lifetime Warrantied Professional Grade Tinting-Film products and Free Online Vehicle Tint Estimates. The same Quality of choices and service is offered for our Residential and Commercial Building Tinting-Film-Coverings-Screens with Free Online Home-Office Estimates as well. You may also go to the Contact Us Page or if on your mobile just click on the Click To Call or Click to Text boxes on every page, or Call 480-985-9293 and we will respond as quickly as possible! Thank You and We Hope You Buy from Made In The Shade Window Tinting Mesa-Phoenix-AZ, Our Mission is To Offer you the best possible Choices and Quality of Solar Control Products, with Reasonable Pricing and Qualified Personnel, so we can be your window film and covering expert for life! We offer our Services to: Home Owners, Business and Building Owners, Property Management Companies, Contractors, Decorators, Designers, Architects, Project managers, Glass Companies. Basically, if you or your tenant or customers have glass you are a potential customer in need of our expertise! We have been providing window tinting and coverings in Arizona with integrity since 1980. Our family owned and operated business is staffed by highly trained professionals whom possess multiple certifications. Window Tinting or Films for your home, office, or auto is a wise investment now that will save you money in the future. We offer only proven products such as: V-Kool, Llumar, Solar Gard, Madico, SUN-GARD, Suntek, Sunscape, Geoshield and 3M . Because we are affiliated with Window Film U.S.A we can also provide products such as Vista, Huber Optic, Panorama and more! * Reduce harmful UV rays providing skin protection and fade reduction * Reduce heat making your building or auto more comfortable and energy efficient * Provide daytime privacy and reduce unwanted glare * Provide safety from flying glass, security and theft deterrent.","Mon - Sat: 8:00 am - 5:00 pm Sun Closed",,,"all major credit cards, check, debit, financing available, visa, discover, mastercard, amex",,,https://amadeintheshade.com,"Specialties: Trucks, Scratches",,,,,,,,
18184153,2646128,"2020-09-27 06:49:01","Adhesive Pro",http://www.adhesiveprodfw.com,david@adhesiveprodfw.com,"(214) 668-6438","630 E Highway 67",Duncanville,TX,75137,"630 E Highway 67,Duncanville,TX 75137","Automobile Customizing, Automobile Accessories, Banners, Flags & Pennants, Energy Conservation Consultants, Energy Conservation Products & Services, Glass Coating & Tinting, Graffiti Removal & Protection, Sign Lettering, Window Shades-Equipment & Supplies, Window Tinting, Windows",5,"6 Reviews",,32.63575,-96.89591,https://i4.ypcdn.com/blob/b7245da9bb7424a5dbef50d5c9dfc1355bf0d465_100x100_crop.jpg?63f80dd,"Sticking our stuff on your stuff since 2008!","* 7 Days a Week by Appt. Only * Checks Cash & Credit Cards Top of the line films Lifetime Warranty Graffiti Protection Safety Film Decorative Films Commercial Residential Auto","Mon - Fri: 9:00 am - 6:00 pm Sat: 10:00 am - 4:00 pm Sun Closed",,,"mastercard, check, visa, discover",,AP-TINT,http://www.adhesiveprodfw.com,,"Ladon W.",04/01/2017,five,"If you want my top recommendation from me on where to get your windows tinted in the Dallas Fort Worth area without hesitation I'm going to recommend #adhesivepro in Duncanville, TX. I've dealt with Texas Sound in Oakcliff to tint shops at Traders Village but nothing comes close to the quality of tint these guys use but most of all their customer satisfaction and service is A+. David is the owner and he tinted my car himself and made sure I was 100% satisfied from the beginning to the end. I know we normally post only with complaints but I had to make sure these guys got their kudos and with the summer approaching everyone will be asking where to get their windows tinted and to make it easy I'm giving you the plug now in the Spring. These guys are definitely the best in Dallas! Thanks David for everything...","Marsha J.",09/09/2016,four,"I stopped by to get a bubble in my tint fixed, I was in & out in 45mins tops. A very professional job done."
18286243,2653374,"2020-09-27 06:49:55","Next Day Signs",http://www.nextdaysignssc.com,sales@nextdaysignssc.com,"(864) 328-5600","106 Welpine Ridge Road",Anderson,SC,29625,"106 Welpine Ridge Road,Anderson,SC 29625","Marketing Programs & Services, Balloons-Advertising & Signage, Banners, Flags & Pennants, Boat Painting & Lettering, Bumper Stickers, Decals, Murals, Printing Services, Sign Lettering, Signs-Maintenance & Repair, Store Fronts, Truck Painting & Lettering, Vehicle Wrap Advertising, Windows, Yard Signs",,,,34.58592,-82.64997,https://i4.ypcdn.com/blob/c0cae7253eb30e68bff1dfb1df12e49905d25dd3_100x100_crop.jpg?63f80dd,"Quality products with a quick turnaround!","Next Day SignВ’s is a full service graphics design / sign company that offers high quality graphics, signage, designs and promotional items at competitive prices to all customers small and large by offering printing solutions for indoor and outdoor applications such as billboards, display graphics, retail signage, point of purchase displays, building banners, vehicle wraps, wall murals and much more. We are located in Anderson, South Carolina and service the entire upstate area. Our entire staff is dedicated to providing superior quality and services to our customers to make your job easier. Whether you need a completely new look for your business, or something as simple as a graduation banner we can assist you every step of the way. Quantity is never an issue, whether it is one sign or thousands we can fulfill your needs. We pride ourselves in establishing a long lasting relationship with our customers by exceeding their expectations and gaining trust with a hassle free experience to make us the ultimate one stop shop for everyone. When quality matters customers count on us!","Mon - Wed: 9:00 am - 6:00 pm Thu: 9:00 am - 6:00 am Fri: 9:00 am - 6:00 pm Sat: 9:00 am - 2:00 pm Sun Closed",,,"visa, discover, mastercard, all major credit cards, check, paypal",,,http://www.nextdaysignssc.com,,,,,,,,,
18756106,2720027,"2020-09-27 06:55:51","Allstar Printing",http://www.allstar-printing.com,info@allstar-printing.com,"(321) 777-7320","772 Washburn Rd Ste A",Melbourne,FL,32934,"772 Washburn Rd Ste A,Melbourne,FL 32934","Printing Services-Commercial, Banners, Flags & Pennants, Inks Printing & Lithographing, Printing Services, Screen Printing",,,,28.11894,-80.68719,https://i2.ypcdn.com/blob/b2b8ef97defb94a6792077c435aa63046f2366f7_100x100_crop.jpg?8ad0f92,,"AllStar Printing utilizes large presses and digital printers to meet the varying needs of its customers. AllStar is a unique printer in its commitment to utilizing the most advanced equipment and processes to provide the finest quality printing and services at economical rates. Emphasis on deadline, color accuracy, image clarity, and finishing techniques are hallmark to our past, present, and future success. Allstar is located in Melbourne, FL, off of Sarno Rd. If competent and skilled craftsmanship, and superior consultative service is important in your vendor partnerships, we are your first and foremost choice for your important collateral materials production.","Mon - Fri: 8:00 am - 5:00 pm","Fax: (321) 752-8755",,"check, visa, mastercard, amex, discover, all major credit cards",,,http://www.allstar-printing.com,,,,,,,,,
18756172,2720035,"2020-09-27 06:55:51","NB Signs & Design",http://www.nbsignsanddesign.com,sbarrett@nbsignsanddesign.com,"(830) 627-9120","1229 Industrial Dr Ste F","New Braunfels",TX,78130,"1229 Industrial Dr Ste F,New Braunfels,TX 78130","Printing Services, Advertising Agencies, Advertising Specialties, Advertising-Aerial, Advertising-Promotional Products, Banners, Flags & Pennants, Commercial Artists, Communications Services, Digital Printing & Imaging, Direct Mail Advertising, Directory & Guide Advertising, Document Imaging, Fine Art Artists, Graphic Designers, Legal Document Assistance, Marketing Consultants, Outdoor Advertising, Print Advertising, Screen Printing, Sign Lettering, Signs, Vehicle Wrap Advertising, Yard Signs",,,,29.71319,-98.09988,https://i1.ypcdn.com/blob/84c433e23ee9ba6e061602ce43419d549d425db1_100x100_crop.jpg?8ad0f92,,,"Mon - Fri: 9:00 am - 5:00 pm",,,,,,http://www.nbsignsanddesign.com,,,,,,,,,
18756248,2720042,"2020-09-27 06:55:52","Vec Graphics",,Vecgraphics2003@yahoo.com,"(904) 372-0430","2294 Mayport Rd Ste 5",Jacksonville,FL,32233,"2294 Mayport Rd Ste 5,Jacksonville,FL 32233","Graphic Designers, Banners, Flags & Pennants, Digital Printing & Imaging, Printing Services, Signs",,,,30.34941,-81.41411,,"We care about your image.","We are locally owned business providing a one stop shop for business graphics,signs banners and business cards. We provide a personal touch.","Mon - Fri: 9:30 am - 5:30 pm Sat - Sun Closed","Phone: (904) 699-2675",,"visa, master card, amex, discover, cash",,,,,,,,,,,,
18756667,2720099,"2020-09-27 06:55:52","Teambxtreme Printing & Graphics",http://teambxtreme.com,info@teambxtreme.com,"(203) 527-7558","481 Wolcott St",Waterbury,CT,06705,"481 Wolcott St,Waterbury,CT 06705","Business Cards, Banners, Flags & Pennants, Editorial & Publication Services, Graphic Designers, Posters, Printing Services, Tickets & Coupons-Printers & Suppliers",,,,41.55661,-73.0138,,,,"Mon: 10:00 am - 6:00 pm Tue: 9:00 am - 6:00 pm Wed: 10:00 am - 4:00 pm Thu - Fri: 10:00 am - 6:00 pm Sat: 12:00 pm - 4:00 pm Sun Closed",,,"visa, debit, check, paypal, cash, mastercard",,,http://teambxtreme.com,,,,,,,,,
18756774,2720114,"2020-09-27 06:55:52",Nkflyer,http://www.nkflyer.com,info@nkflyer.com,"(305) 570-3428","6141 W 22nd Ct",Hialeah,FL,33016,"6141 W 22nd Ct,Hialeah,FL 33016","Printing Services, Advertising Specialties, Advertising-Promotional Products, Banners, Flags & Pennants, Business Cards, Printers-Business Cards, Printers-Continuous & Individual Form, Signs, Trade Shows, Expositions & Fairs, Yard Signs",,,,25.87825,-80.32773,https://i1.ypcdn.com/blob/a717ce334b35615607dfc91940d9ad887d29acf9_100x100_crop.jpg?8ad0f92,,,,,,"all major credit cards, cash",,"Nkflyer Printing",http://www.nkflyer.com,,,,,,,,,
18756983,2720138,"2020-09-27 06:55:52","Image Zone Printing & Graphics",http://www.theimagezone.com,info@izprinting.com,"(951) 304-1330","41555 Cherry St Ste E",Murrieta,CA,92562,"41555 Cherry St Ste E,Murrieta,CA 92562","Printing Services, Banners, Flags & Pennants, Business Cards, Commercial Artists, Graphic Designers, Photography & Videography, Screen Printing, T-Shirts",,,,33.5264,-117.17369,https://i1.ypcdn.com/blob/3a8c95ed67cf7e368cf68b6931e563b1d6dc09f4_100x100_crop.jpg?8ad0f92,"The biggest small printer in town.","Image Zone provides High Quality Offset & Digital Printing, Display Graphics, Internet Services, Photography, Drum Scanning and Creative Graphic Design at a Competitive Price. Online Since 1997. 100% Guaranteed. You will be delighted with our printing and our expert service! IZ's guarantee is not full of excuses and exemptions, You can rest assured that your job is being expertly handled insuring the Highest-Quality Printing available.","Mon - Fri: 9:00 am - 5:00 pm","TollFree: (866) 503-1330",,"mastercard, all major credit cards, amex, discover, master card, paypal, visa, check",,,"http://www.theimagezone.com http://www.theimagezone.com/default.tpl?id1=150&id2=5&startat=1&--woSECTIONSdatarq=5&--SECTIONSword=ww&mmid=150 http://www.theimagezone.com/default.tpl?id1=193&startat=1&--woSECTIONSdatarq=193&--SECTIONSword=ww&mmid=192",,,,,,,,,
18757161,2720158,"2020-09-27 06:55:52","Showcase Signs",http://www.goshowcase.com,frank@goshowcase.com,"(904) 964-6463","207 S Walnut St",Starke,FL,32091,"207 S Walnut St,Starke,FL 32091","Signs, Advertising Specialties, Banners, Flags & Pennants, Engraving, Graphic Designers, Printing Services, Printing Services-Commercial",,,,29.94313,-82.11036,,,,"Mon - Fri: 8:00 am - 5:00 pm","Phone: (904) 964-7446 Primary Phone: (904) 964-7446",,"amex, master card, visa, discover, financing available",,"Showcase Signs & Advertising Showcase Printers",http://www.goshowcase.com,,,,,,,,,
18757359,2720189,"2020-09-27 06:55:52","Deck The Walls",http://www.deckthewalls.com,info@framingjoplin.com,"(417) 781-3151","1901 E 32nd St Ste 17",Joplin,MO,64804,"1901 E 32nd St Ste 17,Joplin,MO 64804","Picture Framing, Art Galleries, Dealers & Consultants, Banners, Flags & Pennants, Picture Frames, Pictures, Printing Services",,,,37.05516,-94.49476,,,"Deck the Walls is located in Joplin, MO and has been in business over 25 years. Art and picture framing is our passion. We take as much pride in our work as you do in your special treasures. We have a wide selection of frames and the experts will help you choose just the right design to compliment your art, your room your budget, and even your personality. We do more than just framing in our store. We also do large format printing, including Banners, Tradeshow graphics and much more.","Mon - Fri: 9:30 am - 5:30 pm",,,"all major credit cards, amex",,,"http://www.deckthewalls.com http://www.framingjoplin.com","Parking: Lot Wheelchair Accessible: Yes Specialties: Photos & Portraits, Photographs, Pictures",,,,,,,,
18757405,2720194,"2020-09-27 06:55:52","Cornhusker Sign & Manufacturing Corp.",http://www.cornhuskersign.com,info@cornhuskersign.com,"(402) 979-9737","21006 Cornhusker Rd",Gretna,NE,68028,"21006 Cornhusker Rd,Gretna,NE 68028","Signs, Banners, Flags & Pennants, Communications Services, Printing Services, Yard Signs",,,,41.16223,-96.24494,,,"Cornhusker Sign & Manufacturing Corp. is located in Gretna, NE. Since 1994, we've been designing, fabricating, installing, and maintaining signs for businesses like yours around Omaha Metro. We strive to provide only the highest quality products and services and take pride in helping your business succeed! Contact us today for more information!","Mon - Sun: Open 24 Hours",,,"discover, paypal, amex, master card, visa",,,"http://www.cornhuskersign.com https://www.oldneons.com/main.sc http://www.oldneons.com",,,,,,,,,
18758031,2720287,"2020-09-27 06:55:52","Copycat Printing",http://www.kearneycopycat.com,John@kearreycopycat.com,"(308) 237-4677","2100 Avenue A Kearney",Kearney,NE,68847,"2100 Avenue A Kearney,Kearney,NE 68847","Printing Services, Banners, Flags & Pennants, Copying & Duplicating Service, Decals, Graphic Designers, Greeting Cards, Invitations & Announcements, Labeling Equipment, Labels, Printers-Equipment & Supplies, Printing Consultants, Stationery Stores",,,A+,40.69684,-99.08067,,,"You Think It and We'll Print It! Copycat Printing is a printing company located in Kearney, Nebraska. Copycat Printing provides value-added printing services to our customers by exceeding their expectations and gaining their trust through exceptional performance by every member of the team throughout the printing process. Our pledge is to provide strategic counsel, creative solutions and timely, responsible services. Our design staff utilizes a wide array of software from Adobe, Macromedia, Quark and Corel in PC Formats. We have the entire Adobe Create Suite Collection including - Photoshop CS2, Illustrator CS2, Acrobat Professional 8, and InDesign CS2. We also have Macromedia Freehand, Corel Draw 12, and Quark Xpress 6.1. For the PC users at home, we possess the Microsoft Office Suite. This package contains Publisher, Word, PowerPoint, and Excel. If you are sending files for a Mac Format - we can use those too! Just save your file as a PDF (press quality) and convert all of the font to curves Just give us a call today!","Mon - Fri: 8:00 am - 5:30 pm Sat: 9:00 am - 1:00 pm Sun Closed",,,"amex, discover, master card, visa, cash, check",,,http://www.kearneycopycat.com,,,,,,,,,
18758510,2720346,"2020-09-27 06:55:52",FASTSIGNS,http://www.fastsigns.com,518@FASTSIGNS.com,"(518) 456-7446","1593 Central Ave",Albany,NY,12205,"1593 Central Ave,Albany,NY 12205","Signs, Advertising Specialties, Banners, Flags & Pennants, Printing Services",,,A+,42.71723,-73.83183,,"Hi-Tech. Low Stress? Our innovative team & state-of-the-art technology make sign buying simple, From Concept to Completion.В®","FASTSIGNSВ® of Colonie, NY is committed to providing effective sign and graphic solutions that meet your timelines and budgets. We'll help you promote your products, events and services and help your business or organization get noticed. From a simple banner to a complete sign and graphic makeover, we can do it all.","Mon - Fri: 8:30 am - 5:30 pm","Phone: (518) 213-3426 Fax: (518) 869-1808 TollFree: (866) 957-0050",,"amex, discover, master card, visa, cash, check, diners club",,"FASTSIGNS of Colonie Fastsigns International Inc. Fastsigns Graphic Solutions Tech Valley Signs Inc",http://www.fastsigns.com,"Parking: Lot Specialties: Bridal, Weddings, Social Occasions, Murals, Computer Graphics, Graphic Design, Arrows, Automobiles, Concrete, Metal, Fiberglass, Buses, Consultations, Paper, Special Occasions, Cycles, Marine, Fleets, Graphic Artists, Social Events, Painting, Recreational Vehicles, Bodas, Bikes, Glass, Hardwood, Parties, Cars, Cardboard, Special Events, Rvs, Airplanes, Celebrations, Motorcycles, Fiestas, Autos",,,,,,,,