business_x_category.id,business.id,business.ts,business.business_name,business.home_page,business.email_address,business.phone,business.street,business.city,business.state,business.zip_code,business.full_address,business.category,business.rating,business.number_of_reviews,business.bbb_rating_or_license,business.latitude,business.longitude,business.cover_image,business.slogan,business.general_info,business.regular_hours,business.extra_phones,business.services_products,business.payment,business.price_range,business.aka,business.other_links,business.other_information,business.review_1_name,business.review_1_date,business.review_1_rating,business.review_1_text,business.review_2_name,business.review_2_date,business.review_2_rating,business.review_2_text
247550,81463,"2020-09-27 02:37:35","The Shops at Montebello",http://www.shopsatmontebello.com/home.asp,cjurado@simon.com,"(323) 722-8454","2134 Montebello Town Ctr",Montebello,CA,90640,"2134 Montebello Town Ctr,Montebello,CA 90640","Shopping Centers & Malls, Bridal Shops, Children & Infants Clothing, Department Stores, Gift Shops, Gourmet Shops, Hat Shops, Hobby & Model Shops, Men's Clothing, Restaurants, Women's Clothing, Women's Fashion Accessories",,,,34.035004,-118.087105,,,,"Mon - Sat: 10:00 am - 9:00 pm Sun: 11:00 am - 7:00 pm",,,"discover, amex, check",,"Montebello Mall Montebello Town Center",http://www.shopsatmontebello.com/home.asp,"Parking: Lot, Private Bike Parking: Yes Wheelchair Accessible: Yes Price Range : Average Pets Allowed: No",,,,,,,,
248780,81863,"2020-09-27 02:37:36","Four Green Fields Gifts",http://www.fourgreenfieldsgallery.com,yp@fourgreenfieldsgifts.com,"(843) 261-7680","117 Central Ave Unit A",Summerville,SC,29483,"117 Central Ave Unit A,Summerville,SC 29483","Gift Shops, Bridal Registries, Gift Baskets, Gourmet Shops",5,"1 Review",,33.019,-80.177,https://i2.ypcdn.com/blob/28470fa035f7032862f1e21bc44b3ec723449ac3_100x100_crop.jpg?f9d23e1,,"Voted Summerville's BEST GIFT SHOP - 2010, BEST GIFT BASKET - 2011, RUNNER-UP GIFT SHOP - 2011 by the readers of The Summerville Journal-Scene. Four Green Fields carries 100% American handcrafts by more than 80 artists, with a focus on local and regional work, including more than a dozen Summerville artists.","Mon - Sat: 10:00 am - 5:00 pm Sun: 11:00 am - 3:00 pm Holiday Hours 2020/01/01 Closed Holiday Hours 2020/05/25 11:00 am - 3:00 pm Holiday Hours 2020/09/07 11:00 am - 3:00 pm Holiday Hours 2020/11/26 Closed Holiday Hours 2019/06/16 Closed Holiday Hours 2019/12/31 10:00 am - 2:00 pm Holiday Hours 2020/12/25 Closed Holiday Hours 2020/05/10 Closed",,,"amex, check, discover, travelers checks, visa, all major credit cards, mastercard, android pay, apple pay, samsung pay",,,http://www.fourgreenfieldsgallery.com,"Parking: Garage, Free Wheelchair Accessible: Yes",fourgreenfields,03/15/2012,five,"Voted Summerville's BEST GIFT SHOP - 2010, BEST GIFT BASKET - 2011, RUNNER-UP GIFT SHOP - 2011 by the readers of The Summerville Journal-Scene. Four Green Fields carries 100% American handcrafts by more than 80 artists, with a focus on local and regional work, including more than a dozen Summerville artists. Friendly and full-service. You can expect to be able to customize almost anything, especially the pottery made in the on-site studio. Also available: free gift wrap, shipping, bridal/gift registry, and ready-to-go and custom gift baskets.",,,,
250847,82515,"2020-09-27 02:37:40","NAPA KETTLE INC",http://www.facebook.com/napakettle,,"(916) 764-3663","1215 K St Ste 1700",Sacramento,CA,95814,"1215 K St Ste 1700,Sacramento,CA 95814","Mail-Order Fulfillment Service, Art Goods, Art Supplies, Arts & Crafts Supplies, Beer Dispensing & Cooling Equipment, Beer Homebrewing Equipment & Supplies, Beverage Coolers, Bridal Registries, Bridal Shops, Cake Decorating Equipment & Supplies, Caterers Equipment & Supplies, Children's Party Planning & Entertainment, China, Crystal & Glassware, Chinaware & Glassware-Renting, Coffee & Tea, Coffee Brewing Devices, Cookies & Crackers, Cookware & Utensils, Decoration Supply, Decorative Ceramic Products, Etched Products-Metal, Glass, Etc, Food & Beverage Consultants, Food Products, Games & Supplies, Gift Baskets, Gift Shops, Gift Wrapping Materials, Glassware, Glassware Decorators, Gourmet Shops, Greeting Cards, Holiday Lights & Decorations, Interior Decorators & Designers Supplies, Kitchen Accessories, Meeting & Event Planning Services, News Service, Online & Mail Order Shopping, Paper & Plastic Cups, Containers & Utensils, Party & Event Planners, Party Favors, Supplies & Services, Party Planning, Patio & Outdoor Furniture, Picnic Grounds, Silverware, Straws-Drinking, Tea Rooms, Wedding Supplies & Services, Wine Bars, Wine Brokers, Wineries, Winery Equipment & Supplies",5,"1 Review",,38.57847,-121.48988,https://i2.ypcdn.com/blob/89ec1fd8f1b3b873437b8ed911da3fb54ef6cd0a_100x100_crop.jpg?e66d351,"Escape Ordinary! Make Your Mark in Modern Rustic Elegance by Napa Kettle","Hello! How are you dining?&#10.Escape Ordinary! Make Your Mark with Modern, Rustic Elegance by Napa Kettle&#10.&#10.Like us on http://facebook.com/napakettle for you chance to win any number of ongoing goodies&#10.&#10.Keep your guests talking long after your soiree is over. Napa Kettle is a family of local artisan &amp. specialty shops. Partnering with the best future-driven artists at the very best pricing, we take the stress out of entertaining and gift giving all year round. We pride ourselves on Exquisite Service and carefully curating unique quality For Your Home life and Office environment! We carry cutting-edge Housewares, Kitchenware&.s, Coffee &amp. Tea products, Premium Wine Accessories, Craft Beer Products, Gourmet,Picnic Basket, Good Reads, Fun for the whole family. We have abundant free guides for entertaining and travel. &#10.&#10.By customizing our products with names or business logos give you the pleasure of becoming the artist and taking your gifts to another level.&#10.&#10.Napa Kettle Sells its products through select catalogs, events and retail throughout the United States. Internet and direct operations are comprised of websites and mail order catalogs We also have business to business sales and sales to corporate customers and the hospitality industry designed to feature displays of abundant premium fair trade products.&#10.&#10.Are you a Downton Abbey Fan? Do you consider yoursel a Holiday Gourmet? Shop our Exclusive Collections Now.Collections&#10.&#10.We are a Military Family, Minority and Women Owned Business","Sat - Sun: 11:00 am - 5:00 pm Appointment Only Hours Mon - Fri 11:00 am - 5:00 pm",,,"all major credit cards, cash, paypal, visa, financing available",,,"http://www.facebook.com/napakettle http://www.stumbleupon.com/stumbler/napakettle",,"Dr C.",11/16/2015,five,"I wont go into too much detail. But I will be a life long fan of Napa Kettle. I was ordering a few quick items for dinner party gifts... glasses that stay cool for hours, and the put together a great Downton Abbey collection. My collegues are still talking about the crazy tea diffusers. Then I learned more about etiquette and the wine country than I'd ever thought I'd be interested In. Good luck with your biz! I'll see if some of the other guests will leave feedback, but you know people :-( Refreshing to be able to leave good feedback.",,,,
252275,82979,"2020-09-27 02:37:40","Pacific Treasures & Gourmet",http://www.pacifictreasuresvisalia.com,pacifictreasures@sbcglobal.net,"(559) 733-0213","114 East Main",Visalia,CA,93291,"114 East Main,Visalia,CA 93291","Gift Baskets, Bridal Registries, Candles, Children & Infants Clothing, Children's Furniture, Cookware & Utensils, Furniture Stores, Garden Ornaments, Gift Shops, Gourmet Shops, Grocery Stores, Home Decor, Home Improvements, Home Repair & Maintenance, Interior Designers & Decorators, Kitchen Accessories, Patio Equipment & Supplies, Wedding Supplies & Services",5,"1 Review",A+,36.33042,-119.2918,https://i2.ypcdn.com/blob/b0ed24372829f8d408c172e4ab69b76a3d22ee79_100x100_crop.jpg?e66d351,,"Kitchen - Patio - Bath - Bath & Body - Candles - Baby Gifts - Pet Gifts - Great Gifts for All!","Mon - Fri: 10:00 am - 6:00 pm Sat: 10:00 am - 5:00 pm",,,"all major credit cards, check, debit",,"Pacific Treasures","http://www.pacifictreasuresvisalia.com https://www.instagram.com/pacifictreasures","Parking: Garage, Street Wheelchair Accessible: Yes Specialties: All Occasions, Every Occasion","Janet M.",10/16/2015,five,"My ""go to"" store for gifts of all kinds, gourmet kitchen gadgets, candles galore and beautifully scented lotions and soaps. The ladies who work there are always helpful and the owner is knowledgeable and friendly.",,,,
253844,83470,"2020-09-27 02:37:51","All Seasons Floral & Tuxedos",http://allseasonswv.com,allseasonswv@aol.com,"(304) 929-7673","317 N Eisenhower Dr",Beckley,WV,25801,"317 N Eisenhower Dr,Beckley,WV 25801","Tuxedos, Artificial Flowers, Plants & Trees, Balloons-Retail & Delivery, Bridal Shops, Florists, Flowers, Plants & Trees-Silk, Dried, Etc.-Retail, Formal Wear Rental & Sales, Gift Baskets, Gourmet Shops, Wedding Supplies & Services, Women's Clothing",5,"3 Reviews",,37.78791,-81.17231,https://i2.ypcdn.com/blob/7f1e238c515f37c0af6b56932204a900f8f8c35a_100x100_crop.jpg?f9d23e1,"The Fusion of Fresh Flowers and Expression...All Season's Floral.","A family owned and operated small business offering artistic flower design in fresh and faux.","Mon - Fri: 9:00 am - 5:00 pm Sat: 9:00 am - 1:00 pm",,,"amex, discover, master card, visa",,,http://allseasonswv.com,"Parking: On Site Wheelchair Accessible: Yes","Diedra C.",10/08/2017,five,"Perfect arrangements and great price. Would recommend them for anything. Great people that go above and beyond.","Angela C.",10/01/2015,five,"I didn't catch the gentleman's man but I walked in and told him I was in a hurry and I was only looking to spend 60.00 on a funeral arrangement he put one together for me in 10 mins and only charged me $40.00 and it was beautiful will definitely be using him again in the future. Thank you!"
257055,84478,"2020-09-27 02:38:02","Bennett Home Supply",http://www.manta.com/c/mm76jph/bennett-home-supply,bennetthomesuppl@bellsouth.net,"(256) 734-2961","410 2nd Ave SW",Cullman,AL,35055,"410 2nd Ave SW,Cullman,AL 35055","Gift Shops, Antiques, Bridal Registries, Gourmet Shops, Grocery Stores, Home Improvements, Home Repair & Maintenance, Interior Designers & Decorators, Lawn Mowers, Toy Stores, Wedding Supplies & Services",,,,34.17356,-86.84249,,"Something a Bit Different in Cullman",,"Mon - Fri: 10:00 am - 5:00 pm Sat: 10:00 am - 1:00 pm Sun Closed","Fax: (256) 734-0844",,"all major credit cards, amex, company card, diners club, discover, jcb, mastercard, visa",,,http://www.manta.com/c/mm76jph/bennett-home-supply,"Specialties: Interior, Business Functions, Houses / Homes, Batteries, Corporate Functions, Furniture, Production, Appliances, Kitchens",,,,,,,,
257171,84509,"2020-09-27 02:38:02","From Spain",http://www.fromspain.com,sales@fromspain.com,"(203) 504-8242","61 Crescent St",Stamford,CT,06906,"61 Crescent St,Stamford,CT 06906","Bridal Registries, Decorative Ceramic Products, Gift Baskets, Gift Shops, Gourmet Shops",,,,41.07019,-73.51679,,,,"Mon - Sat: 11:00 am - 5:00 pm Sun: 12:00 pm - 5:00 pm",,,"all major credit cards",,,"Fine Products from Spain. ceramics, gourmet food, paella supplies, gifts","Parking: Lot",,,,,,,,
257291,84548,"2020-09-27 02:38:02","Kitchen Essentials",http://kitchenessentials.net,,"(479) 280-1933","407 N Arkansas Ave Ste 10",Russellville,AR,72801,"407 N Arkansas Ave Ste 10,Russellville,AR 72801","Cookware & Utensils, Bridal Registries, Coffee & Tea, Cutlery, Gift Shops, Gourmet Shops, Kitchen Accessories",5,"1 Review",,35.28222,-93.13396,,,,"Mon - Fri: 10:00 am - 6:00 pm Sat: 10:00 am - 5:00 pm",,,"cash only",,"Kitchen Essentials, Inc.",http://kitchenessentials.net,,"Jim H.",07/14/2016,five,"Kitchen Essentials is truly your one stop shop! They have all the kitchen needs covered! Any accessory you need, they have it! And if they don't have it in stock, they go above and beyond to get it for you! There isn't another kitchen store that compares!! We love going to see what they have in weekly, as well as their special sales and promotions! They have the BEST A+++++++ service!! And they always serve you with a smile and coffee!! Shop Kitchen Essentials you will not regret it!!!",,,,
267527,87830,"2020-09-27 02:38:25",Lawren's,http://www.lawrensgifts.com,info@lawrensgifts.com,"(256) 384-0939","809 Madison St SE",Huntsville,AL,35801,"809 Madison St SE,Huntsville,AL 35801","Bridal Registries, Candles, Candy & Confectionery, China, Crystal & Glassware, Chocolate & Cocoa, Gift Shops, Gourmet Shops, Grocery Stores, Housewares, Invitations & Announcements, Jewelers, Stationery Stores, Wedding Supplies & Services",,,A+,34.72215,-86.57968,,Elegance-Distinction-Quality,"Lawrens is a specialty retailer presenting over 600 current patterns of china from around the world В– casual, fine crystal, silver, table linens, gourmet cookware, serving accessories, party papers, candles, candies, and confections. Keeping the future generation of customers in mind, a collection of infant wear, toys, and baby gifts is also part of the product mix. The most recent enhancement has been the opening of a Villa VIETRI В– offering the largest in-stock collection of exciting and trendsetting Italian dinnerware and dining accessories in the state. Lawrensgifts.com is our online presence from Lawren's located in Huntsville, Alabama. We hope you enjoy shopping in our online store and that you find an array of perfect gifts for all occasions. We are proud to be an Authorized Dealer for several collections including Veitri, Herend, Spode, Mottahedeh, Villeroy and Boch, and many others. Our business philosophy has always been to provide a high level of customer service which allows us to build trust and integrity with our customers. This philosophy has brought back repeat customers year after year and driven our success as a leading retailer of fine china and gifts. We thank you for the business!",,,,"check, debit, discover, visa, mastercard, amex",,,http://www.lawrensgifts.com,"Specialties: Porcelain & China, Bridal, Elegant Weddings, Chinese",,,,,,,,
269177,88372,"2020-09-27 02:38:32","Pat's Florist And Gourmet Baskets",http://www.patsfloristandgoumkt.com,patsflorist@yahoo.com,"(205) 345-5093","1010 Queen City Ave",Tuscaloosa,AL,35401,"1010 Queen City Ave,Tuscaloosa,AL 35401","Bridal Shops, Artificial Flowers, Plants & Trees, Balloons-Retail & Delivery, Florists, Flowers, Plants & Trees-Silk, Dried, Etc.-Retail, Formal Wear Rental & Sales, Fruit Baskets, Gift Baskets, Gift Shops, Gourmet Shops, Grocers-Ethnic Foods, Grocery Stores, Home Decor, Party Favors, Supplies & Services, Party Planning, Plants, Plants-Interior Design & Maintenance, Wedding Planning & Consultants, Wedding Supplies & Services",,,,33.20614,-87.56069,https://i2.ypcdn.com/blob/fb4dcaedc68a4265a03941916a310f1ba7dcead0_100x100_crop.jpg?e66d351,"Flowers for All Occasions","Flowes For All Occasions!","Mon - Fri: 8:00 am - 5:00 pm Sat - Sun Closed","TollFree: (800) 654-7492",,"visa, amex, discover, check, debit, mastercard",,,"http://www.patsfloristandgoumkt.com http://ttownflowers.com http://floristoftuscaloosa.com http://patspetals.com http://thefloristoftuscaloosa.com","Parking: Lot, Private Wheelchair Accessible: Yes Price Range : Average",,,,,,,,
271589,89169,"2020-09-27 02:38:35","Muffin Tin The",,themuffintin@yahoo.com,"(318) 323-3753","1904 Glenmar Ave",Monroe,LA,71201,"1904 Glenmar Ave,Monroe,LA 71201","Gift Baskets, Bridal Registries, Gift Shops, Gourmet Shops, Housewares, Wedding Supplies & Services",,,,32.52459,-92.1091,,,"see sales rep for info",,,,"visa, mastercard",,,,"Parking: Lot",,,,,,,,
276273,90704,"2020-09-27 02:38:40","Moore's Morsels",,mooremorsel@yahoo.com,"(313) 320-7090",,"Grosse Pointe Farms",MI,48236,"Grosse Pointe Farms,MI 48236","Bridal Shops, Bakeries, Cookies & Crackers, Gourmet Shops, Wedding Supplies & Services",,,,,,,"Homemade Goodness",,"Mon - Sun: Open 24 Hours",,,,,,,,,,,,,,,
355715,116880,"2020-09-27 02:41:29","Your New Best Friend Weddings Plus",,ynbf2011@gmail.com,"(770) 334-7491","668 Nelby Ct","Stone Mountain",GA,30083,"668 Nelby Ct,Stone Mountain,GA 30083","Gift Baskets, Gift Shops, Gourmet Shops, Paper Products, Wedding Supplies & Services",5,"1 Review",,33.77703,-84.2162,,"When In Need, When In Doubt, Call On Us, That's What We're About!","Selecting the perfect gift for any occasion can be a bit of a challenge, espcially when you want to have your gift stand out among the rest. In these day and ages, people may work two jobs, and attend college while supporting and taking care of a family so the last thing on their mind is gift giving.That's where we come in!Your New Best Friend is the ultimate in giving only the best in gift baskets, we strive for perfection and to make you look good!Your New Best Friend (Gift Baskets & Bags)В© (YNBF),is so much more then the typical gift basket company, not only do we design gift baskets but we add our personal touches that you will not find anywhere but here, and with every basket itВ’s not just the products that mean something to the recipient but also the hidden message behind the basket. Each and every basket is articulately made personal with love and thought. After every basket is created and designed, a blessing is said over the basket so that when it arrives at the recipients home, they have the love and bleesings from Your New Best Friend (Gift Baskets & Bags). Your New Best Friend (Gift Baskets & Bags) is committed to helping you create your perfect gift. We listen to your needs, desires, and brainstorm with you to make your gift even more special.I am here to help bring your ideas to life, not to tell you how your gift should be.I have decades of experience in the gift giving industry, acting as General Manager and Designing Coordinator at a variety of popular gifting event. We bring increased attention to detail and innovative creativity to our products with clients as well as vendors. We have experience working with over 300 gift baskets and know that every basket is unique just like it's recipient. I will seek to reflect your personality, lifestyle, family traditions, and spiritual beliefs into your special gift basket. Gift baskets for any occasion at all. We oversee every detail of the process from start to finish, including:Gift basket types for certain occasionsYour budget and your suggestionsWe are on call 24/7Fees, Shipping & Handling & tax are already included in all prices!Defining color scheme, theme, and favoritesWork on a timely mannerSpecialty packagingDay of event On-site delivery:If you need to have a gift delivered in person weather it is to their home, job or place of event, We can help you:Personally delivered to the recipientIn the Atlanta or Dekalb County, GA areaDelivery fees at a discountWe can do last minutes noticeSome gift baskets are as listed:Paper Basket- all paper products including, paper towel, printing paper, toilet paper, notebook paper & more!!A Cry In The Night- to help sooth the pain of a domestic violence victim. Suicide Prevention Kit- stocked with items to let the suicide atemptee know they are not alone.Pride- LGBT items, from bumper stickers to books & more!!Linen Basket- all sorts of linen item from sheet set to towels & table cloths & more!!","Mon - Sun: 12:00 am - 11:59 pm",,,"all major credit cards, amex, carte blanche, check, company card, debit, diners club, discover, jcb, mastercard, paypal, visa",,"YNBF (Gift Baskets & Bags)",,,teresamikulskis69,01/21/2013,five,"Call Your New Best Friend for more great gifts @ 4042640004",,,,
869016,292533,"2020-09-27 02:58:57","Nature's Market",http://www.naturesmarketkent.com,info@naturesmarketkent.com,"(253) 854-5395","26011 104th Ave SE",Kent,WA,98030,"26011 104th Ave SE,Kent,WA 98030","Nutritionists, Beverages, Food Products, Gourmet Shops, Grocers-Ethnic Foods, Grocery Stores, Health & Wellness Products, Pet Services, Pet Stores, Supermarkets & Super Stores, Vitamins & Food Supplements, Weight Control Services",4,"2 Reviews",A+,47.36863,-122.20277,,"Live, Learn, Be Healthy!","Nature's Market is a natural food and supplement store that has stood on Kent, WA's East Hill for 38 years. We are home to over 6,000 square feet of natural and organic groceries, vitamins, natural remedies, and body care products. Nature's Market features: Organic produce Gluten-free products Vitamins and supplements Fresh juices and smoothies Prepared sandwiches, salads, and soups Dairy Frozen food Beer and wine Specialty pet food Nature's Market offers incomparable customer service. Our experienced staff is always happy to answer questions and help you find what you need. If you need something we don't carry, we are also happy to place special orders! Call Nature's Market now to learn more or come and explore. You'll be glad you did!","Mon - Fri: 9:00 am - 8:00 pm Sat: 9:00 am - 7:00 pm Sun: 10:00 am - 6:00 pm",,,"cash, check, master card, visa",,,"http://www.naturesmarketkent.com http://m.naturesmarketkent.com","Parking: Lot, Private Wi-Fi: No Bike Parking: No Wheelchair Accessible: Yes Price Range : Average","Tammy S.",04/08/2014,four,"I often go to Nature's Market for hard to find items, they have the biggest gluten free selection in the state, and even have lots of other allergen free foods, like egg free soy free mayo. The only reason they do not get a full 5 stars is the high prices. Which is to be expected somewhat in a health food store. they do have coupons you can sign up to receive at least! Great store though, I do recommend it!",mommysaves,01/17/2008,four,"I've started shopping at Nature's Market when I was told I could be allergic to wheat, corn, and soy. Walking around this store, I was able to find many other options that allowed me to still eat well. The prices are reasonable for ""health food"", though they are a bit more expensive than a regular grocery store. The staff are very helpful too."
880136,295059,"2020-09-27 02:59:12","Isabella Gourmet Foods",,info@isabellagourmetfoods.com,"(805) 585-5257","5 E Figueroa St","Santa Barbara",CA,93101,"5 E Figueroa St,Santa Barbara,CA 93101","Gift Baskets, Gift Shops, Gourmet Shops, Grocers-Specialty Foods, Nutritionists",,,,34.42249,-119.70317,,,,"Mon Closed Tue - Fri: 9:00 am - 6:00 pm Sat: 10:00 am - 6:00 pm Sun: 11:00 am - 5:00 pm",,,"check, cash, all major credit cards",,,,"Price Range : Average",,,,,,,,
890118,297389,"2020-09-27 02:59:24","Baby Foodie",http://www.mybabyfoodie.com,csmith@mybabyfoodie.com,"(469) 877-2550","PO Box 2932","Cedar Hill",TX,75106,"PO Box 2932,Cedar Hill,TX 75106","Gourmet Shops, Frozen Foods, Nutritionists",,,,32.588333,-96.95583,,"Begin cultivating a foodie with our food for babies... ...homemade, custom meals prepared with seasonal, local and/or organic ingredients, planned by a Registered Dietitian. No preservatives, additives, fillers, artificial flavors, colors, added sugar or salt.","Baby Foodie was created by our founder who as a mom and Registered Dietitian wanted a healthier alternative to traditional baby food. As our founder searched the baby food aisle in efforts to feed her own baby, she found traditional baby food to be over processed, provided little variety and did not give any clear guidance on how to progress through their stages. Consequently, Baby Foodie was born in the heart of our founder. Now, recognizing the need of many parents and wanting only the best for every baby, our founder has decided to make these wholesome recipes available to every family.",,,,"visa, master card, amex, discover",,,http://www.mybabyfoodie.com,,,,,,,,,