business_x_category.id,business.id,business.ts,business.business_name,business.home_page,business.email_address,business.phone,business.street,business.city,business.state,business.zip_code,business.full_address,business.category,business.rating,business.number_of_reviews,business.bbb_rating_or_license,business.latitude,business.longitude,business.cover_image,business.slogan,business.general_info,business.regular_hours,business.extra_phones,business.services_products,business.payment,business.price_range,business.aka,business.other_links,business.other_information,business.review_1_name,business.review_1_date,business.review_1_rating,business.review_1_text,business.review_2_name,business.review_2_date,business.review_2_rating,business.review_2_text
664717,231733,"2020-09-27 02:52:37","Brisk Errands & Concierge LLC",http://briskerrands.wix.com/home,briskerrands@gmail.com,"(410) 497-7298",,Nottingham,MD,21236,"Nottingham,MD 21236","Laundry Supplies, Courier & Delivery Service, Grocery Stores, House Cleaning, Senior Citizens Services & Organizations",,,,,,,"Relax. We've got your back!",,"Mon - Fri: 10:00 am - 10:00 pm Sat - Sun Closed",,,"visa, master card, amex, discover, debit, check, paypal",,,http://briskerrands.wix.com/home,,,,,,,,,
665646,231982,"2020-09-27 02:52:37","Grocery To Go",,,"(580) 540-7777",,Enid,OK,73701,"Enid,OK 73701","Assisted Living & Elder Care Services, Courier & Delivery Service, Delivery Service, Food Delivery Service, Grocery Stores",,,,,,,"Delivering Groceries To Your Doorstep!",,"Mon - Sat: 8:00 am - 6:00 pm Sun: 12:00 pm - 6:00 pm",,,check,,,,,,,,,,,,
675072,234436,"2020-09-27 02:52:54","Galveston Island Grocery Delivery",,,"(409) 392-7721","6023 Avenue S 1/2",Galveston,TX,77551,"6023 Avenue S 1/2,Galveston,TX 77551","Food Delivery Service, Courier & Delivery Service, Grocery Stores, Online & Mail Order Shopping, Personal Shopping Service",,,,29.27404,-94.82968,,,,"Mon - Sun: 10:00 am - 4:00 pm",,,"visa, master card, amex, discover, debit, paypal, cash",,,,,,,,,,,,
675388,234508,"2020-09-27 02:52:54","Central Ohio Delivery",,,"(740) 746-3357",,"Black Lick",OH,43004,"Black Lick,OH 43004","Food Delivery Service, Courier & Delivery Service, Grocery Stores, Personal Shopping Service, Transportation Services",5,"1 Review",,,,,"We Deliver Convenience. Personal home shopping delivery service for the residents of Central Ohio. We will shop for and deliver your groceries, pick-up and deliver your prescriptions, and more. Call us today and put us to work for you.","Personal home shopping delivery service for the residents of Central Ohio. We will shop for and deliver your groceries, pick-up and deliver your prescriptions, and more. We mainly shop for and deliver groceries for customers. However, we will deliver anything you need delivered. If you buy a piece of furniture and don't have the time or the appropriate vehicle to move it yourself, call us. If you need to get your dog to the vet, potting soil to your garden, or a surprise gift to a loved one, we can help you out. We will make deliveries to residences, offices, hospitals, college campuses, retirement homes, garages and businesses. Does your group or organization fall outside of the ones we have listed? Contact us so we can try to add you to the list.","Mon - Sun: 7:00 am - 7:00 pm",,,"debit, check, paypal, cash, all major credit cards",,,,,"Niki D.",05/29/2014,five,"I used them for grocery delivery. It was fast and the driver was very pleasant. I will use them again.",,,,
675637,234578,"2020-09-27 02:52:54","Exclusive Delivery Now",,,"(601) 298-8224","729 Midland St",Pittsburgh,PA,15221,"729 Midland St,Pittsburgh,PA 15221","Delivery Service, Courier & Delivery Service, Food Delivery Service, Grocery Stores, Restaurant Delivery Service",,,,40.43904,-79.87455,,"Do More of What Makes You Happy!","Do more of what makes you happy and less time of what doesn't! For many people that will be buying groceries. From gathering the kids, hoping they behave to standing in line and carrying groceries! With your help, we'll help you. Please visit the website and vote for the stores you want us to partner with and service. The more votes the better as stores will be more willing to work with us. Thank you, Exclusive Delivery Now can be in Pittsburgh if you VOTE!",,,,amex,,,,,,,,,,,,
678256,235294,"2020-09-27 02:52:59","our groceries on delivery",,,"(513) 526-1040","9713 Crestbrook Dr",cincinnati,OH,45231,"9713 Crestbrook Dr,cincinnati,OH 45231","Handyman Services, Courier & Delivery Service, Grocery Stores, Nurses-Home Services, Senior Citizens Services & Organizations",,,,39.24323,-84.52087,,,,,,,,,,,,,,,,,,,
678834,235461,"2020-09-27 02:52:59","Malibu Delivery Service",http://malibudeliveryservice.com,,"(310) 425-2331","21237 Pacific Coast Hwy",Malibu,CA,90265,"21237 Pacific Coast Hwy,Malibu,CA 90265","Food Delivery Service, Courier & Delivery Service, Grocers-Specialty Foods, Grocery Stores, Taxis",,,,34.03721,-118.63768,,,,"Mon - Sun: 10:00 am - 9:00 pm",,,,,,http://malibudeliveryservice.com,,,,,,,,,
678928,235482,"2020-09-27 02:52:59","Rochelle's Grocery Shopping Service",http://rochellesgroceryshopping.com,,"(470) 344-4726","15 Wynfield Keep",Covington,GA,30016,"15 Wynfield Keep,Covington,GA 30016","Delivery Service, Courier & Delivery Service, Food Delivery Service, Grocery Stores, Restaurant Delivery Service",,,,33.5463,-83.9451,,,,"Mon - Fri: 6:00 am - 2:00 pm",,,"check, debit",,,http://rochellesgroceryshopping.com,,,,,,,,,
680118,235825,"2020-09-27 02:52:59","DeliverNow, LLC",,delivernowllc@gmail.com,"(860) 216-6006","130 Saint James St","West Hartford",CT,06119,"130 Saint James St,West Hartford,CT 06119","Convenience Stores, Courier & Delivery Service, Food Delivery Service, Grocery Stores, Transportation Services",,,,41.75179,-72.7278,https://i3.ypcdn.com/blob/f18333711b9670dc0581f0a0cf911e3bdb9bdaf3_100x100_crop.jpg?d9a04b5,"We are the ULTIMATE CONVENIENCE!","DeliverNow, LLC is the ONLY On Demand Delivery service of our kind in the Area.","Mon - Sun: 9:00 am - 9:00 pm","Call NOW and experience the Ultimate Convenience!: (860) 216-6006",,"visa, master card, debit, cash",,,,,,,,,,,,
681777,236275,"2020-09-27 02:53:05","At Your Convenience Delivery",,,"(404) 578-6355","2304 Hartley Ct",Statham,GA,30666,"2304 Hartley Ct,Statham,GA 30666","Convenience Stores, Courier & Delivery Service, Delivery Service, Food Delivery Service, Grocery Stores",,,,33.98395,-83.59661,,"At Your Convenience",,"Mon - Sat: 9:00 am - 5:00 pm",,,"visa, mastercard",,,,,,,,,,,,
681838,236290,"2020-09-27 02:53:05","Breezy's Delivery Services",,breezysdelivery@gmail.com,"(707) 533-0249",,,,,,"Delivery Service, Courier & Delivery Service, Dry Cleaners & Laundries, Florists, Food Delivery Service, Grocery Stores, Transportation Services",,,,,,,,,,,,"debit, master card, visa",,,,,,,,,,,,
683257,236669,"2020-09-27 02:53:05","Store 2 My Door",http://store2ourdoor.com,store2mydoor@gmail.com,"(423) 464-6552",,Cleveland,TN,37323,"Cleveland,TN 37323","Food Delivery Service, Concierge Services, Courier & Delivery Service, Delivery Service, Grocery Stores, Personal Shopping Service",,,,,,https://i3.ypcdn.com/blob/3938e73aba377a450f0dbe9aadd2203e45005920_100x100_crop.jpg?d9a04b5,,"You now have the convenience of our GROCERY DELIVERY SERVICE at your fingertips. To assist busy people, moms, single dads, elderly, disabled, homebound, Disabled Veterans, or for any reason at all. *** And it's AFFORDABLE ***",,,,,,,http://store2ourdoor.com,,,,,,,,,
688955,238161,"2020-09-27 02:53:15","Home Grocery Delivery Service",,rgrissom76@yahoo.com,"(252) 908-3417",,"Elm City",NC,27822,"Elm City,NC 27822","Delivery Service, Courier & Delivery Service, Food Delivery Service, Grocery Stores, Personal Shopping Service",,,,,,,"Your Request is Truly our Priority! Groceries From The Store To Your Door!","Market Delivery Services provides a personal home grocery delivery service with exceptional quality. Delivering your grocery order straight to your door not only lends you a helping hand, but it also saves you valuable time. Our home grocery delivery service offers solutions to the elderly or disabled that may not have a means of transportation. Public transportation can be expensive and a hassle. That's where our home grocery delivery service comes into play! Your Request is Truly our Priority. Our unparalleled service, competitive prices, and overall value are why our loyal customers wont go anywhere else.",,,,,,,,,,,,,,,,
689521,238320,"2020-09-27 02:53:15","Hickory Express",,,"(513) 204-5576","9378 S Mason Montgomery Rd # 443",Mason,OH,45040,"9378 S Mason Montgomery Rd # 443,Mason,OH 45040","Delivery Service, Courier & Delivery Service, Food Delivery Service, Grocery Stores",,,,39.30167,-84.31459,,"We do your grocery chores. You enjoy your life.","We offer online grocery shopping + home delivery (including Kroger Clicklist orders). Grocery shopping done in 20 min! Free delivery for orders 75+! Take $5 off your 1st order. Earn cash reward points for every $ you spent. Save time. Save $$$!","Mon - Sun: Open 24 Hours",,,"visa, discover, mastercard, all major credit cards, amex, jcb, debit",,,,,,,,,,,,
695520,240043,"2020-09-27 02:53:34",Texaco,http://www.texaco.com,marker29station@gmail.com,"(928) 387-2929","Mile Mkr 29.5 N Hwy 93","White Hills",AZ,86445,"Mile Mkr 29.5 N Hwy 93,White Hills,AZ 86445","Gas Stations, General Merchandise, Gift Shops, Grocery Stores, Liquor Stores, Parking Lots & Garages, Places Of Interest, Tourist Information & Attractions, Truck Stops",5,"1 Review",,35.765278,-114.47202,//i1.ypcdn.com/blob/a56192c719e45ad077e253e8c8764f94eddc591b_100.png?63f80dd,,,,"Phone: (928) 767-4604",,,,,http://www.texaco.com,,"Jerry N.",04/07/2014,five,"This White Hills gas station has CLEAN BATHROOMS! Grand Canyon souvenirs, really nice people working here, and the cheapest gas in the area too. Oh did I mention CLEAN BATHROOMS? lol This White Hills AZ gas station looks great with the remodel.",,,,
708717,244120,"2020-09-27 02:54:01","State Oil Fuel Center",http://www.stateoilfuel.com,stateoilfuelcenter@yahoo.com,"(504) 398-1375","7124 Highway 23","Belle Chasse",LA,70037,"7124 Highway 23,Belle Chasse,LA 70037","Truck Stops, ATM Locations, Beer & Ale, Candy & Confectionery, Car Wash, Casinos, Cellular Telephone Equipment & Supplies, Cigar, Cigarette & Tobacco Dealers, Convenience Stores, Delicatessens, Diesel Fuel, Fast Food Restaurants, Fuel Oils, Gas Stations, Grocery Stores, Internet Cafes, Liquor Stores, Lottery Ticket Agencies, Money Order Service, Oils-Fuel-Wholesale & Manufacturers, Parking Lots & Garages, Restaurants, Sandwich Shops, Vape Shops & Electronic Cigarettes, Wi-Fi Hotspots, Wine",,,,29.8759,-90.01474,https://i4.ypcdn.com/blob/7a9e07d47803e15332de281e40a38790c11c9571_100x100_crop.jpg?63f80dd,"Your unique fuel provider","Here at State Oil Fuel Center, we are dedicated to giving you the BIGGEST & BEST selection around. We provide you the cleanest facility & fast friendly service. We've been around for over 18 years, we served you through hurricanes, fuel shortages, fires & holidays. We are her for you 24 hours a day, 365 days a year. 21 fueling stations allow plenty of room to get in & get out fast and easy. We are the best truck stop in New Orleans with 50 parking spaces & many extras for your convenience. We offer you a massive selection of the most popular drink selection in the area. Energy drinks, fountain, frozen, bottled, & canned drinks. Beer, Liquor & Wine. State Oil's Deli serves the best fried chicken, pizza, boudin balls, salads, po-boys & muffulettas. Made fresh daily. Everyday from 5am to 9pm. Regular, Plus, Super Gas & Diesel, Touchless Carwash, Casino, 50+ Truck parking spaces, 8 - 20 - 40 pound ICE, Propane fuel tanks. State Oil offers a full deli serving hot fresh delicious Fried Chicken and Pizza. Hot Wings, Boudin Balls, Meat Pies, Crawfish Pies, French Fries, Corn Dogs, Fried Cheese, Stuffed Jalapeno, Egg Rolls, Salads, Muffulettas, Poboys, Slice Bread Sandwiches, Alligator Sausage, Green Onion Sausage, Boudin Links, Red Beans, Jambalaya. Breakfast, Lunch & Dinner. THANKS FOR STOPPING","Mon - Sun: Open 24 Hours","Phone: (504) 394-5530",,"discover, amex, visa, all major credit cards, check, debit, mastercard",,,http://www.stateoilfuel.com,"Parking: Lot, Private Bike Parking: Yes",,,,,,,,
751944,258599,"2020-09-27 02:55:43",Stripes,http://www.stripesalabama.com,sales@stripesalabama.com,"(205) 462-8966","1701 James I Harrison Jr Pkwy E",Tuscaloosa,AL,35405,"1701 James I Harrison Jr Pkwy E,Tuscaloosa,AL 35405","Sealers Asphalt, Concrete, Etc., Asphalt Paving & Sealcoating, Building Contractors, Convenience Stores, Gas Stations, Grocery Stores, Painting Contractors, Parking Lot Maintenance & Marking, Parking Stations & Garages-Construction, Paving Contractors, Paving Materials, Signs",,,,33.17473,-87.51471,,,,"Mon - Sun: 2:00 am - 12:00 pm",,,"master card, visa",,,http://www.stripesalabama.com,"Specialties: Parking Bumpers, Parking Curbs, Bumper Blocks, Parking Blocks, Striping, Car Stops, Wheel Stops",,,,,,,,
766220,263462,"2020-09-27 02:55:58","Dusty Rose Country Emporium",,,"(928) 785-4729","10602 Williams St",Wellton,AZ,85356,"10602 Williams St,Wellton,AZ 85356","Discount Stores, Coffee Shops, Grocery Stores, Restaurants, Thrift Shops",,,,32.66936,-114.14224,,,,"Mon - Sat: 7:00 am - 7:00 pm Sun Closed",,,"all major credit cards, debit, cash only, visa, discover, mastercard, amex",,,,,,,,,,,,
766559,263565,"2020-09-27 02:55:58","McGary's Discount Groceries",http://statefarm.com,tmenterprises2007@yahoo.com,"(520) 207-5257","120 W Fort Lowell Rd",Tucson,AZ,85705,"120 W Fort Lowell Rd,Tucson,AZ 85705","Convenience Stores, Discount Stores, Grocery Stores, Thrift Shops, Wholesale Grocers",5,"3 Reviews",,32.26487,-110.97333,https://i1.ypcdn.com/blob/d0f26d50ed3066c44f314beb7459d95e3c724efc_100x100_crop.jpg?f9d23e1,"Shop at McGary's First & Cut Your Monthly Grocery Bill in 1/2","How do we sell so cheap? We get our food from a wide variety of sources due to closeouts, short codes, discontinued and damaged case products. If you have shopped here for any period of time you know that most of our products are, ""here today & gone tomorrow"", so we always urge our customers to stock up if they find something they like. McGary's Discount Groceries, you never know what you'll find. we bring out the bargain hunter in everyone. You will find some products around the store that are close to or even past its best by date. This does not mean the product is bad and in almost every case you will have a hard time differentiating between the product before and after the best by date. Here is a link to the USDA's site and what they have to say about product dating. http://www.fsis.usda.gov/Factsheets/Food_Product_Dating/index.asp.","Mon - Sat: 10:00 am - 8:00 pm Sun Closed","store message line: (520) 207-5257 Phone: (520) 572-9803",,"master card, visa, discover",,,"http://statefarm.com http://stores.ebay.com/McGarys-Discount-Outlet",,"M M.",03/07/2017,five,"What Is a Salvage Grocery Store? Salvage grocery stores, sometimes referred to as outlet or discount grocery stores, are stores that specialize in selling items that traditional grocery stores can't or won't sell. Most buy their merchandise from grocery reclamation centers, and it includes such things as: Food that is near or past its expiration Items in dented or torn packaging Items in seasonal or otherwise-dated packaging Store closeouts Manufacturer overstock Salvage from truck wrecks Unlike a traditional grocery store, which stocks the same items each week, salvage grocery stores stock different items each week, depending on what they get in. What Else Do I Need to Know About Salvage Grocery Stores? Salvage grocery stores sell more than food. You may also find deals on cleaners, health and beauty products, pet food, party supplies, paper products, office supplies and more You probably won't be able to do all of your grocery shopping at the salvage store. Start your shopping there. then, finish up at the grocery store Since inventory changes rapidly, you can't count on them to have the same things from week to week. Stock up when you see something you want, and check back regularly to see what else they've gotten in Since you're likely to be buying older items, only stock up on as much as you can use in a reasonable time Salvage grocery stores don't usually accept returns. You may get a bad item on occasion, but the overall savings will more than make up for it. but at McGary's we do allow exchanges on food items if you every get something not good bring it back with a receipt within 14 days and we will trade out that item.","Melissa G.",08/10/2016,five,"McGary's is a great place to get all kinds of Bargains, 8 for $1 slim Jim's, 2 for $10 food boxes, 4 for $1 candy bars, 6 for $1 protein bars or cereal bars, so many bargain buys $1.00 bag of Krave jerky, 3 for $5 cereal every days price. Tucson's only Salvage Scratch and Dent or Dated store. you can fill your cart with ton's of goodies for under $100.00"
816067,278500,"2020-09-27 02:57:42","Mister Thriftys",,,"(785) 633-5865","605 SW 6th Ave",Topeka,KS,66603,"605 SW 6th Ave,Topeka,KS 66603","Discount Stores, Grocery Stores, Surplus & Salvage Merchandise, Thrift Shops",,,,39.05336,-95.68102,,,,"Mon - Sat: 8:00 am - 6:00 pm Sun: 11:00 am - 6:00 pm",,,,,,,,,,,,,,,
817179,278840,"2020-09-27 02:57:42","Dollar Buster #15",https://dollarbuster15.com,dollarbuster15@yahoo.com,"(708) 652-6076","4832 W Cermak Rd",Cicero,IL,60804,"4832 W Cermak Rd,Cicero,IL 60804","General Merchandise, Baby Accessories, Furnishings & Services, Decorative Ceramic Products, Discount Stores, Furniture Stores, Grocery Stores, Hardware Stores, Housewares, Lamps & Shades, Luggage, Mattresses, Party Favors, Supplies & Services, Pet Stores, School Supplies & Services, Thrift Shops",,,A+,41.85163,-87.74595,https://i2.ypcdn.com/blob/4f5e62de9297e212bf1c4387be195f5618549e26_100x100_crop.jpg?f9d23e1,,"Dollar Buster #15, in Cicero, IL, is the leading dollar store serving Chicago, Berwyn, Summit, Stickney, Oak Park, Oak Lawn and surrounding areas since 2000. We offer furniture, party supplies, groceries, hardware, school supplies, balloons, kitchenware, cleaning and pet supplies, mattresses, carpet, baby supplies, tables, lamps, luggage and much more. For your next shopping spree, visit Dollar Buster #15 in Cicero.","Mon - Sun: 9:00 am - 9:00 pm",,,"discover, cash, visa, mastercard, amex, apple pay, android pay",,,"Primary Website Facebook",,,,,,,,,
829746,282644,"2020-09-27 02:58:05","Strong Future International",http://www.tripleclicks.com/15517002/ECA,,"(404) 839-7678","B S Columbia Pl",Decatur,GA,30032,"B S Columbia Pl,Decatur,GA 30032","Auctions, Employment Opportunities, Food Products, Grocery Stores, Health & Diet Food Products, Health & Wellness Products, Thrift Shops, Vitamins & Food Supplements",,,,33.740826,-84.26317,,,"Home Based Business Opportunities","Mon - Sun Closed",,,,,,http://www.tripleclicks.com/15517002/ECA,,,,,,,,,
836193,284625,"2020-09-27 02:58:20","Mohammed Jemal",,,"(703) 845-2680","3407 Payne St","Falls Church",VA,22041,"3407 Payne St,Falls Church,VA 22041","Thrift Shops, Grocery Stores",,,,38.85276,-77.13238,,,,"Mon - Sun: 10:00 am - 10:00 pm",,,"amex, mastercard, all major credit cards, visa, discover",,,,,,,,,,,,
845894,287429,"2020-09-27 02:58:29","Bailey's Health Food Center",https://www.facebook.com/pages/Baileys-Health-Food-Center-Inc/147228088639515,baileyshfc@gmail.com,"(541) 756-3004","2235 Newmark St","North Bend",OR,97459,"2235 Newmark St,North Bend,OR 97459","Health & Diet Food Products, Grocery Stores, Nutritionists, Vitamins & Food Supplements",,,A+,43.39143,-124.2427,,,,"Mon - Sat: 9:00 am - 6:30 pm Sun Closed",,,"visa, discover, amex, mastercard, all major credit cards",,"Bailey's Health Food Ctr Inc","https://www.facebook.com/pages/Baileys-Health-Food-Center-Inc/147228088639515 http://baileyshealthfoodcenter.com","Parking: Lot, Free Wheelchair Accessible: Yes Price Range : Average",,,,,,,,
845910,287435,"2020-09-27 02:58:29","Prime Time Nutrition",,,"(510) 535-9887","3347 Foothill Blvd",Oakland,CA,94601,"3347 Foothill Blvd,Oakland,CA 94601","Health & Diet Food Products, Grocery Stores, Nutritionists",,,,37.78293,-122.22107,,,,"Mon - Fri: 9:30 am - 7:00 pm Sat: 10:00 am - 6:00 pm Sun: 11:00 am - 5:00 pm",,,,,,,,,,,,,,,
846393,287514,"2020-09-27 02:58:29","Nutrition Outlet",http://www.nutritionoutletescapesalon.com,nutritionoutlet@machlink.com,"(563) 264-8124","403 W Mississippi Dr",Muscatine,IA,52761,"403 W Mississippi Dr,Muscatine,IA 52761","Health & Diet Food Products, Grocery Stores, Nutritionists, Vitamins & Food Supplements",,,,41.41879,-91.0486,,,,"Mon - Fri: 11:00 am - 6:00 pm Sat: 9:00 am - 2:00 pm",,,"discover, visa",,"Nutrition Outlet & Escape Salon","http://www.nutritionoutletescapesalon.com http://www.nutritionoutletescapesalon.com/about-us-15",,,,,,,,,
847480,287750,"2020-09-27 02:58:30","Strictly Gluten Free",http://www.strictlyglutenfree.com,info@strictlyglutenfree.com,"(631) 486-6835","396 Larkfield Rd","East Northport",NY,11731,"396 Larkfield Rd,East Northport,NY 11731","Health & Diet Food Products, Grocery Stores, Health Food Restaurants, Nutritionists",,,,40.86625,-73.32161,,,,"Mon - Fri: 9:00 am - 9:00 pm Sat: 9:00 am - 6:00 pm Sun: 9:30 am - 5:00 pm","TollFree: (855) 435-4846",,"amex, company card, discover, jcb, mastercard, visa, all major credit cards",,"Strictly Free Strickly Gluten Free Strictly Gluten Free Corp",http://www.strictlyglutenfree.com,"Parking: Lot, Private Wi-Fi: Free Price Range : Average",,,,,,,,
847770,287828,"2020-09-27 02:58:30","Rita Gardner, Herbalife Independent Distributor",http://herbal-nutrition.net/Rita,,"(601) 297-5463",,,,,,"Nutritionists, Exercise & Physical Fitness Programs, Grocery Stores, Vitamins & Food Supplements, Weight Control Services",,,,,,,,,"Mon - Sun: Open 24 Hours",,,"visa, master card, amex, discover, debit, check, paypal, company card",,,"retail products website",,,,,,,,,
848211,287912,"2020-09-27 02:58:30","Natural Health",http://www.nansnaturalhealth.com/#,naturalhealth3400@sbcglobal.net,"(636) 937-0526","526 Bailey Rd","Crystal City",MO,63019,"526 Bailey Rd,Crystal City,MO 63019","Health & Diet Food Products, Aromatherapy, Food Products, Grocery Stores, Health & Diet Food Products-Wholesale & Manufacturers, Health & Wellness Products, Herbs, Medical Equipment & Supplies, Nutritionists, Oxygen Therapy Equipment, Sporting Goods, Vitamins & Food Supplements",5,"1 Review",,38.21928,-90.38753,,"Providing Healthy Lifestyle Alternatives","Natural Health & Home strives to provide the best natural products available. We have classes and workshops to contribute to the healthy lifestyles our customers strive to have.","Tue - Wed: 10:00 am - 6:00 pm Thu - Fri: 9:00 am - 5:00 pm Sat: 9:00 am - 12:00 pm",,,"check, cash",,,"http://www.nansnaturalhealth.com/# http://nansnaturalhealth.com http://www.naturalhealthandhome.biz",,"Tonya L.",03/29/2017,five,"Huge selection of the best products and very knowledgeable and willing to help you find exactly what you need. Also affordable!",,,,