business_x_category.id,business.id,business.ts,business.business_name,business.home_page,business.email_address,business.phone,business.street,business.city,business.state,business.zip_code,business.full_address,business.category,business.rating,business.number_of_reviews,business.bbb_rating_or_license,business.latitude,business.longitude,business.cover_image,business.slogan,business.general_info,business.regular_hours,business.extra_phones,business.services_products,business.payment,business.price_range,business.aka,business.other_links,business.other_information,business.review_1_name,business.review_1_date,business.review_1_rating,business.review_1_text,business.review_2_name,business.review_2_date,business.review_2_rating,business.review_2_text
5757234,1723959,"2020-09-27 05:18:18","El-Orbany Mohammad I MD",,,"(773) 975-1600","836 W Wellington Ave # 7304",Chicago,IL,60657,"836 W Wellington Ave # 7304,Chicago,IL 60657","Physicians & Surgeons, Mental Health Services, Occupational Therapists, Physical Therapists, Physicians & Surgeons, Breast Care & Surgery, Physicians & Surgeons, Dermatology, Physicians & Surgeons, Emergency Medicine, Physicians & Surgeons, Endocrinology, Diabetes & Metabolism, Physicians & Surgeons, Family Medicine & General Practice, Physicians & Surgeons, Gastroenterology (Stomach & Intestines), Physicians & Surgeons, Gynecologic Oncology, Physicians & Surgeons, Gynecology, Physicians & Surgeons, Hand Surgery, Physicians & Surgeons, Internal Medicine, Physicians & Surgeons, Nephrology (Kidneys), Physicians & Surgeons, Neurology, Physicians & Surgeons, Nuclear Medicine, Physicians & Surgeons, Obstetrics, Physicians & Surgeons, Obstetrics And Gynecology, Physicians & Surgeons, Oncology, Physicians & Surgeons, Ophthalmology, Physicians & Surgeons, Orthopedics, Physicians & Surgeons, Osteopathic Manipulative Treatment, Physicians & Surgeons, Otorhinolaryngology (Ear, Nose & Throat), Physicians & Surgeons, Pediatrics, Physicians & Surgeons, Physical Medicine & Rehabilitation, Physicians & Surgeons, Plastic & Reconstructive, Physicians & Surgeons, Podiatrists, Physicians & Surgeons, Psychiatry, Physicians & Surgeons, Radiology, Physicians & Surgeons, Rheumatology (Arthritis), Physicians & Surgeons, Sports Medicine, Physicians & Surgeons, Surgery-General, Physicians & Surgeons, Urology, Physicians & Surgeons, Vascular Surgery, Physicians & Surgeons, Weight Loss Management, Rehabilitation Services, Sports Medicine & Injuries Treatment, Surgery Centers",,,,41.93641,-87.6504,,,,,,,insurance,,,,,,,,,,,,
5757364,1723962,"2020-09-27 05:18:18","Dr. Stephen A Cullinan, MD",http://www.illinoiscancercare.com,,"(309) 243-3000","8940 N Wood Sage Rd",Peoria,IL,61615,"8940 N Wood Sage Rd,Peoria,IL 61615","Physicians & Surgeons, Hematology (Blood), Cancer Treatment Centers, Physicians & Surgeons, Physicians & Surgeons, Dermatology, Physicians & Surgeons, Family Medicine & General Practice, Physicians & Surgeons, Gynecologic Oncology, Physicians & Surgeons, Gynecology, Physicians & Surgeons, Internal Medicine, Physicians & Surgeons, Obstetrics And Gynecology, Physicians & Surgeons, Oncology, Physicians & Surgeons, Osteopathic Manipulative Treatment, Physicians & Surgeons, Radiology, Physicians & Surgeons, Rheumatology (Arthritis)",,,,40.79569,-89.66529,,,"Gender male",,"Phone: (309) 243-3050 Fax: (309) 243-3050",,,,,http://www.illinoiscancercare.com,"Specialties: Hematology",,,,,,,,
5757464,1723969,"2020-09-27 05:18:18","Pevot Joy MD",http://www.womenshealthalliance.com,,"(214) 824-3200","3600 Gaston Ave Ste 300",Dallas,TX,75246,"3600 Gaston Ave Ste 300,Dallas,TX 75246","Surgery Centers, Mental Health Services, Physical Therapists, Physicians & Surgeons, Physicians & Surgeons, Allergy & Immunology, Physicians & Surgeons, Cosmetic Surgery, Physicians & Surgeons, Dermatology, Physicians & Surgeons, Emergency Medicine, Physicians & Surgeons, Endocrinology, Diabetes & Metabolism, Physicians & Surgeons, Family Medicine & General Practice, Physicians & Surgeons, Gynecologic Oncology, Physicians & Surgeons, Gynecology, Physicians & Surgeons, Internal Medicine, Physicians & Surgeons, Nutrition, Physicians & Surgeons, Obstetrics, Physicians & Surgeons, Obstetrics And Gynecology, Physicians & Surgeons, Oncology, Physicians & Surgeons, Osteopathic Manipulative Treatment, Physicians & Surgeons, Pediatrics, Physicians & Surgeons, Plastic & Reconstructive, Physicians & Surgeons, Psychiatry, Physicians & Surgeons, Radiology, Physicians & Surgeons, Sexual Dysfunction, Physicians & Surgeons, Sleep Disorders, Physicians & Surgeons, Surgery-General, Physicians & Surgeons, Urology, Physicians & Surgeons, Weight Loss Management, Sleep Disorders-Information & Treatment",,,,32.79089,-96.7803,,,,"Mon - Fri: 8:30 am - 5:00 pm",,,,,,http://www.womenshealthalliance.com,,,,,,,,,
5757616,1723975,"2020-09-27 05:18:18","Westchester Health",http://www.westchester.com/en/home.aspx,,"(845) 278-4388","20 Milltown Rd Ste 204",Brewster,NY,10509,"20 Milltown Rd Ste 204,Brewster,NY 10509","Physicians & Surgeons, Laser Vision Correction, Mental Health Services, Physical Therapists, Physicians & Surgeons, Allergy & Immunology, Physicians & Surgeons, Breast Care & Surgery, Physicians & Surgeons, Cardiology, Physicians & Surgeons, Cosmetic Surgery, Physicians & Surgeons, Dermatology, Physicians & Surgeons, Emergency Medicine, Physicians & Surgeons, Endocrinology, Diabetes & Metabolism, Physicians & Surgeons, Family Medicine & General Practice, Physicians & Surgeons, Gastroenterology (Stomach & Intestines), Physicians & Surgeons, Gynecologic Oncology, Physicians & Surgeons, Gynecology, Physicians & Surgeons, Internal Medicine, Physicians & Surgeons, Nephrology (Kidneys), Physicians & Surgeons, Neurology, Physicians & Surgeons, Obstetrics, Physicians & Surgeons, Obstetrics And Gynecology, Physicians & Surgeons, Oncology, Physicians & Surgeons, Ophthalmology, Physicians & Surgeons, Orthopedics, Physicians & Surgeons, Osteopathic Manipulative Treatment, Physicians & Surgeons, Otorhinolaryngology (Ear, Nose & Throat), Physicians & Surgeons, Pediatrics, Physicians & Surgeons, Plastic & Reconstructive, Physicians & Surgeons, Podiatrists, Physicians & Surgeons, Psychiatry, Physicians & Surgeons, Public Health, Physicians & Surgeons, Radiology, Physicians & Surgeons, Rheumatology (Arthritis), Physicians & Surgeons, Sexual Dysfunction, Physicians & Surgeons, Sports Medicine, Physicians & Surgeons, Surgery-General, Physicians & Surgeons, Urology, Physicians & Surgeons, Vascular Surgery, Physicians & Surgeons, Weight Loss Management, Skin Care, Sports Medicine & Injuries Treatment, Surgery Centers",,,,41.41496,-73.57394,,,,"Mon - Fri: 9:00 am - 5:00 pm","Fax: (914) 218-8130",,"master card, visa, insurance",,,"http://www.westchester.com/en/home.aspx http://www.westchesterhealth.com",,,,,,,,,
5757811,1723981,"2020-09-27 05:18:18","The Woodlands Institute for Health and Wellness",http://woodlandswellnessmd.com,,"(281) 298-6742","26110 Oak Ridge Dr",Spring,TX,77380,"26110 Oak Ridge Dr,Spring,TX 77380","Clinics, Emergency Care Facilities, Medical Clinics, Physical Therapists, Physical Therapy Clinics, Physicians & Surgeons, Allergy & Immunology, Physicians & Surgeons, Cardiology, Physicians & Surgeons, Dermatology, Physicians & Surgeons, Family Medicine & General Practice, Physicians & Surgeons, Gynecologic Oncology, Physicians & Surgeons, Gynecology, Physicians & Surgeons, Internal Medicine, Physicians & Surgeons, Nephrology (Kidneys), Physicians & Surgeons, Neurology, Physicians & Surgeons, Obstetrics And Gynecology, Physicians & Surgeons, Osteopathic Manipulative Treatment, Physicians & Surgeons, Podiatrists, Physicians & Surgeons, Psychiatry, Physicians & Surgeons, Radiology, Physicians & Surgeons, Surgery-General",,,,30.14146,-95.44778,,,"The Woodlands Institute for Health and Wellness is here to serve your entire family. The InstituteВ’s holistic approach combines the science of traditional medicine with the wisdom of natural holistic approaches, wholesome nutrition, and healthy lifestyle choices Institute founder, Dr. Mila McManus is a firm believer in functional and preventative medicine. She is passionate about helping her patients achieve optimal health and an improved quality of life, while avoiding the side effects and discomfort of prescription drugs and surgery. By resolving hormonal imbalance, promoting healthy habits, detoxifying the body, and restoring optimal immune function The Woodlands Institute for Health and Wellness treats a wide variety of complaints including depression, fatigue, low libido, PMS, headaches, fibromyalgia, and sleeping disorders. Services also include a yeast cleanse, total body cleanse, and nutritional education, with programs for allergy, rapid weight loss, and menopause. We are conveniently located off I-45 between Woodlands Parkway and Sawdust Road. Please look at our upcoming events and join us for a complimentary Lunch & Learn event, as we discuss safe, natural, and effective solutions to your health concerns.","Mon - Thu: 9:00 am - 5:00 pm Fri: 9:00 am - 12:00 pm Sat - Sun Closed","Fax: (281) 419-1373",,"debit, travelers checks, visa, all major credit cards, amex, mastercard, financing available, check, paypal, discover, cash, master card",,,website,"Parking: Lot By Appointment Only: Yes",,,,,,,,
5758103,1724000,"2020-09-27 05:18:18","Dr. Deepak Shashikant Patel, MD",http://www.rushcopley.com,,"(630) 978-6886","1100 W Veterans Pkwy",Yorkville,IL,60560,"1100 W Veterans Pkwy,Yorkville,IL 60560","Physicians & Surgeons, Physicians & Surgeons, Allergy & Immunology, Physicians & Surgeons, Dermatology, Physicians & Surgeons, Endocrinology, Diabetes & Metabolism, Physicians & Surgeons, Family Medicine & General Practice, Physicians & Surgeons, Gastroenterology (Stomach & Intestines), Physicians & Surgeons, Gynecologic Oncology, Physicians & Surgeons, Gynecology, Physicians & Surgeons, Internal Medicine, Physicians & Surgeons, Neurology, Physicians & Surgeons, Obstetrics And Gynecology, Physicians & Surgeons, Oncology, Physicians & Surgeons, Osteopathic Manipulative Treatment, Physicians & Surgeons, Pain Management, Physicians & Surgeons, Rheumatology (Arthritis), Physicians & Surgeons, Surgery-General, Physicians & Surgeons, Urology",,,,41.65838,-88.46905,https://i1.ypcdn.com/blob/ab07f00ae03142769bd08fdf24e7cea1806d47da_100x100_crop.jpg?8ad0f92,,"Gender male",,"Phone: (630) 466-8200",,insurance,,,http://www.rushcopley.com,,,,,,,,,
5758155,1724002,"2020-09-27 05:18:21","Exclusively For Women",http://www.aurorahealthcare.org,,"(414) 219-6600","1218 W Kilbourn Ave",Milwaukee,WI,53233,"1218 W Kilbourn Ave,Milwaukee,WI 53233","Physicians & Surgeons, Clinics, Laser Vision Correction, Mental Health Services, Occupational Therapists, Physical Therapists, Physicians & Surgeons, Allergy & Immunology, Physicians & Surgeons, Breast Care & Surgery, Physicians & Surgeons, Cosmetic Surgery, Physicians & Surgeons, Dermatology, Physicians & Surgeons, Emergency Medicine, Physicians & Surgeons, Endocrinology, Diabetes & Metabolism, Physicians & Surgeons, Family Medicine & General Practice, Physicians & Surgeons, Gastroenterology (Stomach & Intestines), Physicians & Surgeons, Gynecologic Oncology, Physicians & Surgeons, Gynecology, Physicians & Surgeons, Hand Surgery, Physicians & Surgeons, Internal Medicine, Physicians & Surgeons, Nephrology (Kidneys), Physicians & Surgeons, Neurology, Physicians & Surgeons, Nutrition, Physicians & Surgeons, Obstetrics And Gynecology, Physicians & Surgeons, Oncology, Physicians & Surgeons, Ophthalmology, Physicians & Surgeons, Orthopedics, Physicians & Surgeons, Osteopathic Manipulative Treatment, Physicians & Surgeons, Otorhinolaryngology (Ear, Nose & Throat), Physicians & Surgeons, Pediatrics, Physicians & Surgeons, Physical Medicine & Rehabilitation, Physicians & Surgeons, Plastic & Reconstructive, Physicians & Surgeons, Podiatrists, Physicians & Surgeons, Psychiatry, Physicians & Surgeons, Public Health, Physicians & Surgeons, Radiology, Physicians & Surgeons, Rheumatology (Arthritis), Physicians & Surgeons, Sexual Dysfunction, Physicians & Surgeons, Sleep Disorders, Physicians & Surgeons, Sports Medicine, Physicians & Surgeons, Surgery-General, Physicians & Surgeons, Urology, Physicians & Surgeons, Vascular Surgery, Physicians & Surgeons, Weight Loss Management, Rehabilitation Services, Skin Care, Sleep Disorders-Information & Treatment, Sports Medicine & Injuries Treatment, Surgery Centers",,,,43.04185,-87.92757,https://i1.ypcdn.com/blob/24618b3d1cfc12d22104401050c23b212eff076b_100x100_crop.jpg?8ad0f92,,"Board Certified Yes Gender female","Mon - Fri: 9:00 am - 5:00 pm","Phone: (414) 219-5600 TollFree: (888) 720-2012",,"visa, amex, cash, check, insurance, debit, master card, discover",,,http://www.aurorahealthcare.org,,,,,,,,,
5758316,1724008,"2020-09-27 05:18:21","Latisa Carson-Veglia MD",http://www.pasadenaobgyn.com,,"(626) 796-9114","50 Alessandro Pl",Pasadena,CA,91105,"50 Alessandro Pl,Pasadena,CA 91105","Physicians & Surgeons, Physicians & Surgeons, Dermatology, Physicians & Surgeons, Family Medicine & General Practice, Physicians & Surgeons, Gynecologic Oncology, Physicians & Surgeons, Gynecology, Physicians & Surgeons, Neurology, Physicians & Surgeons, Obstetrics, Physicians & Surgeons, Obstetrics And Gynecology, Physicians & Surgeons, Osteopathic Manipulative Treatment, Physicians & Surgeons, Public Health, Physicians & Surgeons, Sleep Disorders, Physicians & Surgeons, Surgery-General, Physicians & Surgeons, Urology, Physicians & Surgeons, Weight Loss Management, Sleep Disorders-Information & Treatment",,,,34.13048,-118.15202,,,,"Mon - Fri: 9:00 am - 5:00 pm","Phone: (626) 796-0799 Fax Number: (626) 796-0799",,,,,http://www.pasadenaobgyn.com,,,,,,,,,
5758352,1724009,"2020-09-27 05:18:21","Schmitt Mary Ann",,,"(812) 479-8726","908 S Hebron Ave",Evansville,IN,47714,"908 S Hebron Ave,Evansville,IN 47714","Physicians & Surgeons, Mental Health Services, Physicians & Surgeons, Allergy & Immunology, Physicians & Surgeons, Cosmetic Surgery, Physicians & Surgeons, Dermatology, Physicians & Surgeons, Endocrinology, Diabetes & Metabolism, Physicians & Surgeons, Family Medicine & General Practice, Physicians & Surgeons, Gynecologic Oncology, Physicians & Surgeons, Gynecology, Physicians & Surgeons, Obstetrics, Physicians & Surgeons, Obstetrics And Gynecology, Physicians & Surgeons, Oncology, Physicians & Surgeons, Osteopathic Manipulative Treatment, Physicians & Surgeons, Psychiatry, Physicians & Surgeons, Surgery-General, Skin Care",,,,37.96532,-87.49523,,,,,,,,,,,,,,,,,,,
5759014,1724041,"2020-09-27 05:18:21","Doctors Of The North Shore",http://www.docsns.com,,"(847) 967-5010","6131 Dempster St","Morton Grove",IL,60053,"6131 Dempster St,Morton Grove,IL 60053","Physicians & Surgeons, Mental Health Services, Occupational Therapists, Physical Therapists, Physicians & Surgeons, Breast Care & Surgery, Physicians & Surgeons, Dermatology, Physicians & Surgeons, Emergency Medicine, Physicians & Surgeons, Endocrinology, Diabetes & Metabolism, Physicians & Surgeons, Family Medicine & General Practice, Physicians & Surgeons, Gastroenterology (Stomach & Intestines), Physicians & Surgeons, Gynecologic Oncology, Physicians & Surgeons, Gynecology, Physicians & Surgeons, Hand Surgery, Physicians & Surgeons, Internal Medicine, Physicians & Surgeons, Nephrology (Kidneys), Physicians & Surgeons, Neurology, Physicians & Surgeons, Nuclear Medicine, Physicians & Surgeons, Obstetrics, Physicians & Surgeons, Obstetrics And Gynecology, Physicians & Surgeons, Oncology, Physicians & Surgeons, Ophthalmology, Physicians & Surgeons, Orthopedics, Physicians & Surgeons, Osteopathic Manipulative Treatment, Physicians & Surgeons, Otorhinolaryngology (Ear, Nose & Throat), Physicians & Surgeons, Pediatrics, Physicians & Surgeons, Physical Medicine & Rehabilitation, Physicians & Surgeons, Plastic & Reconstructive, Physicians & Surgeons, Podiatrists, Physicians & Surgeons, Psychiatry, Physicians & Surgeons, Public Health, Physicians & Surgeons, Radiology, Physicians & Surgeons, Rheumatology (Arthritis), Physicians & Surgeons, Sports Medicine, Physicians & Surgeons, Surgery-General, Physicians & Surgeons, Urology, Physicians & Surgeons, Vascular Surgery, Physicians & Surgeons, Weight Loss Management, Rehabilitation Services, Sports Medicine & Injuries Treatment, Surgery Centers",4,"1 Review",,42.04062,-87.78007,https://i1.ypcdn.com/blob/032088e1d215318f8d62aace4b94e5811277631e_100x100_crop.jpg?8ad0f92,,"Board Certified Yes Gender male","Mon - Fri: 9:00 am - 5:00 pm","Phone: (847) 967-5147 Fax: (847) 967-5147 TollFree: (877) 202-7220",,"master card, visa, insurance",,,http://www.docsns.com,"Specialties: Internal Medicine",pace501,03/07/2009,four,"she is the best that a disable person ever had.",,,,
5759235,1724047,"2020-09-27 05:18:21","Benjamin Shipton DO",http://www.primary-health.net,,"(724) 662-2650","737 Greenville Rd",Mercer,PA,16137,"737 Greenville Rd,Mercer,PA 16137","Physicians & Surgeons, Mental Health Services, Physical Therapists, Physicians & Surgeons, Dermatology, Physicians & Surgeons, Emergency Medicine, Physicians & Surgeons, Endocrinology, Diabetes & Metabolism, Physicians & Surgeons, Family Medicine & General Practice, Physicians & Surgeons, Gynecologic Oncology, Physicians & Surgeons, Gynecology, Physicians & Surgeons, Internal Medicine, Physicians & Surgeons, Neurology, Physicians & Surgeons, Obstetrics, Physicians & Surgeons, Obstetrics And Gynecology, Physicians & Surgeons, Oncology, Physicians & Surgeons, Orthopedics, Physicians & Surgeons, Osteopathic Manipulative Treatment, Physicians & Surgeons, Pediatrics, Physicians & Surgeons, Podiatrists, Physicians & Surgeons, Psychiatry, Physicians & Surgeons, Public Health, Physicians & Surgeons, Rheumatology (Arthritis), Physicians & Surgeons, Sports Medicine, Physicians & Surgeons, Surgery-General, Physicians & Surgeons, Weight Loss Management, Sports Medicine & Injuries Treatment",,,,41.24865,-80.24866,https://i1.ypcdn.com/blob/c74499edcbfcafc71f076eeeeda5320f92a4242b_100x100_crop.jpg?8ad0f92,,"Board Certified Yes Gender male","Mon - Fri: 9:00 am - 5:00 pm","Fax: (724) 662-1338",,"debit, amex, all major credit cards, discover, financing available, insurance, check",,,http://www.primary-health.net,"Wheelchair Accessible: Yes Parking: Lot, Free Specialties: Family Medicine, Family Practice",,,,,,,,
5759367,1724052,"2020-09-27 05:18:21","Dr. Laura V. Pineiro, MD",,,"(630) 585-3100","2020 Ogden Ave Ste 360",Aurora,IL,60504,"2020 Ogden Ave Ste 360,Aurora,IL 60504","Physicians & Surgeons, Mental Health Services, Occupational Therapists, Physical Therapists, Physicians & Surgeons, Breast Care & Surgery, Physicians & Surgeons, Dermatology, Physicians & Surgeons, Emergency Medicine, Physicians & Surgeons, Endocrinology, Diabetes & Metabolism, Physicians & Surgeons, Family Medicine & General Practice, Physicians & Surgeons, Gastroenterology (Stomach & Intestines), Physicians & Surgeons, Gynecologic Oncology, Physicians & Surgeons, Gynecology, Physicians & Surgeons, Hand Surgery, Physicians & Surgeons, Internal Medicine, Physicians & Surgeons, Nephrology (Kidneys), Physicians & Surgeons, Neurology, Physicians & Surgeons, Nuclear Medicine, Physicians & Surgeons, Obstetrics, Physicians & Surgeons, Obstetrics And Gynecology, Physicians & Surgeons, Oncology, Physicians & Surgeons, Ophthalmology, Physicians & Surgeons, Orthopedics, Physicians & Surgeons, Osteopathic Manipulative Treatment, Physicians & Surgeons, Otorhinolaryngology (Ear, Nose & Throat), Physicians & Surgeons, Pediatrics, Physicians & Surgeons, Physical Medicine & Rehabilitation, Physicians & Surgeons, Plastic & Reconstructive, Physicians & Surgeons, Podiatrists, Physicians & Surgeons, Psychiatry, Physicians & Surgeons, Radiology, Physicians & Surgeons, Rheumatology (Arthritis), Physicians & Surgeons, Sports Medicine, Physicians & Surgeons, Surgery-General, Physicians & Surgeons, Urology, Physicians & Surgeons, Vascular Surgery, Physicians & Surgeons, Weight Loss Management, Rehabilitation Services, Sports Medicine & Injuries Treatment, Surgery Centers",,,,41.72841,-88.26757,https://i1.ypcdn.com/blob/a5491cab26fa11d0a6d6413bfb94d6639a02e41f_100x100_crop.jpg?8ad0f92,,"Gender female",,"Phone: (630) 264-8840 Fax: (630) 907-1919",,insurance,,,,,,,,,,,,
5759572,1724057,"2020-09-27 05:18:21","Dr. Richard Jay Hoffner, MD",http://www.marinahospital.com/contact-us.html,,"(310) 823-8911","4650 Lincoln Blvd","Marina Del Rey",CA,90292,"4650 Lincoln Blvd,Marina Del Rey,CA 90292","Physicians & Surgeons, Mental Health Services, Physical Therapists, Physicians & Surgeons, Allergy & Immunology, Physicians & Surgeons, Cardiology, Physicians & Surgeons, Cosmetic Surgery, Physicians & Surgeons, Dermatology, Physicians & Surgeons, Emergency Medicine, Physicians & Surgeons, Endocrinology, Diabetes & Metabolism, Physicians & Surgeons, Family Medicine & General Practice, Physicians & Surgeons, Gastroenterology (Stomach & Intestines), Physicians & Surgeons, Gynecologic Oncology, Physicians & Surgeons, Gynecology, Physicians & Surgeons, Infectious Diseases, Physicians & Surgeons, Internal Medicine, Physicians & Surgeons, Nephrology (Kidneys), Physicians & Surgeons, Neurology, Physicians & Surgeons, Nuclear Medicine, Physicians & Surgeons, Nutrition, Physicians & Surgeons, Obstetrics, Physicians & Surgeons, Obstetrics And Gynecology, Physicians & Surgeons, Oncology, Physicians & Surgeons, Ophthalmology, Physicians & Surgeons, Orthopedics, Physicians & Surgeons, Osteopathic Manipulative Treatment, Physicians & Surgeons, Otorhinolaryngology (Ear, Nose & Throat), Physicians & Surgeons, Pediatrics, Physicians & Surgeons, Plastic & Reconstructive, Physicians & Surgeons, Podiatrists, Physicians & Surgeons, Psychiatry, Physicians & Surgeons, Radiology, Physicians & Surgeons, Rheumatology (Arthritis), Physicians & Surgeons, Sexual Dysfunction, Physicians & Surgeons, Sleep Disorders, Physicians & Surgeons, Sports Medicine, Physicians & Surgeons, Surgery-General, Physicians & Surgeons, Urology, Physicians & Surgeons, Vascular Surgery, Physicians & Surgeons, Weight Loss Management, Skin Care, Sleep Disorders-Information & Treatment, Sports Medicine & Injuries Treatment, Surgery Centers",,,,33.98205,-118.43911,,,"Board Certified Yes Gender male","Mon - Fri: 9:00 am - 5:00 pm",,,,,,http://www.marinahospital.com/contact-us.html,"Specialties: Emergency Medicine",,,,,,,,