business_x_category.id,business.id,business.ts,business.business_name,business.home_page,business.email_address,business.phone,business.street,business.city,business.state,business.zip_code,business.full_address,business.category,business.rating,business.number_of_reviews,business.bbb_rating_or_license,business.latitude,business.longitude,business.cover_image,business.slogan,business.general_info,business.regular_hours,business.extra_phones,business.services_products,business.payment,business.price_range,business.aka,business.other_links,business.other_information,business.review_1_name,business.review_1_date,business.review_1_rating,business.review_1_text,business.review_2_name,business.review_2_date,business.review_2_rating,business.review_2_text
1279989,409561,"2020-09-27 03:10:13","Active Enterprises Inc",,,"(360) 642-2102","PO Box 501","Long Beach",WA,98631,"PO Box 501,Long Beach,WA 98631","Sheet Metal Work, Aluminum, Gas Companies, Heating Contractors & Specialties, Metals, Propane & Natural Gas, Steel Fabricators, Steel Processing, Utility Companies",,,,46.37737,-124.04704,,"Through our doors walk the greatest people on earth,..our customers and our suppliers!","Pacific CountyВ’s first LP/Propane Gas and RV supply company, Active Enterprises Inc. began as a franchise of Petrolane, the nationВ’s largest propane distributor at that time. Wilbur Jacobson, a prominent entrepreneur, businessman and pioneer family on the peninsula, started delivering fuel as a Petrolane consignee based in Long Beach, WA at the site of the current office in 1966. In 1973 Wilbur brought his son, Dale, to the company, delivering propane gas and servicing gas equipment to customers in Pacific and Wahkiakum County. Dale was 28 years old and married to his wife Jean. By 1981 Dale and Jean were raising 4 children and expanding Active Enterprises Inc. propane and RV supply sales.",,,,,,,,,,,,,,,,
1280288,409632,"2020-09-27 03:10:13","Harrison-Orr Air Conditioning Inc",http://www.harrisonorr.com,joem@harrisonorr.com,"(405) 528-3333","4100 N Walnut Ave","Oklahoma City",OK,73105,"4100 N Walnut Ave,Oklahoma City,OK 73105","Steel Fabricators, Air Conditioning Contractors & Systems, Air Conditioning Service & Repair, Altering & Remodeling Contractors, Automatic Fire Sprinklers-Residential, Commercial & Industrial, Building Contractors, Building Contractors-Commercial & Industrial, Fire Protection Equipment & Supplies, Furnace Repair & Cleaning, General Contractors, Heating Contractors & Specialties, Heating Equipment & Systems-Repairing, Industrial Equipment Repair, Mechanical Contractors, Piping Contractors, Plumbers, Plumbing Contractors-Commercial & Industrial, Sheet Metal Fabricators, Sheet Metal Work, Steel Processing",,,A+,35.51305,-97.50706,,,"Harrison-Orr Air Conditioning, LLC is committed to provide quality, responsive, cost effective construction, maintenance and repairs of mechanical systems for our customers. QUALITY COMES FIRST - To achieve customer satisfaction, the quality of our installations and services must be our number one priority. CUSTOMERS ARE THE FOCUS OF EVERYTHING WE DO - Our work will be done with our customers in mind, providing better installations and services than our competition. INTEGRITY IS NEVER COMPROMISED - The conduct of our company must be pursued in a manner that is socially responsible and commands respect for its integrity and its positive contribution to society. Air Beds, Mechanical Contractors, Plumbing and Plumbing Contractors.","Mon - Fri: 8:00 am - 5:00 pm Sat - Sun Closed",,,,,,http://www.harrisonorr.com,"Services: Furnace Repair, Sheet Metal Work Free Estimates: Yes",,,,,,,,
1280498,409691,"2020-09-27 03:10:13","Construction Unlimited",,mharuuc@cavtel.net,"(615) 352-2269","6602 Highway 100",Nashville,TN,37205,"6602 Highway 100,Nashville,TN 37205","General Contractors, Air Conditioning Contractors & Systems, Altering & Remodeling Contractors, Bathroom Remodeling, Building Construction Consultants, Building Contractors, Building Restoration & Preservation, Building Specialties, Cabinets, Carpenters, Construction Consultants, Construction Management, Flooring Contractors, Garages-Building & Repairing, Handyman Services, Heating Contractors & Specialties, Home Builders, Home Design & Planning, Home Improvements, Kitchen Planning & Remodeling Service, Landscape Contractors, Real Estate Developers, Steel Erectors",,,A+,36.09033,-86.87958,https://i3.ypcdn.com/blob/3f2c884ff859eff9d21f9ca94fbdae706487c638_100x100_crop.jpg?63f80dd,,,"Mon - Sun: 7:00 am - 7:00 pm","Phone: (615) 352-5989 Primary Phone: (615) 352-5989 Fax: (615) 356-4143",,,,"Construction Unlimited, Inc.",,"Services: Bathroom Remodeling, Kitchen Remodeling",,,,,,,,
1280658,409742,"2020-09-27 03:10:13","Midstate Mechanical Inc",http://www.midstatemechanicalkansas.com,midstatemech@att.net,"(785) 537-4343","230 Levee Dr",Manhattan,KS,66502,"230 Levee Dr,Manhattan,KS 66502","Furnaces-Heating, Air Conditioning Contractors & Systems, Air Conditioning Equipment & Systems, Air Conditioning Service & Repair, Building Contractors, Fireplace Equipment, Fireplaces, Heating Contractors & Specialties, Heating Equipment & Systems, Metal Tanks, Metal Tubing, Plumbers, Sewer Cleaners & Repairers, Sewer Contractors, Sheet Metal Work, Steel Erectors, Steel Processing, Water Heaters",,,,39.19157,-96.55227,,,"From climate control to ensuring your water is warm when you need it, put your trust in us to keep your systems at their best. Call Midstate Mechanical, Inc.","Mon - Fri: 8:00 am - 4:30 pm",,,"amex, discover, master card, visa, all major credit cards, mastercard",,,http://www.midstatemechanicalkansas.com,"Services: Boiler Repair, Sheet Metal Work",,,,,,,,
1280680,409746,"2020-09-27 03:10:13","Central Sheet Metal Co Inc",http://www.centralsheetmetalco.com,jelly@centralsheetmetalco.com,"(812) 372-9976","925 S Marr Rd",Columbus,IN,47201,"925 S Marr Rd,Columbus,IN 47201","Steel Fabricators, Building Contractors, Heating Contractors & Specialties, Sheet Metal Fabricators, Sheet Metal Work, Steel Processing, Ventilating Contractors",,,,39.18578,-85.88789,,"Commercial & Industrial Ventilation and Sheet Metal","Commercial & Industrial Ventilation and Sheet Metal Hours: Mon - Fri: 7am - 4pm","Mon - Fri: 7:00 am - 4:00 pm",,,,,,http://www.centralsheetmetalco.com,"Specialties: Hvac",,,,,,,,
1280766,409771,"2020-09-27 03:10:13","B & H Environmental & Sheet Metal Contractors Inc.",,,"(828) 348-1164","20 Britt Dr",Asheville,NC,28805,"20 Britt Dr,Asheville,NC 28805","Steel Fabricators, Aluminum Products, Aluminum-Wholesale & Manufacturers, Building Contractors, Gutters & Downspouts, Heating Contractors & Specialties, Metal-Wholesale & Manufacturers, Metals, Roofing Contractors, Sheet Metal Fabricators, Sheet Metal Work, Steel Processing, Welders",,,,35.57514,-82.52842,,"We fabricate and install all types of sheet metal.","We fabricate & install all types of sheet metal.",,,,,,,,,,,,,,,,
1281189,409873,"2020-09-27 03:10:13","Crumpton Welding Supply And Equipment",http://www.crumptonweldingsupply.com/,charles@crumptonws.com,"(863) 259-3479","601 Charlotte Rd",Auburndale,FL,33823,"601 Charlotte Rd,Auburndale,FL 33823","Welding Equipment Repair, Building Contractors, Compressors, Construction & Building Equipment, Fuel Oils, Gas Companies, Gas Stations, Gas-Industrial & Medical-Cylinder & Bulk, Hardware Stores, Heating Contractors & Specialties, Metal Cutting Machines, Metal Tanks, Metal Tubing, Propane & Natural Gas, Safety Equipment & Clothing, Steel Erectors, Steel Processing, Utility Companies, Welding Equipment & Supply, Wholesale Gasoline",,,,28.05666,-81.77597,https://i3.ypcdn.com/blob/ef605a985ab02fbf4ba6021071aebbd874543497_100x100_crop.jpg?63f80dd,"Welding Supplies/Repair & Bulk Gases Where Service & A Fair Price Really Count. Prompt Service & Delivery. Family Owned & Operated Since 1960.","Crumpton Welding Supply and Equipment has multiple locations throughout west central Florida. We supply welding equipment, industrial gases, consumables, personal protection supplies, as well as shape cutting equipment. We offer continuous technical support in all aspects of our business. We offer delivery, and convenient walk-in store locations. We offer at location and in house service and installation for welding and shape cutting equipment. We are a factory warranty repair station for most major manufacturers of welding and related equipment. Call us today for more information.","Mon - Fri: 8:00 am - 5:00 pm",,,"check, mastercard, discover, visa, amex",,"Crumpton Welding Supplies & Equipment Inc","http://www.crumptonweldingsupply.com http://crumptonws.com",,,,,,,,,
1281785,410041,"2020-09-27 03:10:15","J & S Commercial Construction Inc",http://jscommconst.com,,"(315) 668-7653","373 Us Route 11","Central Square",NY,13036,"373 Us Route 11,Central Square,NY 13036","General Contractors, Air Conditioning Contractors & Systems, Altering & Remodeling Contractors, Building Construction Consultants, Building Contractors, Building Contractors-Commercial & Industrial, Concrete Contractors, Heating Contractors & Specialties, Home Builders, Metal Buildings, Steel Erectors",,,,43.26673,-76.14512,,,,"Mon - Fri: 8:00 am - 4:00 pm",,,,,,http://jscommconst.com,"Specialties: Metal Buildings",,,,,,,,
1281865,410068,"2020-09-27 03:10:15","Dynamic Services",http://www.elkhornconstruction.com,,"(505) 634-4100","1700 N 1st St",Bloomfield,NM,87413,"1700 N 1st St,Bloomfield,NM 87413","General Contractors, Building Contractors-Commercial & Industrial, Concrete Contractors, Electric Contractors-Commercial & Industrial, Electricians, Heating Contractors & Specialties, Insulation Contractors, Metal Buildings, Painting Contractors, Plastering Contractors, Real Estate Developers, Steel Erectors",,,,36.73602,-107.97736,,,,,"Fax: (505) 634-4191",,,,,http://www.elkhornconstruction.com,"Services: Boiler Repair",,,,,,,,
1281974,410083,"2020-09-27 03:10:15","CSC Inc",,,"(260) 484-2587","2315 N Clinton St","Fort Wayne",IN,46805,"2315 N Clinton St,Fort Wayne,IN 46805","General Contractors, Air Conditioning Contractors & Systems, Altering & Remodeling Contractors, Building Construction Consultants, Building Contractors, Heating Contractors & Specialties, Home Builders, Metal Buildings, Real Estate Buyer Brokers, Steel Erectors",,,A+,41.09679,-85.13991,,,,,,,,,"C S C, Inc.",,,,,,,,,,
1284521,410773,"2020-09-27 03:10:16","O & M Industries",http://WWW.OMINDUSTRIES.COM,hiltonom@bellsouth.net,"(707) 388-8563","5901 Ericson Way",Arcata,CA,95521,"5901 Ericson Way,Arcata,CA 95521","Steel Distributors & Warehouses, Air Conditioning Contractors & Systems, Air Conditioning Service & Repair, Construction & Building Equipment, Crane Service, Cranes, Furnace Repair & Cleaning, Furnaces-Heating, Heating Contractors & Specialties, Ornamental Metal Work, Steel Detailers Structural, Steel Fabricators, Steel Processing, Ventilating Equipment, Welders",,,,40.90722,-124.069,,,"O&M Industries is an industrial, structural and mechanical contracting company that provides a range of design, engineering, construction and plant maintenance services since 1946. It offers equipment erection, rigging and pneumatic conveying services. The company also provides fabrication, piping and ducting services. O&M Industries serves clients in the pulp and paper, agriculture, cement, manufacturing, and food and beverage industries. In addition, it undertakes projects for clients in the commercial and industrial sectors. The company offers barge loading, transport and off-site assembly services for pumps and tanks. O&M Industries provides project scheduling and planning services. It also offers 24-hour emergency assistance services.","Mon - Fri: 8:00 am - 5:00 pm",,,"all major credit cards",,,"http://www.omindustries.com http://ti-med.com",,,,,,,,,
1285084,410954,"2020-09-27 03:10:16","Trio Sheet Metal Works Co Inc",https://m.facebook.com/pages/trio-sheet-metal-works-co-inc/291591288109,triosmjr@aol.com,"(631) 842-6174","681 Albany Ave",Amityville,NY,11701,"681 Albany Ave,Amityville,NY 11701","Metal-Wholesale & Manufacturers, Heating Contractors & Specialties, Machine Tool Manufacturers, Sheet Metal Fabricators, Sheet Metal Work, Sheet Metal Work-Manufacturers, Steel Detailers Structural",,,,40.71359,-73.40231,,,,"Mon - Fri: 7:00 am - 3:30 pm Sat - Sun Closed","Phone: (631) 842-6518 Fax Number: (631) 842-6518 Fax: (631) 842-6518",,"mastercard, all major credit cards, amex, visa, discover",,,https://m.facebook.com/pages/trio-sheet-metal-works-co-inc/291591288109,"Wheelchair Accessible: Yes Services: Duct Systems Parking: Lot, Free",,,,,,,,
1285481,411074,"2020-09-27 03:10:22","Simmons Brothers Construction",https://www.simmonsbrothers.net,billsimmons@simmonsbrothers.net,"(330) 722-1415","780 W Smith Rd Ste A",Medina,OH,44256,"780 W Smith Rd Ste A,Medina,OH 44256","General Contractors, Air Conditioning Contractors & Systems, Altering & Remodeling Contractors, Building Construction Consultants, Building Contractors, Building Contractors-Commercial & Industrial, Heating Contractors & Specialties, Home Builders, Metal Buildings, Plumbers, Real Estate Developers, Steel Erectors",,,A+,41.13605,-81.88344,https://i3.ypcdn.com/blob/cb47072d8239e793ce29baf442a1610b4d8fad5a_100x100_crop.jpg?63f80dd,,"Established in 1959, Simmons Brothers Construction is a family-owned and operated business that focuses on commercial, industrial and institutional construction in Medina County, Ohio. It has worked on various commercial projects, including retail stores, financial institutions, automobile dealerships, executive offices, manufacturing units and commercial office space. Simmons Brothers Construction s institutional projects include Pleasant Hill Baptist Church, Northside Christian Church, Granger United Methodist Church and Austin Park Dental Office. It also provides casework services, specializing in laminate cabinets, desks and countertops for a variety of needs and specifications. The company collaborates with civil engineers, architects, and mechanical and electrical contractors. Simmons Brothers Construction is located in Medina, Ohio.","Mon - Fri: 8:00 am - 5:00 pm","Phone: (330) 722-1416 Fax: (330) 722-1416",,,,,"https://www.simmonsbrothers.net http://simmonsbrothers.net http://www.simmonsbrothersconstruction.com","Specialties: Structures, Buildings",,,,,,,,
1285528,411088,"2020-09-27 03:10:22","A & S Services Inc",,,"(712) 737-8877","911 Highway 10 W","Orange City",IA,51041,"911 Highway 10 W,Orange City,IA 51041","General Contractors, Air Conditioning Contractors & Systems, Heating Contractors & Specialties, Home Builders, Steel Erectors",,,A+,42.99889,-96.06966,,,,,"Fax: (712) 737-8420",,,,,,,,,,,,,,
1287729,411732,"2020-09-27 03:10:22","Eclipse Burners",http://lindbergprocess.com,jesse@lindbergprocess.com,"(952) 881-7734","2222 W 94th St",Minneapolis,MN,55431,"2222 W 94th St,Minneapolis,MN 55431","Heating Contractors & Specialties, Air Conditioning Contractors & Systems, Air Conditioning Equipment & Systems, Air Conditioning Service & Repair, Building Contractors, Fireplace Equipment, Fireplaces, Gas Burners, Heating Equipment & Systems, Metal Tanks, Metal Tubing, Steel Erectors, Steel Processing",,,,44.83361,-93.30731,,,"Eclipse Burners offers a comprehensive range burners, recuperators, heat exchangers, and fully engineered combustion systems for industrial heating processes that deliver safe, reliable, efficient, and clean heat. Contact us today for more information!","Mon - Sun: Open 24 Hours",,,visa,,,http://lindbergprocess.com,,,,,,,,,
1287871,411772,"2020-09-27 03:10:22","Arctic Engineering Co., Inc.",http://arcticengineering.com,,"(219) 400-0027","8410 Minnesota St",Merrillville,IN,46410,"8410 Minnesota St,Merrillville,IN 46410","Heating, Ventilating & Air Conditioning Engineers, Air Conditioning Contractors & Systems, Air Conditioning Equipment & Systems, Air Conditioning Service & Repair, Building Contractors, Building Contractors-Commercial & Industrial, Construction Engineers, Fireplace Equipment, Fireplaces, Heating Contractors & Specialties, Heating Equipment & Systems, Mechanical Contractors, Metal Tanks, Metal Tubing, Plumbers, Plumbing Contractors-Commercial & Industrial, Professional Engineers, Steel Erectors, Steel Processing",,,,41.46559,-87.30353,,"Accurate Answers & Superior Work.","Arctic Engineering Co. is a mechanical contractor serving the Chicago metro area and Northwest Indiana. Since 1958, we have been a trusted local mechanical contractor that provides durable HVAC and plumbing design solutions, service and installation to commercial and industrial clients. We are capable of supplying you with viable solutions for your heating, cooling, piping, sheet metal and plumbing needs. From new construction to retrofits and upgrades, we are your go-to source for high-quality work! We provide excellent design work, and offer superior regular maintenance. The Arctic Engineering team will support your operations 24-hours per day. We can assist you with all levels of process piping and gas systems, as well as with boilers, A/Cs and temperature controls. Our plumbing team will work with you from design through maintenance and our sheet metal design fabrication and installation is the best! We also provide: HVAC maintenance, Plumbing installation and service,Design engineering,Project engineering,Turnkey HVAC and more. We are dedicated to finding the best solutions for your HVAC and plumbing needs, all the while remaining within your budget. As an employee-owned and operated business, we will always do our best. Whether you need new construction plumbing and HVAC, sheet metal fabrication or regular service and maintenance, we provide you with high-quality work-your satisfaction guaranteed!","Mon - Sun: Open 24 Hours","Fax: (219) 947-4999",,"visa, amex, master card",,,http://arcticengineering.com,"Specialties: Pre-Engineered Buildings, Commercial Grade, Commercial, Heaters, Business, Industrial, Tanks, Pre-Engineered Systems, Building Systems, Air Conditioning Systems, Hot Water Tanks Services: Sheet Metal Work, Septic Tanks",,,,,,,,
1287895,411773,"2020-09-27 03:10:22","Woodchips Construction, Inc.",http://www.woodchipsconstruction.com,woodchips02@gmail.com,"(845) 744-3803",,,,,,"General Contractors, Altering & Remodeling Contractors, Basement Contractors, Building Construction Consultants, Building Contractors, Building Specialties, Carpenters, Construction Management, Deck Builders, Demolition Contractors, Drainage Contractors, Excavation Contractors, Garages-Building & Repairing, Handyman Services, Heating Contractors & Specialties, Home Builders, Kitchen Planning & Remodeling Service, Landscape Designers & Consultants, Real Estate Developers, Roofing Contractors, Siding Contractors, Steel Erectors, Waterproofing Contractors",,,,,,https://i3.ypcdn.com/blob/f8e894def9121ed9181071d60a03270ddcfe40a1_100x100_crop.jpg?63f80dd,,"We are a company that provides construction contractor services in the Pine Bush, NY area and surrounding communities. We are a top rated excavation service provider and offer professional new construction, renovations, and custom home building. Our other specialties are: Spray Foam Insulation Remodeler Contractor We have an extensive background in providing thorough remodeling project planning, total quality management, and above all teamwork with our clients. With this knowledge base we achieve the safe and successful completion of our construction projects. Schedule us today for any type of concrete services, landscaping, and demolition.","Mon - Fri: 8:00 am - 5:00 pm",,,"amex, cash, check, discover, master card, visa",,,http://www.woodchipsconstruction.com/,"Services: Furnace Repair, Basement Remodeling, Handyman, Kitchen Remodeling, Basement Waterproofing, Asphalt Shingle Installation, Vinyl Siding Installation",,,,,,,,
1288368,411902,"2020-09-27 03:10:22","Crown Home Services",,info@fhccares.com,"(509) 443-7224","22425 E Appleway Ave","Liberty Lake",WA,99019,"22425 E Appleway Ave,Liberty Lake,WA 99019","General Contractors, Air Conditioning Contractors & Systems, Building Specialties, Electric Contractors-Commercial & Industrial, Electricians, Heating Contractors & Specialties, Insulation Contractors, Mechanical Contractors, Plumbers, Steel Erectors",,,,47.67367,-117.1044,,,,,,,,,"Crown Home SVC",,,,,,,,,,
1289045,412108,"2020-09-27 03:10:23","ABC Heating & Sheet Metal",http://www.abccarson.com,admin@abccarson.com,"(775) 430-5126","7893 US Highway 50 E","Carson City",NV,89701,"7893 US Highway 50 E,Carson City,NV 89701","Steel Fabricators, Air Conditioning Contractors & Systems, Furnaces-Heating, Gutters & Downspouts, Heating Contractors & Specialties, Heating, Ventilating & Air Conditioning Engineers, Metal-Wholesale & Manufacturers, Rails, Railings & Accessories Stairway, Sheet Metal Fabricators, Sheet Metal Work, Steel Processing, Welders",,,A+,39.20603,-119.68455,,,,"Mon - Fri: 7:00 am - 3:30 pm Sat - Sun Closed",,,"discover, check, mastercard, all major credit cards, amex, visa",,,http://www.abccarson.com,"Parking: Free Wheelchair Accessible: Yes",,,,,,,,
1290470,412508,"2020-09-27 03:10:23","Jacobe Brother Construction LTD",http://www.jacobebros.com,,"(903) 592-5091","700 E Southeast Loop 323",Tyler,TX,75701,"700 E Southeast Loop 323,Tyler,TX 75701","General Contractors, Air Conditioning Contractors & Systems, Altering & Remodeling Contractors, Apartment Finder & Rental Service, Building Construction Consultants, Building Contractors, Building Contractors-Commercial & Industrial, Construction Consultants, Construction Management, Heating Contractors & Specialties, Home Builders, Metal Buildings, Plumbers, Real Estate Developers, Steel Erectors",,,A+,32.30314,-95.2943,,,"Located in Tyler, Texas, Jacobe Brothers Construction offers a range of design and building services. The company has been serving clients since 1946. It provides budget estimation and design consulting services. The company undertakes projects for religious facilities that include churches and church education and family life centers. Jacobe Brothers Construction also constructs commercial and industrial facilities. Its portfolio includes Greenwood Square, Hilard Box Insurance Agency, Kinsey Pharmacy, Trinty Mother Francis Childrens Clinic and University of Texas Art Lab. The company provides online information on church design and construction services. In addition, Jacobe Brothers Construction employs a staff of engineers, designers and support personnel.",,"Phone: (903) 592-5158 Fax: (903) 592-5163 Fax Number: (903) 592-5163",,,,"Jacobe Bros Construction LTD Jacobe Brothers Construction Co. Ltd.",http://www.jacobebros.com,,,,,,,,,
1292537,413077,"2020-09-27 03:10:30","Walter Mork Co. Inc.",http://www.waltermork.com,info@waltermork.com,"(510) 845-0992","2418 6th St",Berkeley,CA,94710,"2418 6th St,Berkeley,CA 94710","Metal-Wholesale & Manufacturers, Air Conditioning Contractors & Systems, Aluminum-Wholesale & Manufacturers, Building Contractors-Commercial & Industrial, Furnace Repair & Cleaning, Furnaces Parts & Supplies, Furnaces-Heating, Heating Contractors & Specialties, Heating Equipment & Systems, Metal Specialties, Sheet Metal Fabricators, Sheet Metal Work, Sheet Metal Work-Manufacturers, Steel Fabricators, Steel Processing, Welders",5,"1 Review",A+,37.86099,-122.29579,,,,"Mon - Fri: 7:30 am - 4:30 pm Sat - Sun Closed",,,"visa, master card",,,"Walter Mork Company's Website",,"Adams O.",05/10/2018,five,"Hello, They was asked to replace a set of louvers that was installed 30 plus years ago and was rusting out. The job was perfect and they were able to match the Louvers to the old ones. I cant be more happy to have chosen them for this Job. Excellent metal work, and the installation went very smooth as well.... Thanks to Mr. . Berkeley and his crew.... Osborne Graduate Theological union",,,,