business_x_category.id,business.id,business.ts,business.business_name,business.home_page,business.email_address,business.phone,business.street,business.city,business.state,business.zip_code,business.full_address,business.category,business.rating,business.number_of_reviews,business.bbb_rating_or_license,business.latitude,business.longitude,business.cover_image,business.slogan,business.general_info,business.regular_hours,business.extra_phones,business.services_products,business.payment,business.price_range,business.aka,business.other_links,business.other_information,business.review_1_name,business.review_1_date,business.review_1_rating,business.review_1_text,business.review_2_name,business.review_2_date,business.review_2_rating,business.review_2_text
21356553,3392294,"2020-09-27 08:03:41","High Desert Museum",http://www.highdesertmuseum.org,forestrogers@highdesert.org,"(541) 382-4754","59800 S Highway 97",Bend,OR,97702,"59800 S Highway 97,Bend,OR 97702","Museums, Convention Services & Facilities, Gift Shops, Historical Places, Places Of Interest, Tourist Information & Attractions",5,"1 Review",,43.96765,-121.3421,,,"The museum, set on 135 acres of pine forest, has something for everyone. Explore the nature, culture and spirit of the High Desert through fun, interactive, indoor and outdoor exhibits. Encounter live animals, interact with living history characters at the Miller Ranch, visit the 1904 sawmill. See what life was like for pioneers, enjoy Western art and an extensive Native American collection. Special programs and events for all ages.","Mon - Sun: 10:00 am - 4:00 pm","Fax: (541) 382-5256 Fax Number: (541) 382-5256",,"cash, check, all major credit cards, debit, amex, discover, master card, visa, paypal",,"The High Desert Museum High Desert Museum Cafe","http://www.highdesertmuseum.org https://highdesertmuseum.org https://www.facebook.com/highdesertmuseum","Parking: Lot, Private Bike Parking: Yes","Jessica W.",12/15/2016,five,"Most excellent museum to visit! The museum and all of the trails are the best to explore. My kids loved exploring there while we were there camping.",,,,
21359414,3393249,"2020-09-27 08:03:42","Rose Island Light House Foundation",http://www.roseisland.org,,"(401) 847-4242","365 Thames St",Newport,RI,02840,"365 Thames St,Newport,RI 02840","Museums, Gift Shops, Historical Places, Places Of Interest, Tours-Operators & Promoters",,,,41.48349,-71.31471,https://i4.ypcdn.com/blob/c42e85e9d003ae47a4f327585c5bedc87da45030_100x100_crop.jpg?41e4770,,"Rose Island Lighthouse is located on the New England coast in Newport, Rhode Island. Built in 1869, it now serves as a is a working lighthouse just minutes away from the quaint colonial town of Newport Rose Island Light is once again listed on today&#39.s charts as a private aid to navigation. It is one of only a few operating lighthouses maintained by working vacationers who sign on for a week at a time as part of our environmental education program. The Lighthouse is also listed in the National Register of Historic Places. For further information please visit our website.","Mon - Fri: 9:00 am - 1:00 pm",,,"all major credit cards, debit, cash",,,http://www.roseisland.org,,,,,,,,,
21360369,3393595,"2020-09-27 08:03:42","Historic Bethlehem Visitor Ctr",http://www.discoverlehighvalley.com,,"(610) 691-6055","505 Main St",Bethlehem,PA,18018,"505 Main St,Bethlehem,PA 18018","Tourist Information & Attractions, Convention Services & Facilities, Gift Shops, Historical Places, Museums, Places Of Interest, Sightseeing Tours, Tours-Operators & Promoters",,,,40.62083,-75.38239,,,"The Historic Bethlehem Visitor Center and Museum Store is your one stop shop and information center for everything you need to know about Historic Bethlehem! Purchase tickets to all Historic Bethlehem tours, pick up maps of the city to find your way around, get advice on where to have lunch and purchase beautiful souvenirs to remember your trip!","Wed - Sat: 10:00 am - 5:00 pm Sun: 11:00 am - 4:00 pm","Phone: (610) 691-5448 TollFree: (800) 360-8687 Toll Free: (800) 360-8687",,"discover, paypal, check, amex, master card, visa",,"Historic Bethlehem Welcome Ctr Historic Bethlehem Vistor Center Historic Bethlehem Museums-STS Historic Bethlehem Visitor Center Historic Bethlehem River Tours","http://www.discoverlehighvalley.com https://www.hillcrestflynn.com",,,,,,,,,
21362344,3394258,"2020-09-27 08:03:49","Kentucky Gateway Museum Center",http://www.kygmc.org,masonmuseum@maysvilleky.net,"(606) 564-5865","215 Sutton St",Maysville,KY,41056,"215 Sutton St,Maysville,KY 41056","Museums, Gift Shops, Historical Places, Library Research & Service",,,,38.64826,-83.7667,https://i4.ypcdn.com/blob/ab49b828120c5b0d9cbbff8729fd836597cb3dad_100x100_crop.jpg?41e4770,,"Kentucky Gateway Museum Center: Three Historic Collections in One Dynamic Place!Explorers. Movie Stars. Artists. Pioneers. Slaves. Everyone who ever passed through this part of Kentucky or called it home left a story behind. Some are stories of courage and great achievement, others of love and everyday survival. The more we explore those struggles and dreams, the more we understand our own. Now, by showcasing three dynamic collections in one place, the Kentucky Gateway Museum Center brings all the stories of the region into fascinating focus: Our Genealogical and Historical Research Library, sheds light on the people and events of a seven-county area through an extensive collection of books, manuscripts and documents from colonial times. Our Regional History Museum illuminates the past through award-winning dioramas, more than 4,000 regional artifacts and a gallery of fine art related to the area. Our KSB Miniatures Collection looks at the world from a new perspective through mesmerizing, 1/12-scale reproductions of homes, furnishings, clothing, artwork and people. And our Changing Exhibits Gallery that has been host to award-winning traveling exhibits such as the ""The World We Create"", ""Children Just Like Me"", ""The Cabaret Mechanical Theatre"", ""Brain Teasers"", ""Everybody Eats"", ""Herblock"" and many others. Step outside the Center, and you'll discover that Maysville's stately architecture has more than a few great tales to tell, as does the pioneer graveyard located behind the Center. Before tomorrow becomes yesterday, we invite you to get the whole story at the Kentucky Gateway Museum Center!","Mon Closed Tue - Sat: 10:00 am - 4:00 pm Sun Closed","Phone: (606) 564-4372 Fax: (606) 564-4372 Fax Number: (606) 564-4372",,"visa, debit, amex, mastercard, all major credit cards, check, discover",,"Kentucky Gateway Museum Ctr","http://www.kygmc.org http://kentuckygatewaymuseumcenter.org https://www.kygmc.org http://masoncountymuseum.org","Wheelchair Accessible: Yes Specialties: Fund-Raisers",,,,,,,,
21363859,3394774,"2020-09-27 08:03:49","Glensheen, The Historic Congdon Estate",,info@glensheen.org,"(218) 726-8910","3300 London Rd",Duluth,MN,55804,"3300 London Rd,Duluth,MN 55804","Historical Places, Gift Shops, Meeting & Event Planning Services, Museums, Retreat Facilities, Tourist Information & Attractions, Wedding Reception Locations & Services",5,"3 Reviews",,46.81518,-92.05175,,,"Glensheen Historic Estate is 5 mi. n. on SR 61 at 3300 London Rd. This was the 1908 estate of attorney, mining entrepreneur and state legislator Chester A. Congdon. The 7.7-acre property on Lake Superior includes formal gardens and a Jacobean mansion containing original furnishings. Carriages and sleighs are displayed in the carriage house. Visitors also can take an expanded tour of all five floors that covers an additional six bedrooms and provides background about the house's construction.","Mon - Sun: 9:00 am - 4:00 pm","Phone: (218) 726-8911 Fax: (218) 726-8911 TollFree: (888) 454-4536",,"discover, master card, travelers checks, visa, cash",,"Glensheen-Historic Estate Glensheen-The Historic Congdon Estate At University Of MN",,"Parking: Lot",stephpeterson,05/20/2003,five,"We went for our school feild trip and it was the most awesome thing that I ever saw!!! It is so beautiful!!! But you should read the book about the murders before you go so during the tour you know which rooms and which steps that they were murdered in!!! It was awesome!! I would go again and again and again!!!!!!!! Please visit and find out for yourself!!!",gw17,10/19/2002,five,"Beauty, history and a wonderful place to visit for all."
21366988,3395832,"2020-09-27 08:03:53","Bonniebrook Home & Museum",http://www.roseoneill.org,oneillmuseum@aol.com,"(417) 561-1509","485 Rose Oneil Rd","Walnut Shade",MO,65771,"485 Rose Oneil Rd,Walnut Shade,MO 65771","Museums, Gift Shops, Historical Places, Places Of Interest, Tourist Information & Attractions",,,A+,36.76723,-93.22063,,,,"Tue - Sat: 9:00 am - 4:00 pm","TollFree: (877) 242-8133 Toll Free: (800) 539-7437 TollFree: (800) 539-7437",,"discover, paypal",,"The Bonniebrook Gallery and Museum Bonnie Brook Historical Society Bonniebrook Home & Kewpie Museum Bonniebrook Historical Society and Kewpie Museum","http://www.roseoneill.org http://www.roseoneill.org/mainpage.html",,,,,,,,,
21367535,3396011,"2020-09-27 08:04:01","Five Civilized Tribes Museum and Center",http://www.fivetribes.org,,"(918) 683-1701","1101 Honor Heights Dr",Muskogee,OK,74401,"1101 Honor Heights Dr,Muskogee,OK 74401","Museums, Art Galleries, Dealers & Consultants, Gift Shops, Historical Places, Places Of Interest, Tourist Information & Attractions",,,,35.76568,-95.414,,,,"Mon - Fri: 10:00 am - 5:00 pm Sat: 10:00 am - 2:00 pm Sun Closed",,,,,,http://www.fivetribes.org,"Specialties: Museums",,,,,,,,
21369005,3396517,"2020-09-27 08:04:01","Conrad Mansion",http://www.conradmansion.com,info@conradmansion.com,"(406) 755-2166","330 Woodland Ave",Kalispell,MT,59901,"330 Woodland Ave,Kalispell,MT 59901","Museums, Cultural Centers, Gift Shops, Historical Places, Places Of Interest, Tourist Information & Attractions, Wedding Chapels & Ceremonies",5,"1 Review",,48.19696,-114.30319,,,"The Conrad Mansion Museum is located in Kalispell's east side residential area atop a bluff overlooking the valley and the Swan mountain range. The home sits on three landscaped acres,surrounded by a dry stone fence with iron gates. Six large annual flower beds and extensive ever-blooming perennial beds provide constant color during the summer season, with pruned hedges, evergreens, and spacious lawns serving as a lush background. MISSION To preserve and exhibit the 1895 Charles Conrad Family Estate through public tours, educational programs, and community events.","Tue - Sun: 10:00 am - 4:00 pm","Phone: (406) 755-2176 Fax Number: (406) 755-2176 Fax: (406) 755-2176",,"master card, visa, paypal, cash, check",,"Conrad Mansion Museum Conrad Mansion Directors, Inc.","http://www.conradmansion.com https://www.conradmansion.com","Parking: Street Specialties: Marriage Ceremonies, Wedding Day, Wedding Ceremonies",hikergirl,07/13/2010,five,"If you're in town, you should take a tour of this mansion museum. The huge number of original artifacts is unique in Montana -- maybe the U.S.! The gardens are beautiful in summer (the site is available for weddings), and the mansion itself is a fascinating mix of luxury and practical living. Great tour!",,,,
21370378,3396959,"2020-09-27 08:04:01","The National Shrine Of St. Dymphna",https://www.natlshrinestdymphna.org/index.php,father_gretchko@natlshrinestdymphna.org,"(330) 833-8478","206 Cherry Rd NE",Massillon,OH,44646,"206 Cherry Rd NE,Massillon,OH 44646","Gift Shops, Catholic Churches, Collectibles, Historical Places, Places Of Interest, Religious Goods, Tourist Information & Attractions",,,,40.80193,-81.52236,,,,"Mon - Fri: 9:00 am - 5:00 pm",,,"visa, master card, amex, discover",,,https://www.natlshrinestdymphna.org/index.php,,,,,,,,,
21371208,3397229,"2020-09-27 08:04:08","Creek Street",http://www.fishcreekalaska.com,hamilton@fishcreekalaska.com,"(907) 617-0867","1a Creek St",Ketchikan,AK,99901,"1a Creek St,Ketchikan,AK 99901","Historical Places, Gift Shops, Historical Monuments, Places Of Interest, Tourist Information & Attractions",,,,55.34278,-131.64297,,,"Once a red-light district, now an arts and crafts shopping area.","Mon - Sat: 9:00 am - 6:00 pm Sun: 9:00 am - 5:00 pm",,,,,,http://www.fishcreekalaska.com,,,,,,,,,
21374986,3398512,"2020-09-27 08:04:14","Tee Pee Curios",,teepeecurios@gmail.com,"(575) 461-3773","924 E Route 66 Blvd",Tucumcari,NM,88401,"924 E Route 66 Blvd,Tucumcari,NM 88401","Historical Places, Gift Shops, Historical Monuments, Places Of Interest, Tourist Information & Attractions",,,,35.1717,-103.71594,,,,"Mon - Sat: 8:00 am - 8:00 pm","Primary Phone: (575) 461-9724 Phone: (575) 461-9724",,"discover, amex",,,,"Parking: Lot Bike Parking: Yes",,,,,,,,
21378761,3399797,"2020-09-27 08:04:19","Leanin' Tree Museum and Sculpture Garden of Western Art",,danielle.vorthmann@leanintree.com,"(303) 729-3412","6055 Longbow Dr",Boulder,CO,80301,"6055 Longbow Dr,Boulder,CO 80301","Museums, Gift Shops, Historical Places",,,,40.06497,-105.21289,https://i4.ypcdn.com/blob/cea7a33967554695dde522b83bef18b609f2c9fb_100x100_crop.jpg?41e4770,,"The LeaninВ’ Tree Museum of Western Art in Boulder, Colorado, exhibits the private art collection of Ed Trumble, Founder and Chairman of LeaninВ’ Tree, publisher of fine art greeting cards since 1949. His collection was born of a passion for American western art that has spanned seven decades.","Mon - Fri: 8:00 am - 6:00 pm Sat: 9:00 am - 5:00 pm Sun: 10:00 am - 5:00 pm New Year's Day 2020/01/01 Closed Memorial Day 2020/05/25 Closed Thanksgiving Day 2020/11/26 Closed Labor Day 2020/09/07 Closed Independence Day 2020/07/04 Closed Christmas Day 2020/12/25 Closed",,,,,,,"Parking: Lot",,,,,,,,
21381842,3400907,"2020-09-27 08:04:20","Winchester Mystery House",http://www.winchestermysteryhouse.com,customerservice@winchestermysteryhouse.com,"(408) 247-2101","525 S Winchester Blvd","San Jose",CA,95128,"525 S Winchester Blvd,San Jose,CA 95128","Historical Places, Gift Shops, Historical Monuments, Museums, Places Of Interest, Tourist Information & Attractions",4,"12 Reviews",,37.31832,-121.95093,https://i3.ypcdn.com/blob/dd44e010e3a3dc2a9d11ff7838fbfa2109d5e054_100x100_crop.jpg?d9a04b5,,"The Winchester Mystery House is the beautiful but bizarre mansion of Sarah Winchester, heiress of the Winchester Repeating Arms fortune. Construction began in 1884, and didn't stop for 38 years. Haunted by the spirits of Winchester rifle victims, Mrs. Winchester built the Victorian mansion with many odd and mysterious features. The Winchester Mystery House is an architectural wonder and historic landmark in San Jose, CA. Daily guided tours are available at the estate.","Mon - Sun: Open 24 Hours",,,"no credit cards, amex, cash, discover, master card, visa",,,"http://www.winchestermysteryhouse.com https://winchestermysteryhouse.com","Parking: Lot","Jessica C.","Edited: 10/26/2016",three,"Finally took the kids to see they Winchester Mystery House. I was excited to find discounted tickets through Groupon. We chose the Mansion Tour since we had kids and the length of the other tours seemed a bit too long for them. The house is really cool. So many strange things to see. Was bummed that they keep you from seeing so many parts of the house. Many are roped off or are part of a different tour. The say you tour 110 of the 160 rooms, but many of those rooms you just pass by. They just announced that they ""found"" a new room, but don't be fooled....it is a marketing ploy. They built a shooting range game and call it Sarah's attic. There is not really a newly discovered room at the mystery house.","Donna C.",08/10/2015,five,"Great tour, very interesting and our tour guide was great."
21382163,3401018,"2020-09-27 08:04:23","Lyme Village-Historic",http://www.lymevillage.com,info@lymevillage.org,"(419) 483-4949","5001 State Route 4",Bellevue,OH,44811,"5001 State Route 4,Bellevue,OH 44811","Historical Places, Gift Shops, Museums, Places Of Interest, Tourist Information & Attractions",,,A+,41.27981,-82.78823,,,,"Tue - Sat: 10:00 am - 4:00 pm Sun: 12:00 pm - 4:00 pm",,,check,,"Historic Lyme Village","http://www.lymevillage.com http://lymevillage.org","Parking: Lot",,,,,,,,
21382204,3401032,"2020-09-27 08:04:23","Woodruff-Fontaine House Museum",http://www.woodruff-fontaine.com,,"(901) 526-1469","680 Adams Ave",Memphis,TN,38105,"680 Adams Ave,Memphis,TN 38105","Museums, Gift Shops, Historical Monuments, Historical Places, Places Of Interest, Tourist Information & Attractions",,,,35.14479,-90.0375,,,"An elegant, 16-room mansion built in 1870 and featuring period furnishings and mannequins displaying the fashions of the era.","Mon - Tue Closed Wed - Sun: 10:00 am - 4:00 pm","Phone: (901) 525-2695 Fax: (901) 525-2695",,"mastercard, discover, amex, visa",,,http://www.woodruff-fontaine.com,"Parking: Lot",,,,,,,,
21384447,3401748,"2020-09-27 08:04:23","Bellamy Mansion Museum",http://www.bellamymansion.org,info@bellamymansion.org,"(910) 251-3700","503 Market St",Wilmington,NC,28401,"503 Market St,Wilmington,NC 28401","Museums, Gift Shops, Historical Places, Meeting & Event Planning Services, Places Of Interest, Tourist Information & Attractions, Wedding Reception Locations & Services",,,,34.23614,-77.94299,,,"Bellamy Mansion Museum of History and Design Arts, is a restored antebellum mansion showcasing social history and several architectural styles. A presentation provides background information about the site and former inhabitants. Points of interest on a guided or self-guiding audio tour include rare, restored urban slave quarters. Changing exhibits also are featured. Guided tours are available","Tue - Sat: 10:00 am - 5:00 pm Sun: 1:00 pm - 5:00 pm",,,"cash, amex, discover, visa, mastercard",,,"http://www.bellamymansion.org Admission prices","Parking: Lot",,,,,,,,
21386025,3402275,"2020-09-27 08:04:26","Dinosaur Land",http://dinosaurland.com,,"(540) 869-2222","3848 Stonewall Jackson Hwy","White Post",VA,22663,"3848 Stonewall Jackson Hwy,White Post,VA 22663","Theme Parks, Amusement Places & Arcades, Gift Shops, Historical Places, Parks, Places Of Interest, Tourist Information & Attractions",5,"2 Reviews",,39.05851,-78.13995,,,"A special interest site that features a collection of almost life-sized dinosaurs, including a 70-foot octopus!","Mon - Wed: 9:30 am - 5:00 pm Thu Closed Fri - Sun: 9:30 am - 5:00 pm",,,discover,,,http://dinosaurland.com,"Parking: Lot Specialties: Birthdays, Parties","Steven H.",04/12/2016,five,"Best amusement park! Come visit this place! I'm sure that I will visit it again too in the very near future.","Trista C.",03/12/2013,five,
21387068,3402620,"2020-09-27 08:04:26","Jupiter Inlet Lighthouse & Museum",http://www.jupiterlighthouse.org,visit@jupiterlighthouse.org,"(561) 747-8380","500 Captain Armours Way",Jupiter,FL,33469,"500 Captain Armours Way,Jupiter,FL 33469","Museums, Gift Shops, Historical Monuments, Historical Places, Places Of Interest, Tourist Information & Attractions",,,,26.94831,-80.08447,,,"Jupiter Inlet Lighthouse and Museum offers climbing tours of the landmark 1860 Jupiter Light and exhibits in the waterfront History Museum located in the restored WWII Naval housing quarters building. Outdoor exhibits include the Lighthouse Keeper's Workshop, Tindall Pioneer Homestead & Seminole Chickee.","Mon - Sun: 10:00 am - 5:00 pm","Phone: (561) 747-8386 Fax: (561) 575-3292 TollFree: (800) 435-7352",,,,"Jupiter Inlet Lighthouse Store Jupiter Inlet Lighthouse And Museum Jupiter Inlet Lighthouse & Msm","http://www.jupiterlighthouse.org https://www.jupiterlighthouse.org","Parking: Lot",,,,,,,,
21387864,3402896,"2020-09-27 08:04:26","Vulcan Park and Museum",http://www.visitvulcan.com,info@visitvulcan.com,"(205) 933-1409","1701 Valley View Dr",Birmingham,AL,35209,"1701 Valley View Dr,Birmingham,AL 35209","Museums, Gift Shops, Historical Monuments, Historical Places, Meeting & Event Planning Services, Places Of Interest, Tourist Information & Attractions, Wedding Chapels & Ceremonies, Wedding Reception Locations & Services","4,5","3 Reviews",,33.48963,-86.79805,https://i4.ypcdn.com/blob/ef69a0473b17fa74126ee6922a668619ec1d6375_100x100_crop.jpg?41e4770,"Legends arenВ’t born, theyВ’re forged.","Vulcan, Birmingham AlabamaВ’s colossal statue is the worldВ’s largest cast iron statue and considered one of the most memorable works of civic art in the United States. Designed by Italian artist Giuseppe Moretti and cast from local iron in 1904, Vulcan has overlooked AlabamaВ’s largest city from atop Red Mountain since the 1930s. By 1999, the 50-ton statue was in desperate need of repair. The surrounding 10-acre park was closed. Vulcan was removed from his pedestal. Realizing VulcanВ’s importance to the regionВ’s history, city leaders sought public support for its restoration, forming the non-profit Vulcan Park Foundation. The foundation would oversee a master plan to return this colossal statue to his 1904 grandeur. They also created a dynamic educational park complex interpreting AlabamaВ’s rich industrial history for both residents and visitors from across the globe. Today, thanks to public-private partnerships and a $15.5 million campaign, this beloved symbol of Birmingham and the nationВ’s iron and steel industry stands preserved and proud as the centerpiece of it rehabilitated and expanded park, now referred to as Vulcan Park and Museum. Meet Vulcan and learn the fascinating history that makes him so significant to Birmingham!","Mon - Sat: 10:00 am - 6:00 pm Sun: 12:00 pm - 6:00 pm",,,"cash, discover, amex, master card, visa",,,"http://www.visitvulcan.com http://visitvulcan.com/visit/virtual-tour","Parking: Lot, Private Bike Parking: Yes","Bryan M.",07/27/2017,five,"Loved it everything is just beautifully designed and built. The Exhibits in the Museum tell the story and each history is amazing.","Aftab J.",05/01/2011,five,"The most peaceful and relaxing place in town which gives you panaromic view of the city."
21390167,3403685,"2020-09-27 08:04:37","Marston House",http://www.sandiegomuseumcouncil.org/directory/item/38-maritime-museum,saveourheritagesd@gmail.com,"(619) 298-3142","3525 7th Ave","San Diego",CA,92103,"3525 7th Ave,San Diego,CA 92103","Museums, Gift Shops, Historical Places, Places Of Interest, Tourist Information & Attractions",,,,32.74148,-117.15759,https://i3.ypcdn.com/blob/541caa7b265f0b7b43afdc7e350291ebd1a8fa57_100x100_crop.jpg?d9a04b5,,"An example of Craftsman-style architecture, Marston House has an ample display of various styles of furniture.","Mon: 10:00 am - 5:00 pm Thu - Sun: 10:00 am - 5:00 pm","Phone: (619) 297-9327",,"all major credit cards",,"Marston House Museum Marston House Museum & Gardens","http://www.sandiegomuseumcouncil.org/directory/item/38-maritime-museum http://www.sohosandiego.org/main/marston2.htm http://www.marstonhouse.org","Parking: Street Bike Parking: Yes Price Range : Below Average By Appointment Only: No",,,,,,,,
21390480,3403790,"2020-09-27 08:04:37","Ness County Bank Building",http://nesscountychamber.com,,"(785) 798-3337",,"Ness City",KS,67560,"Ness City,KS 67560","Historical Places, Gift Shops, Tourist Information & Attractions",,,,,,,,,,,,,,,http://nesscountychamber.com,,,,,,,,,