business_x_category.id,business.id,business.ts,business.business_name,business.home_page,business.email_address,business.phone,business.street,business.city,business.state,business.zip_code,business.full_address,business.category,business.rating,business.number_of_reviews,business.bbb_rating_or_license,business.latitude,business.longitude,business.cover_image,business.slogan,business.general_info,business.regular_hours,business.extra_phones,business.services_products,business.payment,business.price_range,business.aka,business.other_links,business.other_information,business.review_1_name,business.review_1_date,business.review_1_rating,business.review_1_text,business.review_2_name,business.review_2_date,business.review_2_rating,business.review_2_text
1732239,519533,"2020-09-27 03:21:54","Windstream Water Utilities",http://windstreamutilities.com,windstreamwater@embarqmail.com,"(833) 492-4117","3002 NW 10th St",Ocala,FL,34475,"3002 NW 10th St,Ocala,FL 34475","Water Utility Companies, Irrigation Systems & Equipment, Utility Companies, Utility Contractors, Water Supply Systems",,,,29.19676,-82.17352,,,,"Mon - Fri: 8:00 am - 4:00 pm Sat - Sun Closed","Primary Phone: (352) 620-8290 Phone: (352) 620-8290",,"mastercard, visa, check, all major credit cards, debit",,"Windstream Utilities Co",http://windstreamutilities.com,"Wheelchair Accessible: Yes",,,,,,,,
1733741,519906,"2020-09-27 03:21:55","Maupin's Well-Drilling",http://www.maupinswelldrilling.com,info@maupinswelldrilling.com,"(757) 621-0396","1805 N Streamline Dr","Virginia Beach",VA,23454,"1805 N Streamline Dr,Virginia Beach,VA 23454","Utility Companies, Building Contractors, Building Specialties, Drilling & Boring Contractors, Farm Equipment, Farm Equipment Parts & Repair, Gas Companies, Glass Bending, Drilling, Grinding, Etc, Irrigation Systems & Equipment, Nursery & Growers Equipment & Supplies, Oil Field Equipment, Oil Well Drilling, Oil Well Drilling Mud & Additives, Oil Well Services, Plumbing Fixtures, Parts & Supplies, Pumping Contractors, Pumps, Pumps-Renting, Pumps-Service & Repair, Water Well Drilling & Pump Contractors, Water Well Drilling Equipment & Supplies, Water Well Locating",,,,36.83965,-76.02744,https://i1.ypcdn.com/blob/4a0cb955bf4b93f0ac6f45de3680557e1f04f55e_100x100_crop.jpg?f832250,"Specialized in Submersible Pumps. Call Today For Estimate. Emergency Service Available.","When you need quality services from a drilling company you can trust, choose Maupin's Well-Drilling in Virginia Beach, Virginia. We have specialized in commercial and residential wells and submersible pumps for more than 10 years, and our knowledgeable technicians install all well systems.","Mon - Sat: 8:00 am - 7:00 pm Sun Closed",,,"cash, check",,,"http://www.maupinswelldrilling.com https://www.maupinswelldrilling.com",,,,,,,,,
1733986,519974,"2020-09-27 03:21:55","Turfbuilders Irrigation Inc",http://turfbuildersirrigation.com,contact_us@turfbuildersirrigation.com,"(402) 819-3871","11364 S 147th St",Omaha,NE,68138,"11364 S 147th St,Omaha,NE 68138","Irrigation Systems & Equipment, Awnings & Canopies, Building Contractors, Drilling & Boring Contractors, Fence Repair, Furniture Stores, Gardeners, Gas Companies, Glass Bending, Drilling, Grinding, Etc, Landscape Contractors, Landscaping & Lawn Services, Lawn & Garden Equipment & Supplies, Lawn Maintenance, Nursery & Growers Equipment & Supplies, Patio & Outdoor Furniture, Screen Enclosures, Sprinklers-Garden & Lawn, Swimming Pool Covers & Enclosures, Utility Companies, Water Well Drilling & Pump Contractors",,,A+,41.14496,-96.1458,,,"Turfbuilders Irrigation, Inc. is located in Omaha, Nebraska. Turfbuilders Irrigation, Inc. has been in business for 30 years and has over 85 years of combined experience. We specialize in more than just lawn sprinkler systems, check out the services link on our website for more information on how we can help you! Our services include but are not limited to: В• Commercial sprinkler installation В• Residential sprinkler installation В• Winter blow-outs В• Sprinkler adjustments В• Move sprinkler heads В• Fence cuts We want you to know that if you decide on Turfbuilders Irrigation, Inc. you are in good hands. We service all brands Contact us today for a free estimate on your new sprinkler installation!","Mon - Fri: 8:00 am - 5:00 pm Sat - Sun Closed",,,"visa, master card",,,http://turfbuildersirrigation.com,"Specialties: Commercial, Business, Residential, Homebuilding, Custom Construction, Custom Built",,,,,,,,
1734525,520119,"2020-09-27 03:22:04","Houston River Water Works",https://www.houstonriverwaterworks.com,,"(337) 528-3446","745 W Jim Pickens Rd",Sulphur,LA,70663,"745 W Jim Pickens Rd,Sulphur,LA 70663","Water Utility Companies, Irrigation Systems & Equipment, Utility Companies, Water Supply Systems",5,"1 Review",,30.27056,-93.37925,,,,"Mon - Fri: 7:45 am - 4:00 pm","TollFree: (888) 642-2981",,,,,"https://www.houstonriverwaterworks.com http://houstonriverwaterworks.com",,pago,09/20/2012,five,"I need a email adress and usely been very close then kicked me off",,,,
1735176,520302,"2020-09-27 03:22:04","Rogue Valley Well Drilling",http://www.roguevalleydrilling.com,coffman4980@yahoo.com,"(541) 776-7944","3626 Catalpa Dr","White City",OR,97503,"3626 Catalpa Dr,White City,OR 97503","Utility Companies, Building Contractors, Drilling & Boring Contractors, Gas Companies, Glass Bending, Drilling, Grinding, Etc, Irrigation Systems & Equipment, Nursery & Growers Equipment & Supplies, Oil Field Equipment, Oil Well Drilling, Oil Well Drilling Mud & Additives, Oil Well Services, Water Well Drilling & Pump Contractors, Water Well Drilling Equipment & Supplies",,,A+,42.53186,-122.88601,https://i1.ypcdn.com/blob/ba2f44ebadcd6e3ba3d6543853a2498e92f250c7_100x100_crop.jpg?f832250,"A well-drilling family since 1896. Loyalty & integrity.","Get More Water With Less Depth. Strictly Cable Tool Drilling. Water Dousing Available. We Specialize in Hard To Get Places Such As Sam's Valley, Old Military, Foot Hills Rd, Dark Hallow and Griffin Park. Cable Tool Drilling Fractures and Opens the Water Veins To Get You More Water. In the Rogue Valley Since 1947. Licensed, Bonded and Insured #1705","M-Sa 24hr, Su Closed",,,check,,,http://www.roguevalleydrilling.com,,,,,,,,,
1735334,520351,"2020-09-27 03:22:04","PA American Water Company",,,"(724) 663-4443","3 School St",Claysville,PA,15323,"3 School St,Claysville,PA 15323","Water Utility Companies, Irrigation Systems & Equipment, Utility Companies, Water Dealers, Water Supply Systems",,,,40.11862,-80.41526,,,,,"Phone: (724) 746-6400",,,,,,,,,,,,,,
1738703,521225,"2020-09-27 03:22:08","Bolinas Community Public Utility Dist",http://bcpud.org,bcpud@bcpud.org,"(415) 868-1224","PO Box 390",Bolinas,CA,94924,"PO Box 390,Bolinas,CA 94924","Water Utility Companies, Irrigation Systems & Equipment, Utility Companies, Water Supply Systems",,,,37.907875,-122.69466,,,,,,,,,,http://bcpud.org,,,,,,,,,
1738922,521294,"2020-09-27 03:22:08","Kokomo Shiloh Water System",,,"(601) 736-0658","Old Hwy 24 W",Columbia,MS,39429,"Old Hwy 24 W,Columbia,MS 39429","Water Utility Companies, Irrigation Systems & Equipment, Utility Companies, Water Supply Systems",,,,31.196478,-89.984665,,,,,,,,,,,,,,,,,,,
1739909,521573,"2020-09-27 03:22:08","Jeff Sheppard Well Drilling",,jshepp@embarqmail.com,"(352) 282-0044","2550 NE 102nd Ln",Anthony,FL,32617,"2550 NE 102nd Ln,Anthony,FL 32617","Water Well Drilling & Pump Contractors, Building Contractors, Drilling & Boring Contractors, Gas Companies, Glass Bending, Drilling, Grinding, Etc, Irrigation Systems & Equipment, Nursery & Growers Equipment & Supplies, Oil Field Equipment, Oil Well Drilling, Oil Well Drilling Mud & Additives, Oil Well Services, Utility Companies, Water Filtration & Purification Equipment, Water Well Drilling Equipment & Supplies",,,,29.2984,-82.10233,,"Water well drilling & pump repairs.","Jeff Sheppard Well Drilling serves the Ocala-Marion area. For more than 15 years, our certified and insured well drilling company has provided expert drilling, pumping and water purification services to irrigation and residential wells. Whether you are a residential or commercial customer, our well digging and pump installation service will provide you and your property with a lasting and self-sustaining water supply. Our specialties include: 4"" wells Submersible pump repair Water well drilling Cable tool drilling Alongside our sales and installation, we also provide our customers with premium pump repair and service. For the finest in drilling and fresh water, contact Jeff Sheppard Well Drilling today! Call to schedule your appointment!","Mon - Fri: 8:00 am - 5:00 pm",,,"cash, check",,,,,,,,,,,,
1740699,521774,"2020-09-27 03:22:08","Gainous Well Drilling",https://www.gainouswelldrilling.com/services.html,gainouswelldrilling@gmail.com,"(229) 377-7883","1714 Ga Highway 112 N",Cairo,GA,39827,"1714 Ga Highway 112 N,Cairo,GA 39827","Utility Companies, Construction & Building Equipment, Drilling & Boring Contractors, Drilling & Boring Equipment & Supplies, Gas Companies, Glass Bending, Drilling, Grinding, Etc, Inspection Service, Irrigation Systems & Equipment, Nursery & Growers Equipment & Supplies, Oil Field Equipment, Oil Well Drilling, Oil Well Drilling Mud & Additives, Oil Well Services, Pumping Contractors, Pumps, Pumps-Service & Repair, Water Well Drilling & Pump Contractors, Water Well Drilling Equipment & Supplies",,,,30.95074,-84.24727,https://i3.ypcdn.com/blob/44bb7006a103ec530d543277e4f637ee351c69fb_100x100_crop.jpg?f832250,"We Go Deep for the Water You Deserve","Licensed and Bonded In Georgia And Florida Lic 200. All Work Guaranteed, Over 40 Years Experience! Free Estimates. Irrigation & Domestic Well. Well Drilling & Pump Sales & Service. Deep Wells from 4 to 12 inches. All work guaranteed. Call Dustin & Mike Gainous for all of your well drilling needs!!","Mon - Fri: 9:00 am - 5:00 pm Sat - Sun Closed",,,cash,,,https://www.gainouswelldrilling.com/services.html,,,,,,,,,
1741102,521873,"2020-09-27 03:22:08","Irrigation Technology & Control",https://www.facebook.com/pages/irrigation-technology-control-inc/168205896524364,julie@irrigationtech.net,"(509) 886-4100","4956 Contractors Dr","East Wenatchee",WA,98802,"4956 Contractors Dr,East Wenatchee,WA 98802","Utility Companies, Building Contractors, Building Specialties, Construction & Building Equipment, Crane Service, Cranes, Drilling & Boring Contractors, Electricians, Gas Companies, Glass Bending, Drilling, Grinding, Etc, Irrigation Systems & Equipment, Oil Field Equipment, Oil Well Drilling, Oil Well Drilling Mud & Additives, Oil Well Services, Plumbing Fixtures, Parts & Supplies, Pumping Contractors, Pumps, Pumps-Renting, Pumps-Service & Repair, Sump Pumps, Water Well Drilling & Pump Contractors, Water Well Drilling Equipment & Supplies, Water Well Plugging & Abandonment Service",,,A+,47.49904,-120.29645,,,,"Mon - Fri: 8:00 am - 5:00 pm","Phone: (509) 670-1100",,"visa, mastercard",,"Irrigation Technology & Control INC",https://www.facebook.com/pages/irrigation-technology-control-inc/168205896524364,,,,,,,,,
1741220,521905,"2020-09-27 03:22:08","Willow Grove Water Assoc",,willowgrovewater@att.net,"(601) 765-0651","779 Highway 588",Collins,MS,39428,"779 Highway 588,Collins,MS 39428","Water Utility Companies, Irrigation Systems & Equipment, Utility Companies, Water Supply Systems",,,,31.63307,-89.4863,,,,"Mon - Fri: 8:00 am - 5:00 pm Sat - Sun Closed",,,"check, no credit cards",,"Willow grove Water association Willow Grove Water Associates",,,,,,,,,,
1741313,521933,"2020-09-27 03:22:08","Industrial Sales Company Inc.",http://industrialsales.us/,productordersks@industrialsales.us,"(800) 662-6750","1150 W Marley Rd",Olathe,KS,66061,"1150 W Marley Rd,Olathe,KS 66061","Sewer Pipe, Automation Systems & Equipment, Gardeners, Gas Companies, Irrigation Systems & Equipment, Irrigation Systems & Equipment-Wholesale & Manufacturers, Landscaping Equipment & Supplies, Lawn & Garden Equipment & Supplies, Manufacturing Engineers, Mechanical Engineers, Nursery & Growers Equipment & Supplies, Oil & Gas Exploration & Development, Pipe, Plumbing Fixtures, Parts & Supplies, Professional Engineers, Propane & Natural Gas, Utility Companies",,,,38.86081,-94.83544,https://i1.ypcdn.com/blob/101036d33e763009e7324342d64f552cb6b3b3e0_100x100_crop.jpg?f832250,,"Industrial Sales is a distributor of piping, valves, fittings, equipment and accessories within the commercial, industrial, institutional, municipal and residential markets. Based in Olathe, KS, Industrial Sales has two Primary Divisons, Landscape and Utility. The Landscape Division offers a large inventory of products for the installation, service and maintenance of irrigation systems, landscape lighting, drainage systems, water features, outdoor living products and prower equipment. The Utility Division provides products, tools and equipment for the gas, oil, water, sanitary sewer, drainage, storm water drainage, geothermal, power and telecommunication industries. Our expert staff includes highly trained Sales and Service professionals, licensed Landscape Architects and Irrigation Association Certified Technicians, enabling us to support you and your project from start to completion.","Mon - Fri: 7:30 am - 5:00 am Sat: 7:30 am - 12:00 pm Sun Closed","TollFree: (800) 662-6750",,"amex, cash, check",,"Industrial Sales Company","http://industrialsales.us http://www.industrialsales.us",,,,,,,,,
1742942,522362,"2020-09-27 03:22:13","Serrano Water District",http://www.serranowater.org,,"(714) 538-0079","18021 Lincoln St","Villa Park",CA,92861,"18021 Lincoln St,Villa Park,CA 92861","Water Utility Companies, Irrigation Systems & Equipment, Utility Companies",,,,33.80784,-117.81751,https://i1.ypcdn.com/blob/d3ccc5859e24447d763fc9b60d9a1ecc4bd83b75_100x100_crop.jpg?f832250,,"Serrano Water District ( SWD ) was formed in 1927 and serves a population of 6, 500 in the City of Villa Park and a small portion of the City of Orange. SWD receives its water supply from local surface water which is stored in Irvine Lake and groundwater from three wells located within the City of Villa Park. SWD uses 3, 500 acre feet of water annually, due to the proliferation of large residential lots. SWD is an independent water district established in 1927 under the California Water Code, with a five-member elected board of directors. The Board members are elected by divisions. The Board appoints a General Manager to implement the policy decisions of the Board and oversee day-to-day operations and services. The District provides water for a population of 6, 500 covering approximately 4.7 square miles, serving primarily large lot single family homes and one shopping center. SWD is largely built out with an opportunity for a small amount of infill. Although a small district geographically, SWD provides a myriad of services, including managing a large recreation facility. SWD has 43 miles of pipe, 3 wells, a treatment plant, and two reservoirs. The District owns 50% of Irvine Lake. Irvine Ranch Water District owns the other 50% of the facility. SWD also owns 25% of the water in the Irvine Lake and Irvine Ranch Water District owns the remaining 75%. SWD is the managing district for Irvine Lake ( facility and recreation ). Serrano Water District employs 11 full time employees and one part time employee.","Mon - Thu: 7:00 am - 4:30 pm Fri: 8:00 am - 4:30 pm Sat - Sun Closed","Phone: (714) 538-5279 Fax Number: (714) 538-5279 Fax: (714) 538-5279",,"amex, check, discover, master card, visa",,,"http://www.serranowater.org https://www.serranowater.org",,,,,,,,,
1743202,522441,"2020-09-27 03:22:13","Boyd Artesian Well Co. Inc.",http://www.boydartesianwellco.com,boydartesian@yahoo.com,"(845) 225-3196","1054 Route 52",Carmel,NY,10512,"1054 Route 52,Carmel,NY 10512","Utility Companies, Building Contractors, Building Materials, Building Specialties, Construction & Building Equipment, Drilling & Boring Contractors, Farm Equipment, Farm Equipment Parts & Repair, Gas Companies, Geothermal Heating & Cooling Contractors, Glass Bending, Drilling, Grinding, Etc, Irrigation Systems & Equipment, Nursery & Growers Equipment & Supplies, Oil Field Equipment, Oil Well Drilling, Oil Well Drilling Mud & Additives, Oil Well Services, Plumbing Fixtures, Parts & Supplies, Pumping Contractors, Pumps, Pumps-Renting, Water Well Drilling & Pump Contractors, Water Well Drilling Equipment & Supplies, Water Well Plugging & Abandonment Service, Wellpoint & Dewatering Systems",,,,41.49002,-73.67869,,"Full Service Drilling Company ~ No One Does It Better!","For water well drilling services call Boyd Artesian Well Co., Inc. Water Well Drilling Services NYs 1st Master Drilling Company Wells Drilled, Repaired, and Deepened People have asked me, What makes your company different than all the others One thing I will tell my customers is that I am the first Master Ground Water Contractor MGWC in the State of New York. With my son, we are the first father-son team, and there are less than 100 Masters in the world. What does it mean to be an MGWC When I began taking the National Ground Water exams to become nationally certified, I had to take over 14 different exams on different styles of well drilling, drilling equipment, pumps, etc. Then I took a comprehensive written exam that was graded by my peers in the industry, which allowed me to become a master. I have always continued my education through conferences, conventions and seminars. Now I try to pass on to the next generation what I have learned through teaching seminars on the state and national level. As professionals in this field, we must continue to educate not only our peers, but our customers and ourselves. A full service drilling company with over 30 yearsВ’ experience licensed in New York, Connecticut, New Jersey and Massachusetts and nationally certified by the National Ground Water Association. We believe that one of our most precious resources is ground water. We offer a variety of services to our customers. Information is always free as is an estimate from our owner or sales manager. At Boyd Artesian Well Company, Inc. we engineer, manufacture and install round holes for water and geothermal.","Mon - Fri: 8:00 am - 5:00 pm","TollFree: (800) 321-2693",,discover,,"Boyd Artesian Well Co.",http://www.boydartesianwellco.com,"Services: Water Well Abandonment Service, Water Wells, Geothermal Heating & Cooling",,,,,,,,
1746276,523250,"2020-09-27 03:22:21","West Coast Well Drilling and Pump Service",http://westcoastwelldrilling.com/about_us,wcwell@bellsouth.net,"(352) 683-6823","4031 Lamson Ave","Spring Hill",FL,34608,"4031 Lamson Ave,Spring Hill,FL 34608","Water Well Drilling & Pump Contractors, Building Contractors, Drilling & Boring Contractors, Gas Companies, Glass Bending, Drilling, Grinding, Etc, Irrigation Systems & Equipment, Nursery & Growers Equipment & Supplies, Plumbing Fixtures, Parts & Supplies, Pumps, Pumps-Service & Repair, Utility Companies, Water Filtration & Purification Equipment, Water Softening & Conditioning Equipment & Service",,,,28.48794,-82.54544,,"Solving your water problems in Hernando, Pasco and Citrus Counties!","Homeowners and businesses depend on us for quality septic well and pump services. Whether you are in need of a repair or replacement, our technicians offer sales, service and installation on all types of systems.",,,,"check, master card, visa",,,http://westcoastwelldrilling.com/about_us,,,,,,,,,
1747743,523631,"2020-09-27 03:22:21","Mills Well Drilling Inc",,,"(850) 562-2906","5355 Tower Rd",Tallahassee,FL,32303,"5355 Tower Rd,Tallahassee,FL 32303","Water Well Drilling & Pump Contractors, Building Contractors, Building Contractors-Commercial & Industrial, Building Materials, Chlorinators, Drilling & Boring Contractors, Farm Equipment, Farm Equipment Parts & Repair, Farming Service, Farms, Gardeners, Gas Companies, General Contractors, Glass Bending, Drilling, Grinding, Etc, Irrigation Systems & Equipment, Landscape Contractors, Landscaping & Lawn Services, Nursery & Growers Equipment & Supplies, Plumbing Fixtures, Parts & Supplies, Pumping Contractors, Pumps, Pumps-Renting, Pumps-Service & Repair, Sprinklers-Garden & Lawn, Trenching & Underground Services, Utility Companies",,,,30.52849,-84.36627,,,,"Mon - Fri: 8:00 am - 5:00 am Sat - Sun Closed",,,"discover, travelers checks, visa",,,,,,,,,,,,
1748046,523714,"2020-09-27 03:22:21","Mineral Service Plus, LLC",http://www.mineralserviceplus.com,,"(952) 213-2341","16409 371st Ave","Green Isle",MN,55338,"16409 371st Ave,Green Isle,MN 55338","Water Softening & Conditioning Equipment & Service, Building Contractors, Building Specialties, Drilling & Boring Contractors, Gas Companies, Geothermal Heating & Cooling Contractors, Glass Bending, Drilling, Grinding, Etc, Irrigation Systems & Equipment, Plumbing Fixtures, Parts & Supplies, Pumps, Pumps-Service & Repair, Pumps-Wholesale & Manufacturers, Utility Companies, Water Well Drilling & Pump Contractors, Water Well Drilling Equipment & Supplies, Water Well Plugging & Abandonment Service, Water Works Equipment & Supplies",,,A+,44.71255,-94.01047,https://i3.ypcdn.com/blob/04dcbacf4d1fd4aef05436141493e9a76e6a4e8b_100x100_crop.jpg?f832250,"4th Generation Water Well Drilling & Service Company","Our mission is to provide commercial and residential clients with eco-friendly and energy efficient geothermal and water well drilling, installation & service that is Dept of Health regulated and up to code.","Mon - Fri: 8:00 am - 4:30 pm","Phone: (320) 238-0195",,"amex, discover, visa, insurance, mastercard, all major credit cards, check, debit",,,"http://www.mineralserviceplus.com http://www.geothermalfieldsystems.com","Services: Water Softener Repair, Geothermal Heating & Cooling",,,,,,,,
1749441,524098,"2020-09-27 03:22:24","S & L Pump & Well Repair",http://www.slpumpandwell.com,lindaham5553@gmail.com,"(781) 873-1833","1266 Bay Rd",Stoughton,MA,02072,"1266 Bay Rd,Stoughton,MA 02072","Pumps-Service & Repair, Building Contractors, Drilling & Boring Contractors, Farm Equipment, Farm Equipment Parts & Repair, Gas Companies, Glass Bending, Drilling, Grinding, Etc, Irrigation Systems & Equipment, Nursery & Growers Equipment & Supplies, Oil Field Equipment, Oil Well Drilling, Oil Well Drilling Mud & Additives, Oil Well Services, Plumbing Fixtures, Parts & Supplies, Pumping Contractors, Pumps, Pumps-Renting, Utility Companies, Water Treatment Equipment-Service & Supplies, Water Well Drilling & Pump Contractors, Water Well Drilling Equipment & Supplies",,,A+,42.10872,-71.13228,https://i1.ypcdn.com/blob/e9689283f9a96c88e9ae41b6750066cdbcce89f6_100x100_crop.jpg?f832250,"A clear choice for all your pump & well needs","Quality Well and Pump Services Professionals with 27 years of experience founded S & L Pump & Well Repair. From the start, our goal has been to provide customers with the highest quality water well and pump services. You benefit from honest work when you call us, because we only fix what is necessary to make your well and pump work efficiently. Also, we teach our customers how to maintain and operate their systems. Call us today to request an estimate. We prioritize emergency calls but we get back to everyone who calls. Our Services Include: ? Pump Maintenance, Repair and Installation ? Underground Well Locating Services ? Holding Tank Installation and Repair ? Out-of-Water Calls ? Chlorination Treatments of Wells ? Drilling Referral Services ? Hydrofracking Referral Services ? Sprinkler Irrigation Referral Service","Mon - Sat: 8:00 am - 6:00 pm Sun Closed",,,"check, discover, mastercard, visa",,"S @ L Pump @ Well Repair",http://www.slpumpandwell.com,,,,,,,,,