business_x_category.id,business.id,business.ts,business.business_name,business.home_page,business.email_address,business.phone,business.street,business.city,business.state,business.zip_code,business.full_address,business.category,business.rating,business.number_of_reviews,business.bbb_rating_or_license,business.latitude,business.longitude,business.cover_image,business.slogan,business.general_info,business.regular_hours,business.extra_phones,business.services_products,business.payment,business.price_range,business.aka,business.other_links,business.other_information,business.review_1_name,business.review_1_date,business.review_1_rating,business.review_1_text,business.review_2_name,business.review_2_date,business.review_2_rating,business.review_2_text
188056,62284,"2020-09-27 02:35:43","Gold Star Cleaners",http://goldstarcleaners.com,goldstarcleaners@roadrunner.com,"(207) 989-5170","200 Wilson St",Brewer,ME,04412,"200 Wilson St,Brewer,ME 04412","Dry Cleaners & Laundries, Carpet & Rug Cleaners, Coin Operated Washers & Dryers, Commercial Laundries, Drapery & Curtain Cleaners, Fire & Water Damage Restoration, Janitorial Service, Laundromats, Leather Cleaning, Tailors, Water Damage Restoration",,,A+,44.79267,-68.76241,,,,"Mon - Fri: 7:00 am - 5:30 pm","Phone: (207) 989-8680 Phone: (207) 989-8683 Primary Phone: (207) 827-6876 Primary Phone: (207) 989-8680 Fax: (207) 989-8683",,"all major credit cards",,"Gold Star Cleaners, Inc.","http://goldstarcleaners.com https://m.goldstarcleaners.com","Wi-Fi: Free Specialties: Damage, Fire Bike Parking: Yes Services: Fire Damage Restoration",,,,,,,,
188453,62438,"2020-09-27 02:35:43","Elite Cleaners",http://www.elite-clean.com,,"(304) 842-3555","96 Thompson Dr",Bridgeport,WV,26330,"96 Thompson Dr,Bridgeport,WV 26330","Drapery & Curtain Cleaners, Dry Cleaners & Laundries, Janitorial Service, Tailors",,,,39.2846,-80.27104,,,,"Mon - Fri: 6:30 am - 6:00 pm Sat: 9:00 am - 1:00 pm Sun Closed",,,,,,"http://www.elite-clean.com https://www.elite-clean.com http://www.elitecleanerswv.com http://elitewv.com","Specialties: Drapes & Curtains, Tux",,,,,,,,
188603,62493,"2020-09-27 02:35:43","Omega Cleaners",http://omegaclean.com,,"(413) 525-0900","14 Harkness Ave","East Longmeadow",MA,01028,"14 Harkness Ave,East Longmeadow,MA 01028","Dry Cleaners & Laundries, Janitorial Service, Tailors",,,,42.0795,-72.5295,,,,"Mon - Fri: 7:00 am - 6:00 pm Sat: 8:30 am - 2:00 pm Sun Closed","Primary Phone: (413) 525-0920",,"amex, cash, discover, master card, visa, all major credit cards",,"Omega Cleaners-East Longmeadow Omega Cleaners Of East Long Meadow Inc",http://omegaclean.com,"Price Range : Average",,,,,,,,
188716,62529,"2020-09-27 02:35:43","Colonial Cleaners",http://www.colonialcleaners.com,info@ColonialCleaners.com,"(203) 431-6397","19 Catoonah St",Ridgefield,CT,06877,"19 Catoonah St,Ridgefield,CT 06877","Dry Cleaners & Laundries, Janitorial Service, Tailors",,,A+,41.28108,-73.49971,,,"Colonial Cleaners is a family-owned business run by Peter and Debra Hayes. Debra is from Fairfield County and grew up around the business with her father and mother owning dry cleaners in Wilton and Georgetown. For many years, Peter worked in the postal service for the town of Greenwich while Debra worked in marketing in the corporate world. Liking the independence of working for ourselves, we joined forces in 1982 opening our first dry cleaning business in Ridgefield, Connecticut. We chose Ridgefield for its beauty, community spirit and good public schools. Today Colonial Cleaners has grown considerably. It has expanded from its original 1400 sq. ft space to a 6400 sq. ft facility in historic downtown Ridgefield. We have over 20 full-time employees, including on-staff tailors, ready to serve you. Located in what was once a livery stable, our sparkling new, renovated building and store front houses the best state-of-the-art equipment in the business. We also proudly participate in a national environmental program called ""Envirosafe , "" designed to greatly reduce the need for dry cleaning solvents and to promote recycling practices. We love Ridgefield: as a home for our children, as a community that keeps us engaged, and as a place to grow and serve our customers.","Mon - Fri: 6:00 am - 6:00 pm Sat: 6:00 am - 5:00 pm",,,,,,http://www.colonialcleaners.com,"Specialties: Wedding Wear, Weddings, Leather, Gowns, Home Decor, Household Items, Suedes",,,,,,,,
188930,62601,"2020-09-27 02:35:43","Cleary Cleaners",http://clearycleaners.com,,"(603) 742-5848","23 Weeks Ln",Dover,NH,03820,"23 Weeks Ln,Dover,NH 03820","Dry Cleaners & Laundries, Janitorial Service, Tailors",,,,43.22233,-70.88599,,,,"Mon - Fri: 8:00 am - 4:00 pm","Phone: (603) 617-3543",,,,,"http://clearycleaners.com https://clearycleaners.com",,,,,,,,,
189095,62650,"2020-09-27 02:35:43","Cathy's Cleaners",http://cathyscleaners.net,Hang.Nguyen@Cathyscleaners.Net,"(512) 320-8111","231 W 3rd St",Austin,TX,78701,"231 W 3rd St,Austin,TX 78701","Dry Cleaners & Laundries, Carpet & Rug Cleaners, Clothing Alterations, Drapery & Curtain Cleaners, Janitorial Service, Tailors, Upholstery Cleaners",2,"3 Reviews",A+,30.26564,-97.74567,,,,"Mon - Fri: 7:00 am - 7:00 pm Sat: 9:00 am - 3:00 pm",,,"discover, mastercard, visa, amex",,,http://cathyscleaners.net,"Specialties: Clothing, Apparel, Garments","Kristen G.",01/27/2014,one,"If you love your clothes, I advise against taking them here. They destroyed my favorite dress and also lost the buttons on one of my jackets. High risk of damaged clothes and they won't take full responsibility.",MC663,05/31/2012,one,"DO NOT GIVE YOUR CLOTHES TO THIS BUSINESS. They completely lost my clothes, then angrily told me too bad and that they hold no responsibility. Let alone loosing all of my business clothes, this is one of the rudest businesses I've ever interacted with."
189105,62653,"2020-09-27 02:35:43","Fussy Cleaners",http://www.fussycleaners.com/chagrin-falls,,"(440) 893-9155","23 S Franklin St Apt 1","Chagrin Falls",OH,44022,"23 S Franklin St Apt 1,Chagrin Falls,OH 44022","Dry Cleaners & Laundries, Clothing Alterations, Janitorial Service, Tailors, Wedding Tailoring & Alterations",,,,41.42904,-81.39149,,,,"Mon - Fri: 7:30 am - 7:00 pm Sat: 9:00 am - 5:00 pm",,,"all major credit cards",,"Fussy Cleaners - Chagrin Falls","http://www.fussycleaners.com/chagrin-falls http://www.fussycleaner.com","Specialties: Wool, Wedding Wear, Formal Wear, Silks, Leather, Woolens, Dresses, Jackets, Clothing, Suedes, Garments, Apparel",,,,,,,,
189152,62672,"2020-09-27 02:35:43","Anderson Cleaners",,clean@andersoncleaners.com,"(218) 829-5269","416 S 8th St",Brainerd,MN,56401,"416 S 8th St,Brainerd,MN 56401","Dry Cleaners & Laundries, Carpet & Rug Cleaners, Clothing Alterations, Drapery & Curtain Cleaners, Janitorial Service, Laundromats, Leather Cleaning, Leather Goods Repair, Tailors, Wedding Tailoring & Alterations",,,A+,46.35411,-94.1981,,,,"Mon - Fri: 7:00 am - 5:30 pm",,,amex,,"Anderson Dry Cleaners",,,,,,,,,,
189923,62922,"2020-09-27 02:35:43","Minute Men Cleaners",http://www.minutemencleaners.com,minutemail@minutemencleaners.com,"(203) 227-6153","600 Riverside Ave",Westport,CT,06880,"600 Riverside Ave,Westport,CT 06880","Dry Cleaners & Laundries, Carpet & Rug Cleaners, Clothing Alterations, Commercial Laundries, Drapery & Curtain Cleaners, Janitorial Service, Laundromats, Leather Cleaning, Tailors, Wedding Tailoring & Alterations",,,A+,41.12016,-73.3705,,,,"Mon - Sun: 7:00 am - 5:00 pm",,,"discover, check",,,http://www.minutemencleaners.com,"Parking: Lot, Private",,,,,,,,
190418,63105,"2020-09-27 02:35:47","Dependable Cleaners",https://dependablecleaners.com,customercare@dependablecleaners.com,"(617) 506-1455","1141 Dorchester Ave",Dorchester,MA,02125,"1141 Dorchester Ave,Dorchester,MA 02125","Dry Cleaners & Laundries, Cleaning Contractors, Clothing Alterations, Janitorial Service, Laundromats, Leather Cleaning, Tailors",1,"2 Reviews",,42.3118,-71.05771,https://i4.ypcdn.com/blob/ef2e8a0def34b8cdc6a0ac0f2482907324d1d552_100x100_crop.jpg?912a958,,"Dependable Cleaners in Dorchester, voted best of Boston for quality dry cleaning, laundering, & tailoring. Dependable offers eco-friendly dry cleaning with Green Earth Cleaning technology, free home delivery, same day service, 24 hour drop off, and a state of the art laundromat. Also offer Style by Dependable service. Laundromat Hours: Sunday thru Saturday 5am to 10pm (last wash must be started before 9pm)","Mon - Fri: 6:00 am - 7:00 pm Sat: 6:00 am - 6:00 pm Sun: 9:00 am - 5:00 pm",,,"all major credit cards, amex, discover",,,website,"Parking: Lot, Private Bike Parking: Yes Wi-Fi: Free","David B.",12/09/2015,one,"Unfortunately many of the clothes I brought for wash and fold were lost. While they were able to recover my clothes my girlfriend wasn't so lucky. Over 500 dollars worth of clothes were lost and while the owner was apologetic when it came time to pay she only gave us half the 10X's what we paid contract because she seemed to think we got most of our clothes back. She claimed we received over half the clothes, but being the poor establishment that this is she didn't even weight the clothes we were given back! It also took over 3 weeks to get the clothes and be done with this awful experience. She also insinuated we were lying about how many clothes we lost which is very unfortunate. We were willing to try again with them expecting this to be a fluke accident, but at the 9th hour she made us feel like thieves when it was the fault of the cleaners who lost all of the clothes.",02125_rc,11/21/2012,one,"I called the Dorchester Ave location with the hopes of getting my clothes picked up for dry cleaning. I read a review stating this was a reasonably priced dry cleaners with pick-up / delivery service in Belmont, Cambridge, Dorchester, Quincy, etc. I was greeted by a polite and helpful employee on the phone. I asked about their pick up service and was told this service is not offered in Dorchester. She was unable to tell my why, so I requested to speak with a manager. I was put on hold as she had to call her manager on another line because there was no management at the store. ""Management"" said, ""It was a company decision to not offer the pick up and delivery service in Dorchester."" At this point I let the associate on the phone know I was unhappy and would look elsewhere to spend my money. It's not right that they do business in our neighborhood but won't extend the same services they do to other cities. It's discrimination. The associate was polite and helpful but I won't support businesses that demean our neighborhood but will gladly take our money."
191325,63432,"2020-09-27 02:35:47","Pacific Dry Cleaners",http://www.pacificdrycleaners.com,,"(831) 423-0644","511 Cedar St","Santa Cruz",CA,95060,"511 Cedar St,Santa Cruz,CA 95060","Dry Cleaners & Laundries, Clothing Alterations, Drapery & Curtain Cleaners, Janitorial Service, Laundromats, Tailors",4,"1 Review",,36.97124,-122.02688,,,,"Mon - Fri: 7:00 am - 6:00 pm Sat: 9:00 am - 4:00 pm",,,"all major credit cards",,,"http://www.pacificdrycleaners.com https://pacificdrycleaners.com","Parking: Lot, Private Wi-Fi: No Specialties: Wedding Dresses, Knitwear, Bridal Gowns, Tux","Melinda S.",08/27/2016,four,"Great cleaners in Santa Cruz. Had to use their service when visiting last summer... Great service and good prices.",,,,
191357,63444,"2020-09-27 02:35:47","Mathews Cleaners & Tailors",https://www.mathewscleaners.com,silveradoclean@gmail.com,"(619) 298-9764","3935 Ohio St","San Diego",CA,92104,"3935 Ohio St,San Diego,CA 92104","Dry Cleaners & Laundries, Janitorial Service, Tailors",,,,32.74921,-117.12856,https://i4.ypcdn.com/blob/f5dc5bfb294f8d1112a71bfe64d33b7e4dc31369_100x100_crop.jpg?912a958,,,"Mon - Fri: 7:00 am - 7:00 pm",,,"all major credit cards",,"Matthew's Cleaners & Tailors","https://www.mathewscleaners.com http://www.mathewscleaners.com",,,,,,,,,
191446,63475,"2020-09-27 02:35:47","Country Club Cleaners",,,"(860) 675-5518","300 Country Club Rd",Avon,CT,06001,"300 Country Club Rd,Avon,CT 06001","Dry Cleaners & Laundries, Janitorial Service, Tailors, Water Damage Restoration",,,,41.7902,-72.86279,,,,,,,,,,,,,,,,,,,
191462,63481,"2020-09-27 02:35:47","Hourglass Cleaners",http://www.hourglass-cleaners.com,,"(602) 952-8682","4412 E Camelback Rd",Phoenix,AZ,85018,"4412 E Camelback Rd,Phoenix,AZ 85018","Dry Cleaners & Laundries, Janitorial Service, Leather Cleaning, Tailors",1,"5 Reviews",A+,33.50959,-111.98516,https://i4.ypcdn.com/blob/fe3c0c710e7c51c1e0f9bc658eb4a7dab7286ba7_100x100_crop.jpg?912a958,,,"Mon - Fri: 7:00 am - 8:00 pm Sat: 7:00 am - 6:00 pm","TollFree: (888) 622-1901",,"all major credit cards",,,"http://www.hourglass-cleaners.com https://www.hourglass-cleaners.com","Bike Parking: Yes","Barclay S.",04/21/2018,one,"They have stained two new garments that were there for alterations. Both times they've denied it. This time the owner went so far as to accuse me of lying to her about it. I've shared my experience with a few friends and EVERY one has relayed a similar experience.",beth.mcrae2,"Edited: 01/25/2017",one,"I have NEVER been treated so poorly by business owners! My husband and I were long-time clients who spent thousands of dollars with these CROOKS. They are liars and cheats who will not own up to ruining a garment. We are baffled by the behavior of Sunhi and Brad, the owners, who were completely rude to us and accused us of lying about where the ruined item had been cleaned. They were the only cleaners we used and we are not pathological enough to take an item ruined by someone else and repackage it in an Hourglass wrapper, which is what they accused us of. We know four other people that have had this same DEPLORABLE treatment. They then tried to convince us the discoloration was part of the original dress design. WHAT??? We are calling their landlords to file a complaint and with the Better Business Bureau. Do yourself a favor and use ANYONE BUT HOURGLASS!"
191545,63512,"2020-09-27 02:35:47","Vogue Cleaners",http://voguecleaners.com,michaelrose@voguecleaners.com,"(815) 455-0055","1295 Randall Rd Ste 103","Crystal Lake",IL,60014,"1295 Randall Rd Ste 103,Crystal Lake,IL 60014","Dry Cleaners & Laundries, Janitorial Service, Tailors",,,,42.20576,-88.33556,,,,"Mon - Fri: 7:00 am - 6:00 pm Sat: 8:00 am - 5:00 pm Sun Closed",,,check,,"Vogue Cleaners INC",http://voguecleaners.com,,,,,,,,,
191833,63614,"2020-09-27 02:35:48","Hour Glass Cleaners",,,"(860) 584-1457","942 Stafford Ave",Bristol,CT,06010,"942 Stafford Ave,Bristol,CT 06010","Dry Cleaners & Laundries, Janitorial Service, Leather Cleaning, Tailors",1,"1 Review",A+,41.70149,-72.91029,,,,"Mon - Fri: 7:00 am - 6:00 pm Sat: 8:00 am - 4:00 pm Sun Closed","TollFree: (888) 622-1901",,"visa, debit, amex, discover, check, all major credit cards, mastercard",,,,"Specialties: Wedding Gowns, Wedding Dresses, Bridal Gowns",thomas1,05/08/2012,one,"I have been going to this cleaner for 5 years and prices consistantly go up. 130% increase! Finally they gave my 8 shirts to someone without a ticket and insisted I picked them up. They decided how much they would compensate me for my shirts which was much less than I paid (after waiting 1 month to see if they were returned). Then they made me take the compensation in two payments and gave me a hard time getting the second payment like I was the one at fault! When I demanded payment for my shirts that THEY gave away, they told me to not come back anymore. I was AMAZED!",,,,
191936,63652,"2020-09-27 02:35:48","Dublin Cleaners",http://www.dublincleaners.com/locations/muirfield-drive,,"(614) 760-1992","7112 Muirfield Dr",Dublin,OH,43017,"7112 Muirfield Dr,Dublin,OH 43017","Dry Cleaners & Laundries, Clothing Alterations, Janitorial Service, Tailors",,,,40.11266,-83.15304,,,"Some cleaners cut corners when it comes to training and certifications. Dublin Cleaners has always been a forerunner in the dry cleaning industry by keeping our team up to date on the latest cleaning methods. You can feel confident knowing you have some of the best garment care experts in Ohio working for you.","Mon - Fri: 7:00 am - 7:00 pm Sat: 8:30 am - 5:00 pm Sun Closed",,,"all major credit cards",,,website,,,,,,,,,
192363,63812,"2020-09-27 02:35:48","Hillers Cleaners",http://www.hillerscleaners.com,,"(508) 435-3880","97 Main St",Hopkinton,MA,01748,"97 Main St,Hopkinton,MA 01748","Dry Cleaners & Laundries, Janitorial Service, Leather Cleaning, Tailors",,,,42.22625,-71.52705,,,,"Mon - Fri: 7:00 am - 7:00 pm Sat: 7:00 am - 5:00 pm",,,"visa, mastercard, discover, amex",,"HillerВ’s Cleaners",http://www.hillerscleaners.com,"Wi-Fi: No Bike Parking: Yes Price Range : Average",,,,,,,,
192948,64025,"2020-09-27 02:35:52","America Pride Cleaners",,,"(505) 256-5140","1349 San Mateo Blvd SE",Albuquerque,NM,87108,"1349 San Mateo Blvd SE,Albuquerque,NM 87108","Dry Cleaners & Laundries, Cleaning Contractors, Clothing Alterations, Janitorial Service, Tailors, Wedding Tailoring & Alterations",,,A+,35.06035,-106.58676,https://i4.ypcdn.com/blob/fe34d31e393e1bd01895ff05b5dbabd1453d41e5_100x100_crop.jpg?912a958,,,"Mon - Fri: 7:00 am - 6:00 pm Sat: 9:00 am - 4:00 pm",,,"mastercard, discover, visa, amex, check, debit",,"American Pride Cleaners",,"Parking: Lot, Free Bike Parking: No Wheelchair Accessible: Yes Specialties: Business, Industrial, Graphics, Retail, Consultations",,,,,,,,
193119,64086,"2020-09-27 02:35:52","Country Club Cleaners",http://www.countryclubcleanersdelmontecenter.mobi,young@cccleaners.com,"(831) 372-3101","900 Del Monte Ctr",Monterey,CA,93940,"900 Del Monte Ctr,Monterey,CA 93940","Drapery & Curtain Cleaners, Bridal Gown Preservation, Clothing Alterations, Commercial Laundries, Dry Cleaners & Laundries, Janitorial Service, Laundromats, Leather Cleaning, Leather Goods Repair, Tailors, Water Damage Restoration",,,,36.58451,-121.90032,,,,"Mon - Fri: 7:00 am - 7:00 pm Sat: 8:00 am - 5:00 pm Sun: 11:00 am - 5:00 pm","Fax Number: (831) 625-0723 Fax: (831) 625-0723",,"all major credit cards",,,"http://www.countryclubcleanersdelmontecenter.mobi http://countryclubcleaners.com https://www.countryclubcleaners.com","Parking: Lot, Private Wi-Fi: No Bike Parking: Yes Price Range : Average Specialties: Drapes & Curtains",,,,,,,,
193161,64097,"2020-09-27 02:35:52","Tustin Cleaning Center",http://www.tustin-carpetcleaning.com,info@tustininsurance.com,"(714) 730-3844","18331 Irvine Blvd Ste D",Tustin,CA,92780,"18331 Irvine Blvd Ste D,Tustin,CA 92780","Drapery & Curtain Cleaners, Clothing Alterations, Dry Cleaners & Laundries, Fire & Water Damage Restoration, Furniture Cleaning & Fabric Protection, House Cleaning, Janitorial Service, Leather Cleaning, Tailors",,,,33.74869,-117.81287,https://i4.ypcdn.com/blob/36467c15cfd9dc880f731a429f1fb47b3b6b159a_100x100_crop.jpg?912a958,,,"Mon - Fri: 7:00 am - 6:00 pm Sat: 9:00 am - 5:00 pm",,,"master card, visa, all major credit cards",,"Tustin Cleaning Ctr",http://www.tustin-carpetcleaning.com,"Wi-Fi: No Bike Parking: No",,,,,,,,
193763,64325,"2020-09-27 02:35:52","Martino's Master Dry Cleaners",http://www.martinos.net,martinocleaners@aol.com,"(262) 694-7858","7513 41st Ave",Kenosha,WI,53142,"7513 41st Ave,Kenosha,WI 53142","Dry Cleaners & Laundries, Bridal Gown Preservation, Clothing Alterations, Drapery & Curtain Cleaners, Fire & Water Damage Restoration, House Cleaning, Janitorial Service, Laundromats, Leather Cleaning, Tailors, Wedding Supplies & Services, Wedding Tailoring & Alterations",,,A+,42.5658,-87.85746,,"It's Right, It's Ready, It's Guaranteed.","Martino's Master Drycleaner is one of the leading laundry service providers based in Kenosha, Wis. The company offers a wide range of services, including dry cleaning, stain removal, platinum shirt service, fire restoration, etc. In addition, it offers wedding gown preservation, alterations and repairs, pickup/delivery and many more services. Martino's Master Drycleaner is the only drycleaner in Kenosha to receive a 3 Star Environmental Recognition from the Department of Natural Resources. The company has association with Wisconsin Fabricare Institute and is a Sanitone licensee.","Mon - Fri: 7:00 am - 7:00 pm Sat: 8:00 am - 5:00 pm","Phone: (262) 657-3121 Phone: (262) 637-7337 Primary Phone: (262) 637-7337 Phone: (262) 694-7545 TollFree: (866) 497-3446",,"master card, visa, amex, discover, all major credit cards",,"Martino's Master Drycleaner","http://www.martinos.net http://www.martinoscleaners.com","Specialties: Drapes & Curtains, Leather, Wedding Gowns, Wedding Dresses, Bridal Gowns",,,,,,,,
193880,64372,"2020-09-27 02:35:52","Battiston's of Rocky Hill",http://www.battistons.com,smokerestore@cs.com,"(860) 257-4444","366 Cromwell Ave","Rocky Hill",CT,06067,"366 Cromwell Ave,Rocky Hill,CT 06067","Dry Cleaners & Laundries, Carpet & Rug Cleaners, Cleaning Contractors, Janitorial Service, Laundromats, Leather Cleaning, Tailors, Water Damage Restoration",,,A+,41.66071,-72.67792,,,,"Mon - Fri: 7:00 am - 7:00 pm Sat: 8:00 am - 6:00 pm","TollFree: (877) 463-4737",,"all major credit cards, debit, amex, discover, mastercard, visa, check",,"Battiston's of Rocky Hill LLC",http://www.battistons.com,,,,,,,,,
194080,64445,"2020-09-27 02:35:52","Champion Cleaners",http://www.championcleanersfl.com,info@chamnpioncleanersfl.com,"(239) 598-1555","13500 Tamiami Trl N Ste 14",Naples,FL,34110,"13500 Tamiami Trl N Ste 14,Naples,FL 34110","Dry Cleaners & Laundries, Clothing Alterations, Janitorial Service, Tailors","4,5","3 Reviews",A+,26.29275,-81.80115,https://i1.ypcdn.com/blob/fa864f736fd6d3be8848e9b43c235e9125022f41_100x100_crop.jpg?624ab39,,"Take a moment to see for yourself what makes Champion so uniqueВ—and why you can count on us to help you look and feel like a Champion all year long. We?ve been serving and supporting the Naples, Bonita Springs and Estero communities for over a decade with our exception dry cleaning and laundry services. Today, our commitment has never been stronger to exceed our customers? expectations for quality, service and value. All of us at Champion Cleaners look forward to proving that to you soon and often. The best part? We are more than just your local dry cleaning business. We handle expert alterations, button tightening & replacement, special bright white dry cleaning services, wedding dress care, and more! Contact us today to sign up for Champion-quality garments. If you haven?t yet signed up for FREE Pickup and Delivery, you can do so right here. It takes just a momentВ—and you?ll get $10 OFF on your first order. It?s our way of saying В“thank youВ” for allowing us to protect the investment you have made in your garmentsВ—a responsibility we take very seriously with each and every item you entrust to our care, no exceptions. Best regards, Tim O'Gorman, Owner and the rest of the Champion Cleaners Staff","M-F 7:30am-6pm, Sa 8am-1pm, Su Closed (24-Hour Pickup & Drop Off Lockers)","Phone: (239) 596-4433",,"all major credit cards",,,http://www.championcleanersfl.com,"Wheelchair Accessible: Yes Parking: Lot",barryg1377101244,11/16/2010,four,"They never let me down at Champion. If they say my stuff will be ready on a date/time, it's always there. What more can I ask form my cry cleaner?","To Jennings",05/28/2010,five,"I wish Champion would open up some more locations, I have to drive across town to get to their store. It's worth it, but it still would be much better if they were closer to my home."