business_x_category.id,business.id,business.ts,business.business_name,business.home_page,business.email_address,business.phone,business.street,business.city,business.state,business.zip_code,business.full_address,business.category,business.rating,business.number_of_reviews,business.bbb_rating_or_license,business.latitude,business.longitude,business.cover_image,business.slogan,business.general_info,business.regular_hours,business.extra_phones,business.services_products,business.payment,business.price_range,business.aka,business.other_links,business.other_information,business.review_1_name,business.review_1_date,business.review_1_rating,business.review_1_text,business.review_2_name,business.review_2_date,business.review_2_rating,business.review_2_text
719453,247570,"2020-09-27 02:54:22","A V Center Maintenance LLC",,avcm_cindy@hotmail.com,"(661) 947-8794",,,,,,"Cleaners Supplies, Cleaning Contractors, Commercial & Industrial Steam Cleaning, Industrial Cleaning, Landscape Contractors, Landscaping & Lawn Services, Parking Lot Maintenance & Marking, Parking Stations & Garages-Construction, Power Washing, Sweepers-Power, Sweeping Service-Power",,,,,,https://i3.ypcdn.com/blob/a93a596d023017bdea094c8fc83dfdc0ffd3f8a7_100x100_crop.jpg?63f80dd,"OUR BUSINESS IS MAKING YOUR BUSINESS LOOK GOOD!",,"Mon - Sun: Open 24 Hours",,,"amex, visa, mastercard",,,,"Services: Industrial Steam Cleaning",,,,,,,,
720599,247917,"2020-09-27 02:54:22","Just Parking LLC Parking Lot Striping & Sealcoating",http://www.justparkingflorida.com,justparkingflorida@gmail.com,"(850) 573-4459","Serving Dothan Enterprize Ozark AL Parking Lot Striping & Sealcoating Alabama",Dothan,AL,36303,"Serving Dothan Enterprize Ozark AL Parking Lot Striping & Sealcoating Alabama,Dothan,AL 36303","Parking Lot Maintenance & Marking, Asphalt, Asphalt Paving & Sealcoating, Concrete Restoration, Sealing & Cleaning, Driveway Contractors, Landscape Contractors, Landscaping & Lawn Services, Paint, Painting Contractors, Painting Contractors-Commercial & Industrial, Parking Facilities-Equipment & Supplies, Parking Lots & Garages, Parking Stations & Garages-Construction, Pavement & Floor Marking Services, Power Washing, Pressure Washing Equipment & Services, Property Maintenance, Sealers Asphalt, Concrete, Etc., Sealing Compounds, Signs-Maintenance & Repair, Stripers Mechanical, Sweeping Service-Power, Traffic & Parking Consultants, Traffic Signs & Signals",,,,,,https://i3.ypcdn.com/blob/ddaa8b21c330ec96098ce561aed39f53e45424de_100x100_crop.jpg?63f80dd,"Serving Enterprize AL, Dothan AL, Ozark AL, Graceville FL, Malone FL, Chipley FL, Bonifay FL, Cottondale FL, Parking Lot Painting - Asphalt Selcoating - Crack Filling - Traffic Sign & Parking Bumper Installation - Line Striping - Paint Striping","Parking Lot Striping, Asphalt Sealcoating, Crack & Pothole Repair, Parking Lot Signage, Parking lots & Asphalt Driveways, Line Striping, Pavement Marking, Driveway Sealing, Asphalt Repair, Asphalt Sealing, Parking Lot Painting, Blacktop Sealer, parking lot maintenance, power sweeping, Serving Enterprize AL, Dothan AL, Ozark AL, Graceville FL, Malone FL, Chipley FL, Bonifay FL, Cottondale FL,","Mon - Sun: 9:00 am - 6:00 pm",,,check,,,http://www.justparkingflorida.com,,,,,,,,,
720710,247948,"2020-09-27 02:54:22","County Line Service, Inc.",https://countylineserviceinc.com,countylineserviceinc@gmail.com,"(309) 489-6096",,Kewanee,IL,61443,"Kewanee,IL 61443","Landscape Contractors, Demolition Contractors, Driveway Contractors, Excavating Equipment, Gutters & Downspouts, Landscaping & Lawn Services, Parking Lot Maintenance & Marking, Snow Removal Service, Stamped & Decorative Concrete, Tree Service",,,A+,,,https://i3.ypcdn.com/blob/af718993ddae572e093d67e90a9e0a80280b2089_100x100_crop.jpg?63f80dd,"No Job Too Small Or Too Large","County Line Service, Inc., in Kewanee, IL, is the area's leading contractor serving Kewanee and surrounding areas since 1988. We specialize in lot sweeping, commercial and residential mowing, concrete and excavating, trucking, farm drainage, driveways & sidewalks, parking lots, erosion control, retaining walls, commercial & residential snow removal and much more. For all your needs, contact County Line Service, Inc. in Kewanee IL.","Mon - Fri: 8:00 am - 5:00 pm Sat - Sun Closed",,,"check, cash",,,"Primary Website",,,,,,,,,
722257,248435,"2020-09-27 02:54:28","Metro Group Commercial Snow Removal",http://www.metro-plowing.com,metro.landscape@comcast.net,"(989) 443-4380","6045 E West Branch Rd","Saint Helen",MI,48656,"6045 E West Branch Rd,Saint Helen,MI 48656","Parking Lot Maintenance & Marking, Asphalt Paving & Sealcoating, Landscape Contractors, Snow Removal Service",,,,44.30615,-84.49044,https://i3.ypcdn.com/blob/1dca8120937ce60ceff8e0179cd8bdaaea93d9c7_100x100_crop.jpg?63f80dd,,,"Mon - Sun: Open 24 Hours","Phone: (586) 563-3990",,"visa, master card, discover, debit, check, paypal, cash",,,"Metro Commercial Snow Removal",,,,,,,,,
723430,248795,"2020-09-27 02:54:28","RJR Services",http://www.rjrservices.com,,"(888) 459-7616","12711 Farmington Rd",Livonia,MI,48150,"12711 Farmington Rd,Livonia,MI 48150","Parking Lot Maintenance & Marking, Cleaning Contractors, Gardeners, Landscape Contractors, Landscaping & Lawn Services, Landscaping Equipment & Supplies, Lawn & Garden Equipment & Supplies, Lawn Maintenance, Nurseries-Plants & Trees, Parking Stations & Garages-Construction, Pressure Washing Equipment & Services, Property Maintenance, Snow Removal Service, Sod & Sodding Service, Sweeping Service-Power",,,,42.37654,-83.3749,,"For all your outdoor maintenance needs","Your visitors first impression begins before they walk in. Your curb appeal matters. A clean, well-kept appearance in your home or commercial building says a lot about you or your company. Let RJR Services, Inc. maintain everything outsidefrom building to curb. Check out our service pages. most likely, youll find what you're looking for...and if you don't, give us a call - we do it all! Our commitment to a higher level of maintenance service began in 1975. Now, RJR Services, Inc. is a recognized leader in the parking lot and grounds maintenance industry. Our reputation for providing prompt, professional and experienced service has kept our customers loyal. We maintain concrete and asphalt parking areas, buildings, outdoor lighting, parking lot signs, entrance signs, striping, bumper blocks and more for: Commercial or industrial facilities Construction sites Shopping centers / strip malls / restaurants Any and all parking areas, including parking structures Apartment or condominium communities","Mon - Fri: 8:00 am - 5:00 pm",,,,,,http://www.rjrservices.com,"Services: Parking Lot Stripping, Power Sweeping, Asphalt sealcoating/crack repair, sign services,powerwashing, gutter cleaning, landscape maintenance, concrete work flat and curbing",,,,,,,,
723739,248863,"2020-09-27 02:54:28","Bruce's Sweeping LLC",,,"(517) 712-4730","2732 E Saint Joe Hwy","Grand Ledge",MI,48837,"2732 E Saint Joe Hwy,Grand Ledge,MI 48837","Parking Lot Maintenance & Marking, Cleaning Contractors, Landscape Contractors, Landscape Designers & Consultants, Lawn Maintenance, Parking Stations & Garages-Construction, Snow Removal Service, Sweepers-Power, Sweeping Service-Power",,,,42.72631,-84.784,,,"We offer free estimates: * Sweeping Service * Lawn Care * Snow Plowing * Over 20 Years Experience * Call Now to Schedule an estimate * Hours by Appointment AMENITY We Come to You! Free Estimates",,,,check,,,,,,,,,,,,
724116,249001,"2020-09-27 02:54:32","Kokopelli Landscaping Inc",http://kokopellilandscapeinc.com,koko2864@gmail.com,"(505) 424-0805","4 Vargas Ct","Santa Fe",NM,87508,"4 Vargas Ct,Santa Fe,NM 87508","Parking Lot Maintenance & Marking, Building Maintenance, Landscape Contractors, Snow Removal Service",,,,35.56019,-106.10123,,,,"Mon - Fri: 9:00 am - 5:00 pm","Mobile: (505) 412-2222",,,,,http://kokopellilandscapeinc.com,,,,,,,,,
724401,249094,"2020-09-27 02:54:32","The Parking Lot Guys",http://www.theparkinglotguys4u.com,8048jr@gmail.com,"(785) 341-3151","Po Box 224",Manhattan,KS,66505,"Po Box 224,Manhattan,KS 66505","Sweeping Service-Power, Asphalt Paving & Sealcoating, Landscape Contractors, Parking Lots & Garages, Paving Contractors, Snow Removal Service",,,,39.1123,-96.512,,"Your Midwest Parking Lot Maintenance Company","The Parking Lot Guys is an experienced maintenance company located in the state of Kansas. Our area of service is extensive. We have been providing our customers with quality, professional service since 2011.The Parking Lot Guys is a specialty contractor dedicated to developing permanent relationships with our customers. Our specialty is that of Pavement Marking and maintenance of parking areas. We offer several services for our clients and have experience in new construction as well as remodels throughout the state of Kansas.The Parking Lot Guys is qualified and dedicated to meet your needs before during and after our project with you is completed. We believe that our service and performance is unparalleled in Kansas.","Mon - Fri: 8:00 am - 6:00 pm","Phone: (785) 233-3474",,,,,http://www.theparkinglotguys4u.com,,,,,,,,,
724785,249217,"2020-09-27 02:54:32","Commercial Sweeping Inc",http://www.commercialsweepinginc.com,info@commercialsweepinginc.com,"(503) 371-8420","1285 Candlewood Dr NE",Keizer,OR,97303,"1285 Candlewood Dr NE,Keizer,OR 97303","Sweeping Service-Power, House Washing, Landscape Contractors, Parking Lot Maintenance & Marking, Snow Removal Service",,,A+,44.97793,-123.01602,,,,,,,,,"Commercial Sweeping Service Inc",http://www.commercialsweepinginc.com,,,,,,,,,
724909,249263,"2020-09-27 02:54:32","Parsons Professional Grounds Maintenance",http://www.dllr.state.md.us/license,theparsonsgroup@verizon.net,"(410) 548-1982","4686 Snow Hill Rd",Salisbury,MD,21804,"4686 Snow Hill Rd,Salisbury,MD 21804","Sweeping Service-Power, Landscape Contractors, Landscape Designers & Consultants, Lawn Maintenance, Parking Lot Maintenance & Marking, Snow Removal Service",,,,38.32026,-75.54888,,,,"Mon - Fri: 8:30 am - 5:00 pm Sat - Sun Closed","Phone: (440) 548-1982",,"cash only",,"Parsons Professional Grounds Malntenance Parsons Power Sweeping Parsons Professional Grounds Maintenance & Parsons Power Sweeping","http://www.dllr.state.md.us/license http://parsonsgroupltd.com","Parking: Lot, Free Wheelchair Accessible: Yes",,,,,,,,
725796,249560,"2020-09-27 02:54:32","Professional Lawn Service",http://professionallawnservice.net,dpeevy151@yahoo.com,"(731) 695-6643","515 Tige Hopper Rd",Jackson,TN,38305,"515 Tige Hopper Rd,Jackson,TN 38305","Lawn Maintenance, Fertilizing Services, Landscape Contractors, Landscape Designers & Consultants, Landscaping & Lawn Services, Lawn Mowers, Mulches, Parking Lots & Garages, Snow Removal Service",,,,35.78142,-88.62128,,"The Very Best in Residential and Commercial Lawn Care and Landscaping","Professional Lawn Service gives you the very best in residential and commercial lawn care. Professional Lawn Service does it all, from lawn care and landscape installations to maintenance and basic gardening. We have many years of experience bringing you the most beautiful lawns imaginable at the guaranteed fairest prices. For the best in creative landscaping design and detailed commercial and home landscape maintenance, give Professional Lawn Service a call, we can provide all the needed services. Our professional landscape team provides elaborate design, sales, installation and maintenance for your lawn and garden. Looking To Remodel Your Current Landscape? Then Contact Us For Professional Lawn Care & Landscaping Services Today!","Mon - Fri: 8:00 am - 5:00 pm",,,"amex, discover, visa, all major credit cards",,,http://professionallawnservice.net,,,,,,,,,
726007,249623,"2020-09-27 02:54:32","Split Excavating Inc",http://www.megansvalley.com,tracym@splitexcavating.net,"(413) 582-1262","8 Mill Valley Rd",Hadley,MA,01035,"8 Mill Valley Rd,Hadley,MA 01035","Sweeping Service-Power, Excavation Contractors, Landscape Contractors, Parking Lot Maintenance & Marking, Property Maintenance, Snow Removal Service, Sweepers-Power",,,A+,42.34957,-72.56465,,,,"Mon - Fri: 9:00 am - 4:00 pm","Phone: (413) 582-1264 Primary Phone: (413) 582-1264 Fax: (413) 582-1264",,,,,"http://www.megansvalley.com http://www.splitexcavating.com","Services: Driveways",,,,,,,,
726107,249658,"2020-09-27 02:54:32","Crosswell Lawn Care 1/2 Off",,money731@aol.com,"(516) 238-7973",,Easton,PA,18040,"Easton,PA 18040","Landscaping & Lawn Services, Landscape Contractors, Lawn Maintenance, Parking Lot Maintenance & Marking, Snow Removal Service",,,,,,,,"Crosswell Property Maintenance offers 1/2 off Pricing","Mon - Sun: Open 24 Hours","Phone: (610) 438-4049",,"all major credit cards, check, debit",,,,,,,,,,,,
726529,249792,"2020-09-27 02:54:32","Yard Boys Inc",,yardboysinc@comcast.net,"(912) 353-1096","1094 Eisenhower Dr",Savannah,GA,31406,"1094 Eisenhower Dr,Savannah,GA 31406","Lawn Maintenance, Cleaning Contractors, Landscape Contractors, Landscaping & Lawn Services, Parking Lots & Garages, Sweeping Service-Power",,,,32.00675,-81.10091,,,"Professional Sweeping Service",,,,,,,,,,,,,,,,
726732,249854,"2020-09-27 02:54:32","Sureseal Sealcoat",,,"(315) 269-6922",,utica,NY,13502,"utica,NY 13502","Home Improvements, Asphalt Paving & Sealcoating, Landscape Contractors, Parking Lot Maintenance & Marking, Sealers Asphalt, Concrete, Etc.",,,,,,,,,,,,"master card, check, visa, debit",,"SURESEAL SEALCOAT",,,,,,,,,,
727522,250102,"2020-09-27 02:54:43","Mdd Construction Management",http://www.apexconstructioncleveland.com,mdean456@mddconstructionmgmt.com,"(440) 317-7311","24381 Aurora Rd",Bedford,OH,44146,"24381 Aurora Rd,Bedford,OH 44146","General Contractors, Building Contractors, Building Contractors-Commercial & Industrial, Construction Consultants, Construction Estimates, Construction Management, Handyman Services, Home Builders, Landscape Contractors, Parking Stations & Garages-Construction, Residential Designers",,,A,41.41327,-81.50652,,,,"Mon - Fri: 8:00 am - 5:00 pm Sat: 12:00 pm - 5:00 pm",,,,,,http://www.apexconstructioncleveland.com,,,,,,,,,
728491,250408,"2020-09-27 02:54:43","Love's Enterprises LLC",http://www.lovesenterprisesllc.com,danielklove@hotmail.com,"(303) 816-9090",,Bailey,CO,80421,"Bailey,CO 80421","Landscaping & Lawn Services, Asphalt Paving & Sealcoating, Excavation Contractors, Landscape Contractors, Parking Lot Maintenance & Marking",,,,,,,"Serving With Integrity Since 1977.","The main goal of Love's Enterprises LLC is to do quality work that will please our clients today and for many years to come. All of our work is done with attention to detail, integrity, and uncompromising customer service. We have successfully operated Love's for the past 34 years and have thousands of happy and satisfied clients.","Mon - Sat: 7:00 am - 6:00 pm",,,,,,"Excavation, Landscaping, and Asphalt Maintenance",,,,,,,,,
728592,250442,"2020-09-27 02:54:43","Misty Mountain Sprinkler & Landscape",https://api.superpages.com/xml/search?SRC=ypintfeed&subaffiliate=DXC&PGID=e02.7182.8182845904523&SPGID=1583719287039.d2c18585&ADID=11885551&DEST=http%3A%2F%2Fsuperpages.mydex.com%2F2cx-XEOUoao&C=parking&T=Montrose&S=CO&PH=(970)%20765-7637&FL=url&TL=off&position=6&PS=30&PI=1&Results=FEED_CLCK&uid=d2c18585-61f3-440e-9fdd-282531814a3f&REF=&IP=51.158.165.18&UserAgent=Mozilla%2F5.0%20(Windows%20NT%2010.0%3B%20Win64%3B%20x64)%20AppleWebKit%2F537.36%20(KHTML%2C%20like%20Gecko)%20Chrome%2F70.0.3538.110%20Safari%2F537.36,mistymountain1@peoplepc.com,"(970) 765-7637","1808 Story Ln",Montrose,CO,81403,"1808 Story Ln,Montrose,CO 81403","Sprinklers-Garden & Lawn, Asphalt Paving & Sealcoating, Backflow Prevention Devices & Services, Brick-Clay-Common & Face, Gardeners, Irrigation Systems & Equipment, Landscape Contractors, Landscape Designers & Consultants, Landscaping & Lawn Services, Landscaping Equipment & Supplies, Nursery & Growers Equipment & Supplies, Parking Lot Maintenance & Marking, Sprinklers-Garden & Lawn, Installation & Service",5,"1 Review",A+,38.45717,-107.89257,,,"At Misty Mountain Sprinkler Systems, our landscapes speak for themselves. Our belief that you have more important things to do than baby-sit your landscape, leads us to design and install efficient, water wise and beautiful landscapes. We serve residential and commercial clients throughout the Montrose, CO area.The key to our efficiency is simplicity, and ease of maintenance.","Mon - Fri: 8:00 am - 5:00 pm",,,,,"Misty Mountain Sprinkler Systems and Landscapes","http://superpages.mydex.com/2cx-XEOUoao http://misty-mtn.com",,antony812,10/28/2012,five,"misty mountain was on time, fast, professional, and great to work with. we will use them agian",,,,
728868,250515,"2020-09-27 02:54:43","Barlow Landscaping, Excavation, Paving & Construction Corp.",,barlowpavingexcavating@verizon.net,"(413) 772-2155","77 Davis St",Greenfield,MA,01301,"77 Davis St,Greenfield,MA 01301","Driveway Contractors, Excavation Contractors, Landscape Contractors, Parking Lot Maintenance & Marking, Paving Contractors, Septic Tanks & Systems, Snow Removal Service",5,"1 Review",A+,42.59021,-72.60199,https://i3.ypcdn.com/blob/8e8b367171fe791dfd96a0cb1ade94f5b0ae755d_100x100_crop.jpg?63f80dd,,,"Mon - Fri: 7:30 am - 5:00 pm Sat - Sun: Open 24 Hours","Fax: (413) 772-2155",,,,"Barow Landcaping Excavation Paving & Construction Inc Barlow Landcaping Excavation Paving & Construction Inc Barow Landcaping Excavation",,,"Ghee G.",10/07/2017,five,"After we bricked off some space for flowers we decided to have the driveway done. They went right up to the brick, and the driveway is perfect. :) (If only the leaves would stop falling).",,,,
729802,250816,"2020-09-27 02:54:43",ASAP,http://sandsoutdoorservices.com,,"(505) 312-4221","310 Ranchitos Rd NE Unit A",Albuquerque,NM,87113,"310 Ranchitos Rd NE Unit A,Albuquerque,NM 87113","Sprinklers-Garden & Lawn, Installation & Service, Landscape Contractors, Landscaping & Lawn Services, Parking Lot Maintenance & Marking, Sweepers-Power",,,,35.16896,-106.61293,,"One Call Does It All.","ASAP Sands Outdoor Services, located in Albuquerque, NM, is a service company that reaches out to building owners and managers along with residential customers to give professional service to your property needs. ASAP Sands Outdoor Services focuses on high quality service and customer satisfaction. With over 30 years' experience, our customers find us to be readily available for emergencies, and we bring experience and trained employees to your property to give our customers peace of mind and a safe, reliable company to do business. ASAP Sands Outdoor Services includes: В• Parking lot sweeping В• Parking lot striping, signage В• Asphalt stenciling В• Minor asphalt repair and maintenance В• Commercial landscape maintenance В• Pressure washing for concrete sidewalks В• Complete grounds maintenance package Included in our grounds maintenance is mowing, plant care, weed control, re-landscape for greater water usage, sprinkler installation and repair, and xeriscape of existing landscapes. We are fully insured for your protection. We are available day or night to meet our customers' needs. We understand the importance of ""first impressions"" and we have the knowledge and the staff to greatly increase the appearance of your property. Call ASAP Sands Outdoor Services for more information.",,,,"mastercard, amex, cash, check, debit, discover, travelers checks, visa",,,http://sandsoutdoorservices.com,,,,,,,,,
730328,250994,"2020-09-27 02:54:43","Empire Companies LLC",,,"(203) 300-5024","2103 Eaton Ct",Danbury,CT,06811,"2103 Eaton Ct,Danbury,CT 06811","Janitorial Service, Landscape Contractors, Parking Lot Maintenance & Marking, Property Maintenance, Snow Removal Service",,,,41.42102,-73.42676,https://i3.ypcdn.com/blob/4ddc7e2338df632d40d795b2f3caa5dd506d0243_100x100_crop.jpg?63f80dd,"Empire Companies, LLC provides commercial and residential property maintenance services to the entire Tri-State area.","For over two decades, itВ’s been our mission to provide all of our clients with reliable, unbeatable services with 100% customer satisfaction as the end result. Whether you hire us for carpentry or parking lot striping, we will ensure that the work that we perform is of top quality. WeВ’re proud to be an industry leader throughout New England, and we couldnВ’t have done this without consistently great results and many happy clients.","Mon - Sun: 9:00 am - 5:00 pm",,,,,,,,,,,,,,,
730429,251031,"2020-09-27 02:54:54","Primrose Landscape",,,"(210) 291-3875","12354 Capeswood St","San Antonio",TX,78249,"12354 Capeswood St,San Antonio,TX 78249","Landscaping & Lawn Services, Irrigation Systems & Equipment, Landscape Contractors, Lawn Maintenance, Parking Lot Maintenance & Marking, Power Washing, Pressure Washing Equipment & Services, Sprinklers-Garden & Lawn, Sprinklers-Garden & Lawn, Installation & Service, Water Pressure Cleaning",,,,29.56169,-98.60757,,"San Antonio's premier landscape service contractor. Providing high-quality, detailed lawn maintenance service to residential & commercial clients in San Antonio & surrounding areas. Also, providing pressure washing & parking lot striping. Call today at (210) 291-3875..",,"Mon - Sun: Open 24 Hours","Phone: (210) 877-5678",,,,,,,,,,,,,,
732144,251638,"2020-09-27 02:54:54","Epic Lawn Care",,info@epiclawncare.com,"(952) 292-3183","1173 150th St W",Shakopee,MN,55379,"1173 150th St W,Shakopee,MN 55379","Lawn Maintenance, Landscape Contractors, Landscaping & Lawn Services, Parking Lot Maintenance & Marking, Snow Removal Service",,,,44.73269,-93.54483,,,,,,,,,,,,,,,,,,,
732984,251937,"2020-09-27 02:54:54","Aspen Custom Contractors",,kw021@msn.com,"(218) 481-0667","918 Minneapolis Ave",Duluth,MN,55803,"918 Minneapolis Ave,Duluth,MN 55803","Garages-Building & Repairing, Altering & Remodeling Contractors, Building Contractors, Building Contractors-Commercial & Industrial, Building Maintenance, Cabinet Makers, Cabinets, Gardeners, General Contractors, Home Builders, Home Improvements, Home Repair & Maintenance, Landscape Contractors, Landscaping & Lawn Services, Parking Lots & Garages",,,,46.84693,-92.07664,https://i4.ypcdn.com/blob/14871b1f39ab2cf41a44101f2a3946defbc72a97_100x100_crop.jpg?63f80dd,"Listening To Your Needs. To Create Your Vision.","Welcome to Aspen Custom Contractors! Aspen Custom Contractors is a full-service contractor offering a large variety of professional services ranging from home improvements and renovations to property landscaping and lawn services. Providing services to Duluth-Superior and the surrounding communities of Northern Minnesota & Wisconsin, any property renovation or maintenance project falls within our area of expertise. We've built our success on the quality of our work & our professional service. Our design team will work with you from the beginning stage of your project to that final Aspen Custom Contractors touch creating the spectacular results that are specifically suited for your personal needs and desires. Services include remodeling, renovations, garage construction, roofing & siding service, home patio, deck, fence installation, landscaping & garden services, full-service lawn care, demolition service, debris removal, foundation waterproofing & repairs, and snow removal. Aspen Custom Contractors provides service to both residential and commercial clients. Call or e-mail us for an appointment to go over your next project. We look forward to visiting with you.","By Appointment Only",,,"cash, check",,,,,,,,,,,,