business_x_category.id,business.id,business.ts,business.business_name,business.home_page,business.email_address,business.phone,business.street,business.city,business.state,business.zip_code,business.full_address,business.category,business.rating,business.number_of_reviews,business.bbb_rating_or_license,business.latitude,business.longitude,business.cover_image,business.slogan,business.general_info,business.regular_hours,business.extra_phones,business.services_products,business.payment,business.price_range,business.aka,business.other_links,business.other_information,business.review_1_name,business.review_1_date,business.review_1_rating,business.review_1_text,business.review_2_name,business.review_2_date,business.review_2_rating,business.review_2_text
16931693,2357834,"2020-09-27 06:19:24",Brookstone,http://www.brookstone.com,customerservice@brookstone.com,"(910) 705-4837","6430 Brookstone Ln",Fayetteville,NC,28314,"6430 Brookstone Ln,Fayetteville,NC 28314","Gift Shops, Battery Charging Equipment, Battery Supplies, Bedding, Beds & Bedroom Sets, Chairs, Collectibles, Consumer Electronics, Desk Pads & Accessories, Furniture Stores, Futons, Garden Centers, Home Furnishings, House Cleaning Equipment & Supplies, Linens, Massage Equipment & Supplies, Mirrors, Novelties, Office Furniture & Equipment, Online & Mail Order Shopping, Patio & Outdoor Furniture, Protective Covers, Toy Stores",,,A+,35.06062,-79.01,,,,"Mon - Fri: 8:30 am - 5:30 pm Sat: 9:00 am - 4:00 pm","Primary Phone: (910) 491-9173 Phone: (910) 864-3625 Primary Phone: (910) 864-3625 Fax: (910) 860-3418",,"no credit cards",,"Brookstone Apts Brookstone Apartments Brookstone Inc.",http://www.brookstone.com,"Specialties: Dads",,,,,,,,
16931752,2357846,"2020-09-27 06:19:24",Brookstone,http://www.brookstone.com,,"(406) 252-8770","1127 Alderson Ave",Billings,MT,59102,"1127 Alderson Ave,Billings,MT 59102","Gift Shops, Battery Charging Equipment, Battery Supplies, Bedding, Beds & Bedroom Sets, Chairs, Collectibles, Consumer Electronics, Desk Pads & Accessories, Furniture Stores, Futons, Garden Centers, Home Furnishings, House Cleaning Equipment & Supplies, Linens, Massage Equipment & Supplies, Mirrors, Novelties, Office Furniture & Equipment, Online & Mail Order Shopping, Patio & Outdoor Furniture, Protective Covers, Toy Stores",,,,45.78324,-108.545,,,,,,,,,"Brookstone Communications",http://www.brookstone.com,,,,,,,,,
16931791,2357852,"2020-09-27 06:19:24",Brookstone,http://www.brookstone.com,email@removed.com,"(302) 733-0717","747 Christiana Mall",Newark,DE,19702,"747 Christiana Mall,Newark,DE 19702","Gift Shops, Battery Charging Equipment, Battery Supplies, Bedding, Beds & Bedroom Sets, Chairs, Collectibles, Consumer Electronics, Desk Pads & Accessories, Furniture Stores, Futons, Garden Centers, Home Furnishings, House Cleaning Equipment & Supplies, Linens, Massage Equipment & Supplies, Mirrors, Novelties, Office Furniture & Equipment, Online & Mail Order Shopping, Patio & Outdoor Furniture, Protective Covers, Toy Stores",,,,39.68184,-75.65042,,,,"Mon - Sat: 10:00 am - 9:00 pm Sun: 11:00 am - 6:00 pm","Phone: (302) 733-0718",,"visa, all major credit cards, master card",,,http://www.brookstone.com,,,,,,,,,
16932268,2357969,"2020-09-27 06:19:24",Brookstone,http://www.brookstone.com,,"(412) 472-6750","1000 Airport Blvd # Ac-30c",Pittsburgh,PA,15231,"1000 Airport Blvd # Ac-30c,Pittsburgh,PA 15231","Gift Shops, Battery Charging Equipment, Battery Supplies, Bedding, Beds & Bedroom Sets, Chairs, Collectibles, Consumer Electronics, Desk Pads & Accessories, Furniture Stores, Futons, Garden Centers, Home Furnishings, House Cleaning Equipment & Supplies, Linens, Massage Equipment & Supplies, Mirrors, Novelties, Office Furniture & Equipment, Online & Mail Order Shopping, Patio & Outdoor Furniture, Protective Covers, Toy Stores",,,,40.49476,-80.25664,,,,"Mon - Fri: 5:00 am - 8:00 pm Sat: 5:00 am - 7:00 pm Sun: 5:00 am - 8:00 pm",,,,,,http://www.brookstone.com,,,,,,,,,
16932296,2357971,"2020-09-27 06:19:24",Brookstone,http://www.brookstone.com,,"(404) 669-9010","9700 Ralph David Abernathy Blvd SW",Atlanta,GA,30312,"9700 Ralph David Abernathy Blvd SW,Atlanta,GA 30312","Gift Shops, Battery Charging Equipment, Battery Supplies, Bedding, Beds & Bedroom Sets, Chairs, Collectibles, Consumer Electronics, Desk Pads & Accessories, Furniture Stores, Futons, Garden Centers, Home Furnishings, House Cleaning Equipment & Supplies, Linens, Massage Equipment & Supplies, Mirrors, Novelties, Office Furniture & Equipment, Online & Mail Order Shopping, Patio & Outdoor Furniture, Protective Covers, Toy Stores",,,,33.74675,-84.37813,,,,"Mon - Sun: 7:00 am - 10:00 pm",,,,,,http://www.brookstone.com,,,,,,,,,
16933347,2358250,"2020-09-27 06:19:33",Brookstone,http://www.brookstone.com,customerservice@brookstone.com,"(919) 792-2472","5959 Triangle Town Blvd Ste 2044",Raleigh,NC,27616,"5959 Triangle Town Blvd Ste 2044,Raleigh,NC 27616","Gift Shops, Battery Charging Equipment, Battery Supplies, Bedding, Beds & Bedroom Sets, Chairs, Collectibles, Consumer Electronics, Desk Pads & Accessories, Furniture Stores, Futons, Garden Centers, Home Furnishings, House Cleaning Equipment & Supplies, Linens, Massage Equipment & Supplies, Mirrors, Novelties, Office Furniture & Equipment, Online & Mail Order Shopping, Patio & Outdoor Furniture, Protective Covers, Toy Stores",,,,35.86679,-78.57384,,,,,"Phone: (919) 792-0119 Phone: (919) 792-0526 Phone: (919) 792-2499",,,,"Brookstone Inc.",http://www.brookstone.com,,,,,,,,,
16934688,2358627,"2020-09-27 06:19:33",Brookstone,http://www.brookstone.com,customerservice@brookstone.com,"(310) 553-2248","10250 Santa Monica Blvd Unit 95","Los Angeles",CA,90067,"10250 Santa Monica Blvd Unit 95,Los Angeles,CA 90067","Gift Shops, Battery Charging Equipment, Battery Supplies, Bedding, Beds & Bedroom Sets, Chairs, Collectibles, Consumer Electronics, Desk Pads & Accessories, Furniture Stores, Futons, Garden Centers, Home Furnishings, House Cleaning Equipment & Supplies, Linens, Massage Equipment & Supplies, Mirrors, Novelties, Office Furniture & Equipment, Online & Mail Order Shopping, Patio & Outdoor Furniture, Protective Covers, Toy Stores",,,,34.05996,-118.41982,,,,"Mon - Sat: 10:00 am - 9:00 pm Sun: 12:30 pm - 7:00 pm",,,"check, debit, amex, discover",,"Brookstone Inc.",http://www.brookstone.com,"Specialties: Dads",,,,,,,,
16935177,2358769,"2020-09-27 06:19:33",Brookstone,http://www.brookstone.com,,"(631) 724-9745","145 Smith Haven Mall","Lake Grove",NY,11755,"145 Smith Haven Mall,Lake Grove,NY 11755","Gift Shops, Battery Charging Equipment, Battery Supplies, Bedding, Beds & Bedroom Sets, Chairs, Collectibles, Consumer Electronics, Desk Pads & Accessories, Furniture Stores, Futons, Garden Centers, Home Furnishings, House Cleaning Equipment & Supplies, Linens, Massage Equipment & Supplies, Mirrors, Novelties, Office Furniture & Equipment, Online & Mail Order Shopping, Patio & Outdoor Furniture, Protective Covers, Toy Stores",,,,40.86469,-73.12786,,,,"Mon - Sat: 10:00 am - 9:30 pm Sun: 11:00 am - 7:00 pm",,,,,,http://www.brookstone.com,,,,,,,,,
16935335,2358812,"2020-09-27 06:19:33",Brookstone,http://www.brookstone.com,,"(718) 917-8368","JFK International Airport Terminal 8 Main Terminal",Jamaica,NY,11430,"JFK International Airport Terminal 8 Main Terminal,Jamaica,NY 11430","Gift Shops, Battery Charging Equipment, Battery Supplies, Bedding, Beds & Bedroom Sets, Chairs, Collectibles, Consumer Electronics, Desk Pads & Accessories, Furniture Stores, Futons, Garden Centers, Home Furnishings, House Cleaning Equipment & Supplies, Linens, Massage Equipment & Supplies, Mirrors, Novelties, Office Furniture & Equipment, Online & Mail Order Shopping, Patio & Outdoor Furniture, Protective Covers, Toy Stores",,,,40.646763,-73.78867,,,,"Mon - Sun: 6:00 am - 10:00 pm","Phone: (718) 995-0980",,"all major credit cards, discover, mastercard, visa, amex",,,http://www.brookstone.com,"Wheelchair Accessible: Yes",,,,,,,,
16935610,2358876,"2020-09-27 06:19:33",Brookstone,http://www.brookstone.com,customerservice@brookstone.com,"(714) 630-1600","1655 Bassford Dr",Anaheim,CA,92801,"1655 Bassford Dr,Anaheim,CA 92801","Gift Shops, Battery Charging Equipment, Battery Supplies, Bedding, Beds & Bedroom Sets, Chairs, Collectibles, Consumer Electronics, Desk Pads & Accessories, Furniture Stores, Futons, Garden Centers, Home Furnishings, House Cleaning Equipment & Supplies, Linens, Massage Equipment & Supplies, Mirrors, Novelties, Office Furniture & Equipment, Online & Mail Order Shopping, Patio & Outdoor Furniture, Protective Covers, Toy Stores",,,,,,,,,,,,"master card, visa",,"Brookstone Inc.",http://www.brookstone.com,"Specialties: Father's Day, Cabinetry, Pillows, Cumpleanos, Fountains, Furniture, Furnishings, Anniversaries, Luggage, Lighting, Timepieces, Dads, Couches, Batteries, S, Retirements, Mirrors, Xmas, Sofas, Chairs, Housewarming, Clocks, Christmas, Office Equipment, Love Seats, Cabinets, Appliances, Birthdays, Electronics",,,,,,,,
16935808,2358931,"2020-09-27 06:19:33",Brookstone,http://www.brookstone.com,,"(305) 871-1069","2100 NW 42nd Ave",Miami,FL,33126,"2100 NW 42nd Ave,Miami,FL 33126","Gift Shops, Battery Charging Equipment, Battery Supplies, Bedding, Beds & Bedroom Sets, Chairs, Collectibles, Consumer Electronics, Desk Pads & Accessories, Furniture Stores, Futons, Garden Centers, Home Furnishings, House Cleaning Equipment & Supplies, Linens, Massage Equipment & Supplies, Mirrors, Novelties, Office Furniture & Equipment, Online & Mail Order Shopping, Patio & Outdoor Furniture, Protective Covers, Toy Stores",,,,25.776255,-80.29193,,,,"Mon - Sun: 5:30 am - 9:30 pm",,,,,,http://www.brookstone.com,,,,,,,,,
16936204,2359035,"2020-09-27 06:19:43",Brookstone,http://www.brookstone.com,customerservice@brookstone.com,"(713) 467-9569","900 Gessner Rd",Houston,TX,77024,"900 Gessner Rd,Houston,TX 77024","Gift Shops, Battery Charging Equipment, Battery Supplies, Bedding, Beds & Bedroom Sets, Chairs, Collectibles, Consumer Electronics, Desk Pads & Accessories, Furniture Stores, Futons, Garden Centers, Home Furnishings, House Cleaning Equipment & Supplies, Linens, Massage Equipment & Supplies, Mirrors, Novelties, Office Furniture & Equipment, Online & Mail Order Shopping, Patio & Outdoor Furniture, Protective Covers, Toy Stores",,,,29.77915,-95.5444,,,,"Mon - Sat: 10:00 am - 9:00 pm Sun: 11:00 am - 7:00 pm","Phone: (713) 467-9598",,"master card, visa",,,http://www.brookstone.com,,,,,,,,,
16936347,2359065,"2020-09-27 06:19:43",Brookstone,http://www.brookstone.com,customerservice@brookstone.com,"(626) 446-6598","400 S Baldwin Ave Ste 424",Arcadia,CA,91007,"400 S Baldwin Ave Ste 424,Arcadia,CA 91007","Gift Shops, Battery Charging Equipment, Battery Supplies, Bedding, Beds & Bedroom Sets, Chairs, Collectibles, Consumer Electronics, Desk Pads & Accessories, Furniture Stores, Futons, Garden Centers, Home Furnishings, House Cleaning Equipment & Supplies, Linens, Massage Equipment & Supplies, Mirrors, Novelties, Office Furniture & Equipment, Online & Mail Order Shopping, Patio & Outdoor Furniture, Protective Covers, Toy Stores",,,,34.1371,-118.0517,,,,"Mon - Sat: 10:00 am - 9:00 pm Sun: 11:00 am - 7:00 pm","TollFree: (800) 846-3000",,"master card, visa, all major credit cards",,"Brookstone Inc. Brookstone Co",http://www.brookstone.com,"Parking: Lot, Private Price Range : Above Average Bike Parking: No Specialties: Father's Day, Cabinetry, Pillows, Cumpleanos, Fountains, Furniture, Furnishings, Anniversaries, Luggage, Lighting, Timepieces, Dads, Couches, Batteries, S, Retirements, Mirrors, Xmas, Sofas, Chairs, Housewarming, Clocks, Christmas, Office Equipment, Love Seats, Cabinets, Appliances, Birthdays, Electronics",,,,,,,,
16936891,2359212,"2020-09-27 06:19:43",Brookstone,http://www.brookstone.com,customerservice@brookstone.com,"(714) 257-0118","2015 Brea Mall",Brea,CA,92821,"2015 Brea Mall,Brea,CA 92821","Gift Shops, Battery Charging Equipment, Battery Supplies, Bedding, Beds & Bedroom Sets, Chairs, Collectibles, Consumer Electronics, Desk Pads & Accessories, Furniture Stores, Futons, Garden Centers, Home Furnishings, House Cleaning Equipment & Supplies, Linens, Massage Equipment & Supplies, Mirrors, Novelties, Office Furniture & Equipment, Online & Mail Order Shopping, Patio & Outdoor Furniture, Protective Covers, Toy Stores",,,,33.91295,-117.88611,,,,"Mon - Sat: 10:00 am - 9:00 pm Sun: 11:00 am - 7:00 pm","Phone: (714) 257-0111",,"master card, visa, all major credit cards",,"Brookstone Co. Brookstone Inc.",http://www.brookstone.com,"Bike Parking: Yes Specialties: Dads",,,,,,,,
16937313,2359318,"2020-09-27 06:19:43",Brookstone,http://www.brookstone.com,customerservice@brookstone.com,"(314) 727-5799","2448 Saint Louis Galleria","Saint Louis",MO,63117,"2448 Saint Louis Galleria,Saint Louis,MO 63117","Gift Shops, Battery Charging Equipment, Battery Supplies, Bedding, Beds & Bedroom Sets, Chairs, Collectibles, Consumer Electronics, Desk Pads & Accessories, Furniture Stores, Futons, Garden Centers, Home Furnishings, House Cleaning Equipment & Supplies, Linens, Massage Equipment & Supplies, Mirrors, Novelties, Office Furniture & Equipment, Online & Mail Order Shopping, Patio & Outdoor Furniture, Protective Covers, Toy Stores",,,,38.63309,-90.3477,,,,"Mon - Sat: 10:00 am - 9:00 pm Sun: 11:00 am - 6:00 pm","Phone: (314) 727-5797",,"all major credit cards, master card, visa",,,http://www.brookstone.com,"Price Range : Average",,,,,,,,
16938288,2359586,"2020-09-27 06:19:43",Brookstone,http://www.brookstone.com,customerservice@brookstone.com,"(602) 256-9060","340 E Palm Ln",Phoenix,AZ,85004,"340 E Palm Ln,Phoenix,AZ 85004","Gift Shops, Battery Charging Equipment, Battery Supplies, Bedding, Beds & Bedroom Sets, Chairs, Collectibles, Consumer Electronics, Desk Pads & Accessories, Furniture Stores, Futons, Garden Centers, Home Furnishings, House Cleaning Equipment & Supplies, Linens, Massage Equipment & Supplies, Mirrors, Novelties, Office Furniture & Equipment, Online & Mail Order Shopping, Patio & Outdoor Furniture, Protective Covers, Toy Stores",,,,33.47033,-112.06836,,,,,,,"master card, visa",,"Brookstone Inc.",http://www.brookstone.com,"Specialties: Dads",,,,,,,,
16938731,2359711,"2020-09-27 06:19:43",Brookstone,http://www.brookstone.com,customerservice@brookstone.com,"(386) 226-2653","1700 W International Speedway Blvd Ste 114","Daytona Beach",FL,32114,"1700 W International Speedway Blvd Ste 114,Daytona Beach,FL 32114","Gift Shops, Battery Charging Equipment, Battery Supplies, Bedding, Beds & Bedroom Sets, Chairs, Collectibles, Consumer Electronics, Desk Pads & Accessories, Furniture Stores, Futons, Garden Centers, Home Furnishings, House Cleaning Equipment & Supplies, Linens, Massage Equipment & Supplies, Mirrors, Novelties, Office Furniture & Equipment, Online & Mail Order Shopping, Patio & Outdoor Furniture, Protective Covers, Toy Stores",,,,29.19626,-81.06478,,,,,,,,,"Brookstone Inc.",http://www.brookstone.com,"Specialties: Dads",,,,,,,,
16938763,2359716,"2020-09-27 06:19:43",Brookstone,http://www.brookstone.com,customerservice@brookstone.com,"(707) 526-5233","1027 Santa Rosa Plz","Santa Rosa",CA,95401,"1027 Santa Rosa Plz,Santa Rosa,CA 95401","Gift Shops, Battery Charging Equipment, Battery Supplies, Bedding, Beds & Bedroom Sets, Chairs, Collectibles, Consumer Electronics, Desk Pads & Accessories, Furniture Stores, Futons, Garden Centers, Home Furnishings, House Cleaning Equipment & Supplies, Linens, Massage Equipment & Supplies, Mirrors, Novelties, Office Furniture & Equipment, Online & Mail Order Shopping, Patio & Outdoor Furniture, Protective Covers, Toy Stores",,,,38.43969,-122.71766,,,,"Mon - Fri: 10:00 am - 9:00 pm Sat: 10:00 am - 8:00 pm Sun: 11:00 am - 6:00 pm","Phone: (707) 526-5235 Fax Number: (707) 526-5235",,"master card, visa, all major credit cards",,"Brookstone Co Brookstone Inc.",http://www.brookstone.com,"Specialties: Father's Day, Cabinetry, Pillows, Cumpleanos, Fountains, Furniture, Furnishings, Anniversaries, Luggage, Lighting, Timepieces, Dads, Couches, Batteries, S, Retirements, Mirrors, Xmas, Sofas, Chairs, Housewarming, Clocks, Christmas, Office Equipment, Love Seats, Cabinets, Appliances, Birthdays, Electronics",,,,,,,,
16939007,2359775,"2020-09-27 06:19:43","The Woodlands Mall",https://www.thewoodlandsmall.com/en.html?cmpid=lc_yext_yext_other_o_none&utm_medium=local&utm_source=other&utm_content=none,woodlandsadmin@ggp.com,"(281) 363-3363","1201 Lake Woodlands Dr",Spring,TX,77380,"1201 Lake Woodlands Dr,Spring,TX 77380","Gift Shops, Battery Charging Equipment, Battery Supplies, Bedding, Beds & Bedroom Sets, Chairs, Collectibles, Consumer Electronics, Desk Pads & Accessories, Furniture Stores, Futons, Garden Centers, Home Furnishings, House Cleaning Equipment & Supplies, Linens, Massage Equipment & Supplies, Mirrors, Novelties, Office Furniture & Equipment, Online & Mail Order Shopping, Patio & Outdoor Furniture, Protective Covers, Toy Stores",,,,30.1671,-95.45391,https://i3.ypcdn.com/blob/dea0d451c2511a87ec8c1fee3b33cd32fd6b7474_100x100_crop.jpg?d9a04b5,,"Come visit The Woodlands Mall, a premier fashion center in north Houston situated in one of the most dynamic communities in the country. Explore a distinguished collection of over 160 exciting stores and inspiring restaurants just 30 minutes north of Houston.","Mon - Sat: 10:00 am - 9:00 pm Sun: 12:00 pm - 6:00 pm",,,,,,https://www.thewoodlandsmall.com/en.html,"Specialties: Dads",,,,,,,,
16939312,2359867,"2020-09-27 06:19:43","Brookstone Estates of Paris",https://www.seniorlifestyle.com/property/brookstone-estates-pa,customerservice@brookstone.com,"(812) 645-3994","146 Brookstone Est",Paris,IL,61944,"146 Brookstone Est,Paris,IL 61944","Gift Shops, Battery Charging Equipment, Battery Supplies, Bedding, Beds & Bedroom Sets, Chairs, Collectibles, Consumer Electronics, Desk Pads & Accessories, Furniture Stores, Futons, Garden Centers, Home Furnishings, House Cleaning Equipment & Supplies, Linens, Massage Equipment & Supplies, Mirrors, Novelties, Office Furniture & Equipment, Online & Mail Order Shopping, Patio & Outdoor Furniture, Protective Covers, Toy Stores",,,,39.61322,-87.69763,https://i4.ypcdn.com/blob/fde0133cda2e2a4e2460a346ad23ece450b09e2d_100x100_crop.jpg?41e4770,,"Brookstone Estates of Paris provides Paris, Illinois with Independent Living and Supportive Living options in a warm and welcomig atmosphere.","Mon - Sun: Open 24 Hours",,,insurance,,,website,"Specialties: Dads",,,,,,,,
16940651,2360215,"2020-09-27 06:19:49",Brookstone,http://www.brookstone.com,,"(713) 845-6631","7800 Airport Blvd",Houston,TX,77061,"7800 Airport Blvd,Houston,TX 77061","Gift Shops, Battery Charging Equipment, Battery Supplies, Bedding, Beds & Bedroom Sets, Chairs, Collectibles, Consumer Electronics, Desk Pads & Accessories, Furniture Stores, Futons, Garden Centers, Home Furnishings, House Cleaning Equipment & Supplies, Linens, Massage Equipment & Supplies, Mirrors, Novelties, Office Furniture & Equipment, Online & Mail Order Shopping, Patio & Outdoor Furniture, Protective Covers, Toy Stores",,,,29.65776,-95.2753,,,,"Mon - Fri: 6:00 am - 9:00 pm Sat: 6:00 am - 8:00 pm Sun: 6:00 am - 9:00 pm",,,"amex, debit, diners club, discover, master card, visa",,,http://www.brookstone.com,,,,,,,,,
16941143,2360342,"2020-09-27 06:19:49",Brookstone,http://www.brookstone.com,,"(704) 979-0295","8111 Concord Mills Blvd Ste 2",Concord,NC,28027,"8111 Concord Mills Blvd Ste 2,Concord,NC 28027","Gift Shops, Battery Charging Equipment, Battery Supplies, Bedding, Beds & Bedroom Sets, Chairs, Collectibles, Consumer Electronics, Desk Pads & Accessories, Furniture Stores, Futons, Garden Centers, Home Furnishings, House Cleaning Equipment & Supplies, Linens, Massage Equipment & Supplies, Mirrors, Novelties, Office Furniture & Equipment, Online & Mail Order Shopping, Patio & Outdoor Furniture, Protective Covers, Toy Stores",,,,35.37132,-80.7185,,,,,,,,,,http://www.brookstone.com,,,,,,,,,
16941617,2360466,"2020-09-27 06:19:49",Brookstone,http://www.brookstone.com,,"(614) 221-3520","103 City Center Dr",Columbus,OH,43215,"103 City Center Dr,Columbus,OH 43215","Gift Shops, Battery Charging Equipment, Battery Supplies, Bedding, Beds & Bedroom Sets, Chairs, Collectibles, Consumer Electronics, Desk Pads & Accessories, Furniture Stores, Futons, Garden Centers, Home Furnishings, House Cleaning Equipment & Supplies, Linens, Massage Equipment & Supplies, Mirrors, Novelties, Office Furniture & Equipment, Online & Mail Order Shopping, Patio & Outdoor Furniture, Protective Covers, Toy Stores",,,,39.960476,-82.99756,,,,,,,,,,http://www.brookstone.com,,,,,,,,,
16942441,2360705,"2020-09-27 06:19:49",Brookstone,http://www.brookstone.com,customerservice@brookstone.com,"(706) 494-1188","506 Manchester Expy",Columbus,GA,31904,"506 Manchester Expy,Columbus,GA 31904","Gift Shops, Battery Charging Equipment, Battery Supplies, Bedding, Beds & Bedroom Sets, Chairs, Collectibles, Consumer Electronics, Desk Pads & Accessories, Furniture Stores, Futons, Garden Centers, Home Furnishings, House Cleaning Equipment & Supplies, Linens, Massage Equipment & Supplies, Mirrors, Novelties, Office Furniture & Equipment, Online & Mail Order Shopping, Patio & Outdoor Furniture, Protective Covers, Toy Stores",,,,32.50615,-84.98576,,,,,,,,,"BROOKSTONE FULL GOSPEL BAPTIST CHURCH Brookstone Inc. Brookstone Full Gospel Baptist",http://www.brookstone.com,"Specialties: Dads",,,,,,,,
16943312,2360946,"2020-09-27 06:19:49",Brookstone,http://www.brookstone.com,,"(210) 822-3167","6800 Airport Blvd","San Antonio",TX,78216,"6800 Airport Blvd,San Antonio,TX 78216","Gift Shops, Battery Charging Equipment, Battery Supplies, Bedding, Beds & Bedroom Sets, Chairs, Collectibles, Consumer Electronics, Desk Pads & Accessories, Furniture Stores, Futons, Garden Centers, Home Furnishings, House Cleaning Equipment & Supplies, Linens, Massage Equipment & Supplies, Mirrors, Novelties, Office Furniture & Equipment, Online & Mail Order Shopping, Patio & Outdoor Furniture, Protective Covers, Toy Stores",,,,29.533386,-98.49751,,,,"Mon: 5:00 am - 9:30 pm Tue: 5:00 am - 11:15 pm Wed: 5:00 am - 9:30 pm Thu: 5:00 am - 11:15 pm Fri: 5:00 am - 9:30 pm Sat: 5:00 am - 9:00 pm Sun: 5:00 am - 11:15 am",,,,,,http://www.brookstone.com,,,,,,,,,
16943611,2361016,"2020-09-27 06:19:57",Brookstone,http://www.brookstone.com,,"(217) 347-5871","1101 N Maple St",Effingham,IL,62401,"1101 N Maple St,Effingham,IL 62401","Gift Shops, Battery Charging Equipment, Battery Supplies, Bedding, Beds & Bedroom Sets, Chairs, Collectibles, Consumer Electronics, Desk Pads & Accessories, Furniture Stores, Futons, Garden Centers, Home Furnishings, House Cleaning Equipment & Supplies, Linens, Massage Equipment & Supplies, Mirrors, Novelties, Office Furniture & Equipment, Online & Mail Order Shopping, Patio & Outdoor Furniture, Protective Covers, Toy Stores",,,,39.13543,-88.55095,,,,"24 Hours Emergency",,,,,"Brookstone Inc Brookstone Estates",http://www.brookstone.com,,,,,,,,,
16945663,2361559,"2020-09-27 06:19:58",Brookstone,http://www.brookstone.com,,"(251) 621-3898","30500 State Highway 181",Daphne,AL,36527,"30500 State Highway 181,Daphne,AL 36527","Gift Shops, Battery Charging Equipment, Battery Supplies, Bedding, Beds & Bedroom Sets, Chairs, Collectibles, Consumer Electronics, Desk Pads & Accessories, Furniture Stores, Futons, Garden Centers, Home Furnishings, House Cleaning Equipment & Supplies, Linens, Massage Equipment & Supplies, Mirrors, Novelties, Office Furniture & Equipment, Online & Mail Order Shopping, Patio & Outdoor Furniture, Protective Covers, Toy Stores",,,,30.66974,-87.84944,,,,,,,,,,http://www.brookstone.com,,,,,,,,,