business_x_category.id,business.id,business.ts,business.business_name,business.home_page,business.email_address,business.phone,business.street,business.city,business.state,business.zip_code,business.full_address,business.category,business.rating,business.number_of_reviews,business.bbb_rating_or_license,business.latitude,business.longitude,business.cover_image,business.slogan,business.general_info,business.regular_hours,business.extra_phones,business.services_products,business.payment,business.price_range,business.aka,business.other_links,business.other_information,business.review_1_name,business.review_1_date,business.review_1_rating,business.review_1_text,business.review_2_name,business.review_2_date,business.review_2_rating,business.review_2_text
3321067,1087483,"2020-09-27 04:16:21","King's Market",http://www.kings-market.com,kingsadmin@rockisland.com,"(360) 378-4505","160 Spring St","Friday Harbor",WA,98250,"160 Spring St,Friday Harbor,WA 98250","Delicatessens, Liquor Stores, Meat Markets, Restaurants, Supermarkets & Super Stores",5,"1 Review",,48.53457,-123.0169,,,,"Mon - Sun: 7:30 am - 9:00 pm","Phone: (360) 378-4591 Fax Number: (360) 378-6411",,"all major credit cards",,"Valmark Inc King's Market Meat Dept King's Market Meat Department King's Market Meat Department King's Supermarkets Kings Market Thriftway","http://www.kings-market.com http://www.kings-market.com/marine.html","Parking: Street Wheelchair Accessible: Yes Price Range : Above Average","Tim K.",05/09/2014,five,"Nicely run store--prices a little higher but considering location and island nature, probably to be expected (goods are more expensive to truck them into SJI). Really wonderful staff and nice selection.",,,,
3321806,1087893,"2020-09-27 04:16:22","Lunardi's Markets",http://www.lunardis.com,customerservice@lunardis.com,"(925) 464-1572","1600 Palos Verdes Mall","Walnut Creek",CA,94597,"1600 Palos Verdes Mall,Walnut Creek,CA 94597","Grocery Stores, Bakeries, Caterers, Delicatessens, Liquor Stores, Meat Markets, Restaurants, Wine",5,"1 Review",,37.9251,-122.08802,https://i1.ypcdn.com/blob/6013114167bc8c6fad1713dee4efed53cf3f1b98_100x100_crop.jpg?f9d23e1,,"Lunardi's Markets is a family-owned business with one of its locations in Walnut Creek, Calif. It has various departments, including meat, produce, seafood, wine, deli and bakery. The store s poultry items are natural and free from steroids, hormones, antibiotics and chemicals. Its liquor department offers a selection of premium spirits and wines. The store also customizes gourmet wine, cheese baskets and wine gift packs. Its produce department provides organic and conventionallygrown vegetables. The store also has a special cheese department that offers a variety of cheese, such as pecorino, fontina, Spanish manchego, blue costello and Bulgarian feta. Lunardi's Markets additionally operates more than five stores in California.","Mon - Sun: 7:30 am - 9:00 pm",,,"all major credit cards",,,http://www.lunardis.com,"Parking: Lot, Private Bike Parking: Yes Wheelchair Accessible: Yes",mtejen,11/29/2007,five,"If you haven't been to Lunardi's, you've got to check it out. They have specialty foods, and their deli and hot food selection is to die for (as are their bakery items!). They have a beautiful meat counter that takes up the back wall of the store, and many meats are stuffed and ready to cook, which makes it great for those nice you don't feel like putting much effort into cooking.",,,,
3323406,1088803,"2020-09-27 04:16:32","Schmick's Market",http://www.schmicksmarket.com,schmicksmarket@gmail.com,"(308) 872-2836","1110 S B St","Broken Bow",NE,68822,"1110 S B St,Broken Bow,NE 68822","Grocery Stores, Liquor Stores, Meat Markets, Supermarkets & Super Stores",,,,41.40408,-99.64318,,,,"Mon - Sun: 6:00 am - 10:00 pm",,,"all major credit cards, amex, master card, visa",,"Schmicks Market INC",http://www.schmicksmarket.com,"Parking: Lot",,,,,,,,
3324513,1089430,"2020-09-27 04:16:37","Warren's Market",http://www.auction-is-action.com,,"(530) 673-2848","97 Clark Ave","Yuba City",CA,95991,"97 Clark Ave,Yuba City,CA 95991","Grocery Stores, Liquor Stores, Meat Markets, Supermarkets & Super Stores",,,,39.12506,-121.62446,,,,"Mon - Fri: 7:00 am - 10:00 pm Sat: 7:00 am - 9:30 pm Sun: 7:00 am - 9:00 pm",,,"amex, cash, check, discover, master card, visa, all major credit cards",,,http://www.auction-is-action.com,"Parking: Lot, Private",,,,,,,,
3326080,1090326,"2020-09-27 04:16:39","Pat's Food Center and Do it Best Hardware",http://www.patsfoodcenter.com,patsfoodcenter@spartanstores.com,"(989) 695-9821","7620 Midland Rd",Freeland,MI,48623,"7620 Midland Rd,Freeland,MI 48623","Liquor Stores, Caterers, Grocery Stores, Hardware Stores, Meat Markets",2,"1 Review",,43.51987,-84.1206,https://i1.ypcdn.com/blob/1b41d56aab22dc473928fc304c0190628e16267b_100x100_crop.jpg?f9d23e1,,,"Mon - Sat: 6:30 am - 10:00 pm Sun: 7:30 am - 10:00 pm","9896959821: (989) 692-6834",,"visa, master card, amex, discover, cash, travelers checks, check, debit",,,"Great people, great service.","Parking: Lot, Private Price Range : Average","Janet M.",07/15/2016,two,"The meat has so much MSG, no more local, and prices are high, really has gone cheap in products and food.",,,,
3326525,1090592,"2020-09-27 04:16:39","Keg Package and Cork Room",http://thekegpackage.com,thekegpackage@yahoo.com,"(318) 247-8403","670 Tarbutton Rd",Ruston,LA,71270,"670 Tarbutton Rd,Ruston,LA 71270","Beer & Ale, Liquor Stores, Meat Markets, Novelties, Wine",,,,32.53785,-92.67803,,,"In business since since 1972New locationjust built in 2013Huge shopping areaFriendly and helpful staffLocally/familyowned and operated","Mon - Sat Closed","Fax: (318) 247-8060",,"cash, all major credit cards",,,"Great pics of store and inventory",,,,,,,,,
3327383,1091101,"2020-09-27 04:16:44","Pettys meat Market",http://pettysmeatmarket.com/,,"(321) 622-3252","6115 N Wickham Rd",Melbourne,FL,32940,"6115 N Wickham Rd,Melbourne,FL 32940","Meat Markets, Caterers, Delicatessens, Gourmet Shops, Grocery Stores, Liquor Stores, Restaurants, Wine",4,"1 Review",,28.21107,-80.67158,,,"If you need Steak/Seaood, Wine, delicatessen items, catering, or gift baskets they all be found here. PettyВ’s Meat Market precepts of giving excellent customer service and offering only the highest quality of meats that have continued to attract customers from all over the United States. PettyВ’s offers only the finest USDA Choice Angus, Grassfed, and freshly cut to your specifications. A full line of natural beef and poultry that is hormone free is also available,along with a vast presentation of oven ready dinners to tempt ones palate.A generous seafood section is stocked daily with fresh delights.Choose from over 50 homemade salads from our full service deli that have been created by PettyВ’s chefs throughout the years. Feel free to sample any of the offerings.Gourmet sausages, soups and daily hot specials await you.Try one of PettyВ’s famous overstuffed sandwiches made with Boars Head products and only the freshest of ingredients. A variety of bakery items from mouth-watering desserts to baked breads are also available.The cheese department consists of an array of domestic and imported cheeses to entice ones fancy.Grocery shelves are stocked with epicurean delights reflecting ethnic preferences from around the world. If youВ’re looking for a delectable dip, you do not want to pass up our aisle of over 30 varieties made daily on the premises. If wine is your pleasure, PettyВ’s is your treasure, offering over 2000 labels from the best domestic and foreign vintners at all price levels. Tasting is encouraged daily!","Mon - Sat: 10:00 am - 7:00 pm Sun Closed",,,"all major credit cards, amex, visa, discover, mastercard",,,"http://pettysmeatmarket.com http://www.pettysmeatmarket.com","Parking: Free Bike Parking: Yes Wheelchair Accessible: Yes Specialties: Parties, Fiestas","Ruby M.",05/07/2015,four,"Great thing that I found out about this place. I have been looking for a great place to go to if ever I need something in my house, they are so great here.",,,,
3328386,1091671,"2020-09-27 04:16:45","Piedmont Grocery",,,"(510) 987-8265","4038 Piedmont Ave",Oakland,CA,94611,"4038 Piedmont Ave,Oakland,CA 94611","Caterers, Grocery Stores, Liquor Stores, Meat Markets, Restaurants, Supermarkets & Super Stores, Wine",,,,37.8253,-122.25272,,,,,,,,,,,,,,,,,,,
3328451,1091712,"2020-09-27 04:16:45","South Washington Rd Food Market",,,"(517) 882-1322","6065 S Washington Ave",Lansing,MI,48911,"6065 S Washington Ave,Lansing,MI 48911","Grocery Stores, Liquor Stores, Meat Markets, Supermarkets & Super Stores",,,,42.66966,-84.56235,,,,"Mon - Sat: 9:00 am - 11:00 pm Sun: 9:00 am - 10:00 pm","Phone: (517) 882-1312",,"debit, mastercard, visa, discover",,"South Washington Road Food Mkt South Washington Road Food Market",,"Parking: Lot, Free Wheelchair Accessible: Yes Services: Medical Services",,,,,,,,
3328460,1091717,"2020-09-27 04:16:45","Carniceria y Licoreria El Torito",https://carniceriaeltoritocicero.com,,"(708) 780-0655","5830 W 16th St",Cicero,IL,60804,"5830 W 16th St,Cicero,IL 60804","Meat Markets, Butchering, Grocery Stores, Liquor Stores",,,,41.85827,-87.77061,https://i1.ypcdn.com/blob/e09a757c5e0dec0bbef1011da9d952a47dde9fd3_100x100_crop.jpg?f9d23e1,,"Carniceria y Licoreria El Torito, in Cicero, IL, is the area's leading grocery store serving Oak Lawn, Berwyn, Stickney, Riverside, Chicago and surrounding areas since 1996. We carry carnitas, barbacoa, chicarron, tortillas, canned goods, cereal, fresh produce, ice, charcoal, liquor, beer and much more. For your next grocery shopping, visit Carniceria y Licoreria El Torito in Cicero.","Mon - Sat: 7:00 am - 10:00 pm Sun: 7:00 am - 11:00 pm",,,"visa, mastercard, amex, discover, cash",,,"Primary Website",,,,,,,,,
3330521,1092886,"2020-09-27 04:16:47","Rayl's Market",,,"(330) 385-1343","246 W 4th St","East Liverpool",OH,43920,"246 W 4th St,East Liverpool,OH 43920","Grocery Stores, Grocers-Specialty Foods, Liquor Stores, Meat Markets, Supermarkets & Super Stores",,,,40.6195,-80.58389,,,,"Mon - Sun: 8:00 am - 11:00 pm",,,,,,,,,,,,,,,
3334195,1094992,"2020-09-27 04:17:05","Jim's Fallbrook Market",http://www.jimsfallbrookmarket.com,,"(818) 347-5525","5947 Fallbrook Ave","Woodland Hills",CA,91367,"5947 Fallbrook Ave,Woodland Hills,CA 91367","Liquor Stores, Beer & Ale, Butchering, Delicatessens, Dry Ice, Fish & Seafood Markets, Food Processing & Manufacturing, Fruit & Vegetable Markets, Grocery Stores, Meat Markets, Meat Processing, Natural Foods, Restaurants, Sandwich Shops, Wine",5,"4 Reviews",,34.17877,-118.62371,https://i1.ypcdn.com/blob/f3e076033229cdab8e6aad863c59fd0f1f72019e_100x100_crop.jpg?f9d23e1,"Your Neighborhood Grocer Since 1952.","Since 1952 Jim's Fallbrook Market has been serving the San Fernando Valley. Family Owned and Operated, we are dedicated to providing outstanding customer service. Our knowledgeable butchers still cut meat the old fashion way...by hand, we are happy to cut meat to your needs. Looking for something more exotic, elk, bison, ostrich or alligator? We can get that too! Fresh Seafood, groceries, fresh produce, craft beers, large keg beer selection, and an expansive wine collection makes Jim's the place to shop for your next meal! Don't missed our weekend BBQ Saturday and Sunday 10 - 5, you can smell us cooking!","Mon - Sat: 9:00 am - 7:00 pm Sun: 10:00 am - 5:00 pm",,,"discover, visa, check, diners club, mastercard",,,http://www.jimsfallbrookmarket.com,"Parking: Lot, Private Bike Parking: Yes Wheelchair Accessible: Yes Attire: Casual Takes Reservations: No Outdoor Seating: Yes Price Range : Average",pete707320,05/23/2012,five,"THE ?STAFF?THAIR,. ARE THE BEST!!!! ???~PETE~??? PETE707320@gmail.com",alfiemaxter,08/10/2011,five,"This place is a vegetarian's dream grocery store, with a focus on natural and organic goods and a gargantuan selection of fruits, vegetables and vegan products. But carnivores won't feel neglected, as stores also boast a vast selection of top-quality meats, poultry and fish. Also expect fresh-baked goods, house ware, a floral department and a well-stocked vitamin and personal-product section. Deli offers hot and cold prepared foods and artisanal cheeses."
3334667,1095279,"2020-09-27 04:17:14","A & J Select Market",http://www.ajmarket.com,info@ajmarket.com,"(509) 427-5491","265 SW Second St",Stevenson,WA,98648,"265 SW Second St,Stevenson,WA 98648","Grocery Stores, Bakeries, Fruit & Vegetable Markets, Liquor Stores, Meat Markets, Supermarkets & Super Stores",2,"2 Reviews",,45.69342,-121.8851,https://i2.ypcdn.com/blob/6e0dbbf7dc717f3fdbfab569a891b6f2b24d185b_100x100_crop.jpg?f9d23e1,,"A&J Select Market is a locally owned and operated grocery store that offers a range of food products and services. The company maintains grocery, meat, produce, deli and bakery departments. It offers a variety of food products, such as fried chicken, sandwiches, hot entrees, soups, salads, rolls, hamburgers, roasted beef, cheddar cheese and pizzas. The company also offers other food items that include baked potatoes, broccoli and cheese, chips, garlic bread and Chinese food. The company also has a liquor department that offers a selection of imported wines from various countries. A&J Select Market maintains a location in Stevenson, Wash.","Mon - Sun: 7:00 am - 9:00 pm","Phone: (509) 427-4388 Fax: (509) 427-4388",,"all major credit cards",,,"http://www.ajmarket.com https://www.ajmarket.com","Specialties: Mexican, Chinese Takes Reservations: No Wheelchair Accessible: Yes Wi-Fi: No Bike Parking: Yes Outdoor Seating: Yes Parking: Street, Lot, Private","May S.",05/21/2017,three,"I have been living in Stevenson for three years, and shop at this store at least once a week. The store is always clean, and the ladies in the Deli are so nice, helpful, and make me feel welcome. I can't say the same about the checkers. They are very friendly to ""locals"", but not so much to ""outsiders"". I was raised in a small rural community, so I understand the clanish attitudes, but after three years you would think I would at least get a, ""Hello"". This cold shoulder treatment has made me take my business to Hood River. Its a shame that all locals aren't made to feel welcome. I only shop here if I need a gallon of milk, or a loaf of bread. Take your money to Hood River, or Gresham.","Angelsfire007 ..",07/30/2015,one,"For a small town with strong community interests as they claim, I find it odd and discriminating that this business does not allow the disabled to have any service animals in their store even with the proper documentation. After all they do have handicapped parking in front. For me personally it has been a hardship to have to travel to Portland or Hood river to buy my groceries. I was deeply embarrassed and offended when Management made a scene at the check out in front of many customers. Not once but 3 times. So thumbs down in just basic respect. I suppose that my 1lb service dog surely must pose such a health risk. And to add further insult to the situation, He told me to put the dog in the car with temperatures nearing 100. Other then that. Great Deli."
3336601,1096439,"2020-09-27 04:17:16","Mayflower Market & Liquor",,,"(805) 529-1506","105 E High St",Moorpark,CA,93021,"105 E High St,Moorpark,CA 93021","Liquor Stores, Grocery Stores, Meat Markets",,,,34.28569,-118.88069,,,,"Mon - Sat: 6:30 am - 8:00 pm Sun: 7:00 am - 8:00 pm",,,"all major credit cards",,,,,,,,,,,,
3336985,1096647,"2020-09-27 04:17:16","Freel's Market",http://freelsmarket.com,,"(989) 362-6900","1139 W Lake St","Tawas City",MI,48763,"1139 W Lake St,Tawas City,MI 48763","Liquor Stores, Beer & Ale, Grocery Stores, Lottery Ticket Agencies, Meat Markets, Supermarkets & Super Stores",,,,44.25328,-83.53709,,,"*Serving This Area For Two Generations *Betty & Ed Freel - Owners *Your Convenience We Are Open 7 Days A Week!",,,,"all major credit cards",,,http://freelsmarket.com,"Price Range : Below Average",,,,,,,,
3339917,1098351,"2020-09-27 04:17:21","Taylors Market Bird & Schell Meats",http://www.taylorsmarket.com,customerservice@taylorsmarket.com,"(916) 443-6881","2900 Freeport Blvd",Sacramento,CA,95818,"2900 Freeport Blvd,Sacramento,CA 95818","Liquor Stores, Grocery Stores, Meat Markets",4,"4 Reviews",,38.55188,-121.48887,https://i1.ypcdn.com/blob/a898c4453fc5b96f44b2ef04389ec5ed0d63e314_100x100_crop.jpg?f9d23e1,,,"Mon - Sat: 9:00 am - 7:00 pm Sun: 9:00 am - 6:00 pm",,,,,,http://www.taylorsmarket.com,,"L. M.",11/02/2015,four,"Excellent selection of special meats and cheeses. This quaint market is a real ""neighborhood market"" with charm and friendly employees. They also have delicious desserts, pretty market flowers, and a good beer selection.",briannejuliet,09/21/2011,five,"We recently moved in about a block away and during our kitchen renovation had no fridge/stove/ microwave. We became fast regulars at Taylors market and now that we have a functioning kitchen will be back often. Their pre-made deli case is ever changing and always drool inducing. My boyfriend's mom tried the potato salad on a whim and has called us to bring her more whenever we visit. My favorite is the Chicken Club sandwich on sliced sourdough with everything. For me, the world's most perfect sandwich. Enough for a meal and a snack, it's a deal at $8. Treat yourself, but be ready to stand in a little line if it's lunchtime. Moving on to the dessert case... evil. All sorts of single serving yummies that also change regularly. The almond cake I had once was heartmelting....I still look for it. Otherwise, expect a small gourmet market. Think capers and cheeses and fruits and veggies. Good beer selection with convenience pricing (ouch). The meat and sausages we purchased for a barbecue were excellent. We will continue to shop here often"
3343009,1100083,"2020-09-27 04:17:35","Clearwater Valley Marketplace",,,"(208) 926-4242","113 S Main St",Kooskia,ID,83539,"113 S Main St,Kooskia,ID 83539","Grocery Stores, Bakeries, Liquor Stores, Meat Markets, Supermarkets & Super Stores",,,,46.13873,-115.9787,,,,"Mon - Sun: 7:00 am - 10:00 pm",,,"all major credit cards, master card, visa",,"Clearwater Harvest Foods Clearwater Valley Harvest Food",,,,,,,,,,
3344292,1100820,"2020-09-27 04:17:35","Norman Brothers Produce",,ssuggs@normanbrothers.com,"(305) 274-9363","7621 SW 87th Ave",Miami,FL,33173,"7621 SW 87th Ave,Miami,FL 33173","Fruit & Vegetable Markets, American Restaurants, Bakeries, Caterers, Delicatessens, Farmers Market, Fish & Seafood Markets, Fruit Baskets, Gift Baskets, Grocery Stores, Liquor Stores, Meat Markets, Restaurants, Wine",5,"2 Reviews",,25.69834,-80.33288,https://i1.ypcdn.com/blob/0957b3e8b9b1fd0cad4de278a5aefc36fdeea69d_100x100_crop.jpg?f9d23e1,,"Norman Brothers is family owned & family operated. We ve been right here at the same location for more than 40 years.Our mission is to provide you & your family with the freshest & best produce, meat, seafood, homemade baked goods, & healthy meals to go.","Mon - Sat: 8:00 am - 7:00 pm Sun: 9:00 am - 6:00 pm","Fax: (305) 596-4541",,"visa, mastercard",,,,"Parking: Lot, Private Wi-Fi: No Bike Parking: Yes Attire: Casual Wheelchair Accessible: Yes Takes Reservations: No Outdoor Seating: Yes Price Range : Average","George B.",06/13/2016,five,"This place is amazing! The best and awesome selection of fresh fish, organic fruits and veggies and an awesome selection of wine and champagne! People are always friendly and I would highly recommend!",adeosun55,06/22/2011,five,"Fresh produce, wine, deli, salads, desserts - awesome! Best chicken pasta salad ever."
3345202,1101335,"2020-09-27 04:17:41","Pepper Tree Steaks n' Wine",http://www.steaksnwines.com,peppertreesteaksandwine@yahoo.com,"(334) 271-6328","8101 Vaughn Rd",Montgomery,AL,36116,"8101 Vaughn Rd,Montgomery,AL 36116","Wine, Caterers, Liquor Stores, Meat Markets",,,,32.33982,-86.17263,https://i2.ypcdn.com/blob/f7be07c375194a812e3320c7bdee2c0842c45bb3_100x100_crop.jpg?f9d23e1,"We Grill, You Chill.","Pepper Tree Steaks N' Wines is know as the River Region's premiere neighborhood specialty market offering a variety of culinary experiences. including a butcher shop with fresh cuts of angus and prime beef: onsite grilling to the location of your choice as well as an onsite award winning chef. World famous steak seasoning. a gourmet to-go department with prepared homemade casseroles, dips, salads, party trays, baked goods, cakes, and pies. Peppertree also as a full time wine steward, Chantel Davis Bass, and prot?g? Rod Rudolph are knowledgeable in paring food and wine for everyday dining, parties and business banquets!! Whether large or small lavish or simple, Pepper Tree catering promises to deliver a wedding reception, bridal luncheon, rehearsal dinner, or corporate event that would exceed your highest expectation.","Mon - Sat: 9:00 am - 7:00 pm",,,"all major credit cards",,,"http://www.steaksnwines.com http://2steaksnwines.com",,,,,,,,,
3345650,1101593,"2020-09-27 04:17:41","Keith's Family Food Center",,briansiga@gmail.com,"(844) 712-7329","76201 Covelo Rd",Covelo,CA,95428,"76201 Covelo Rd,Covelo,CA 95428","Liquor Stores, Beverages, Butchering, Food Processing & Manufacturing, Grocery Stores, Logging Companies, Logging Equipment & Supplies, Meat Markets, Meat Processing, Supermarkets & Super Stores",,,A+,39.791,-123.2478,,"Shop Keith's & Save","Keith's Family Food Center on Covelo Rd in Covelo, CA is in the Beach California section(s) Supermarkets And Other Grocery (Except Convenience) Stores, Beer, Wine, And Liquor Stores, Drinking Places (Alcoholic Beverages) and Meat Markets. The map of Keith's Family Food Center shows the approximate location in Covelo, but you should call them at phone number (707) 983-6633 to verify their address is 76201 Covelo Road, Covelo, California 95428 and to get hours and driving directions. Some of the brands and departments of Keith's Family Food Center Covelo are Smoked Meats, One Stop Shipping and Housewares.","Mon - Sun: 7:00 am - 10:00 am",,,"visa, all major credit cards, mastercard",,,,"Parking: Lot, Free Wheelchair Accessible: Yes",,,,,,,,
3347958,1102932,"2020-09-27 04:17:48","Miller & Sons Supermarket",http://www.millerandsonssupermarket.com,ksteiner124@gmail.com,"(608) 845-6478","210 S Main St",Verona,WI,53593,"210 S Main St,Verona,WI 53593","Grocery Stores, Bakeries, Delicatessens, Delivery Service, Liquor Stores, Meat Markets, Supermarkets & Super Stores",,,,42.98884,-89.53389,https://i1.ypcdn.com/blob/7de7f50cfd6751b24ba7da7edc0406f17f4abf1e_100x100_crop.jpg?f9d23e1,"""If we don't have it, we will get it for you."" ""And we still carry your groceries to your car."" ""Providing you with old fashioned service since 1902.""","MILLER & SONS Supermarket is a grocery store with meat, produce, deli, bakery, grocery, frozen, dairy, organic, gluten free, health and diet, beer, liquor and wines. Additionally, the store features a large selection of products of both national brand and private label. It is one of the largest suppliers of ice cream and frozen pizzas from Verona, Wisconsin, west to the Mississippi River in the United States. The store carries a wide array of fresh meats, cheeses and salads. The hot deli department offers a hot lunch special daily, including a variety of casseroles, soups, pizza and chicken.","Mon - Sat: 6:30 am - 9:00 pm Sun: 6:30 am - 7:00 pm","Primary Phone: (608) 845-1496 Phone: (608) 845-1496",,"all major credit cards, travelers checks, debit",,,"http://www.millerandsonssupermarket.com http://millersandsons.com","Parking: Lot, Private Bike Parking: Yes Wheelchair Accessible: Yes Price Range : Average",,,,,,,,