business_x_category.id,business.id,business.ts,business.business_name,business.home_page,business.email_address,business.phone,business.street,business.city,business.state,business.zip_code,business.full_address,business.category,business.rating,business.number_of_reviews,business.bbb_rating_or_license,business.latitude,business.longitude,business.cover_image,business.slogan,business.general_info,business.regular_hours,business.extra_phones,business.services_products,business.payment,business.price_range,business.aka,business.other_links,business.other_information,business.review_1_name,business.review_1_date,business.review_1_rating,business.review_1_text,business.review_2_name,business.review_2_date,business.review_2_rating,business.review_2_text
658739,230250,"2020-09-27 02:52:36","A & D Taxi",http://www.adtransportservices.co,dfreed72@gmail.com,"(607) 433-1726","83 Lower River St",Oneonta,NY,13820,"83 Lower River St,Oneonta,NY 13820","Taxis, Airport Transportation, Business Consultants-Medical Billing Services, Courier & Delivery Service, Gas-Industrial & Medical-Cylinder & Bulk, Hospitalization, Medical & Surgical Plans, Insurance Medical Examinations, Legal Consultants-Medical, Medical & Dental Assistants & Technicians Schools, Medical & Dental X-Ray Labs, Medical Alarms, Medical Assistants & Technicians, Medical Business Administration, Medical Centers, Medical Clinics, Medical Equipment & Supplies, Medical Equipment Repair, Medical Imaging Services, Medical Information & Research, Medical Labs, Medical Law Attorneys, Medical Malpractice Attorneys, Medical Practice Consultants, Medical Records Service, Medical Service Organizations, Medical Spas, Medical Transcription Service, Medical Waste Clean-Up, Transportation Services, Waste Disposal-Medical",5,"1 Review",A+,42.44787,-75.09535,,,"Company Message","Mon - Sun: Open 24 Hours",,,"all major credit cards, mastercard, visa",,"A&D Taxi & Transport",http://www.adtransportservices.co,,"Frank B.",12/14/2018,five,"I was in need of a ride from Walton NY to Oneonta to rent a vehicle from Enterprise. I called A&D and was transferred several times after giving my location. If this happens to you don't get upset. They were triangulating my location with the best driver to do a pick up. I was transferred to Dan and spoke to him. I walked outside to meet him 10 minutes before his E.T.A.. He was driving up the driveway before time. I had a great ride into Oneonta. Dan was very intelligent and versed in many topics especially with his surroundings. Best car service I had in a very long time. Thanks Dan!! keep up the good work. Frank",,,,
662706,231233,"2020-09-27 02:52:37",HospitalityCare4U,http://www.hospitalitycare4u.com,,"(866) 461-4966","10010 Arrow Rte","Rancho Cucamonga",CA,91730,"10010 Arrow Rte,Rancho Cucamonga,CA 91730","Disability Services, Courier & Delivery Service, Medical Information & Research, Medical Service Organizations, Transportation Providers",,,,34.10704,-117.59408,,,,"Mon - Fri: 8:30 am - 6:30 pm","TollFree: (888) 260-5335",,,,,http://www.hospitalitycare4u.com,,,,,,,,,
886067,296454,"2020-09-27 02:59:14","Marilyn C. Kslazek, MS",http://nutritioncounselingservice.com,,"(570) 347-7127","313 East Drinker Street",Scranton,PA,18512,"313 East Drinker Street,Scranton,PA 18512","Medical Information & Research, Dietitians, Nutritionists",,,,41.42153,-75.627266,https://i1.ypcdn.com/blob/e808ab5c0b863174c4e722b301b0fdc25e37a672_100x100_crop.jpg?8ad0f92,,,"Mon - Tue: 9:00 am - 5:30 pm Wed Closed Thu - Fri: 9:00 am - 5:30 pm Sat - Sun Closed","Fax: (570) 347-1831",,check,,,http://nutritioncounselingservice.com,,,,,,,,,
909193,301975,"2020-09-27 03:00:06","Functional Wellness",http://www.functionallwellness.com,,"(909) 792-7570","800 Magnolia Ave,Suite 105",Corona,CA,92879,"800 Magnolia Ave,Suite 105,Corona,CA 92879","Nutritionists, Alternative Medicine & Health Practitioners, Colonic Irrigation, Diabetes Educational, Referral & Support Services, Health & Fitness Program Consultants, Health & Welfare Clinics, Health & Wellness Products, Herbs, Holistic Practitioners, Medical Information & Research, Mental Health Services, Physicians & Surgeons, Endocrinology, Diabetes & Metabolism, Physicians & Surgeons, Family Medicine & General Practice, Physicians & Surgeons, Industrial Medicine, Physicians & Surgeons, Nutrition, Physicians & Surgeons, Weight Loss Management, Reducing & Weight Control, Stress Management & Prevention, Vitamins & Food Supplements",,,,33.85904,-117.55247,,,,"Appointment Only Hours",,,"visa, jcb, discover, mastercard, amex, all major credit cards, check, debit, paypal, financing available, insurance, diners club",,,"Learn more details on our website. Get updates on Facebook In collaboration with Lifestyle Medicine Solutions",,,,,,,,,
935659,308114,"2020-09-27 03:00:50","The Center for Natural Health",http://www.drsfiorentino.com,,"(203) 864-5762","163 Main St",Westport,CT,06880,"163 Main St,Westport,CT 06880","Homeopathic Practitioners, Acupuncture, Allergy Treatment, Alternative Medicine & Health Practitioners, Blood Testing & Typing, Chiropractors & Chiropractic Services, Health & Fitness Program Consultants, Health & Wellness Products, Holistic Practitioners, Medical Clinics, Medical Information & Research, Medical Labs, Naturopathic Physicians (ND), Nutritionists, Pain Management, Physical Fitness Consultants & Trainers, Physicians & Surgeons, Family Medicine & General Practice, Physicians & Surgeons, Osteopathic Manipulative Treatment, Physicians & Surgeons, Pain Management, Physicians & Surgeons, Pediatrics-Allergy, Physicians & Surgeons, Pediatrics-Endocrinology, Physicians & Surgeons, Pediatrics-Gastroenterology, Physicians & Surgeons, Pediatrics-Nephrology, Physicians & Surgeons, Pediatrics-Neurology, Physicians & Surgeons, Public Health, Physicians & Surgeons, Sexual Dysfunction, Physicians & Surgeons, Sleep Disorders, Physicians & Surgeons, Sports Medicine, Physicians & Surgeons, Travel Medicine, Sleep Disorders-Information & Treatment, Smokers Information & Treatment Centers, Sports Medicine & Injuries Treatment, Stress Management & Prevention, Weight Control Services",5,"1 Review",,41.14362,-73.36193,https://i2.ypcdn.com/blob/59e6f98e584f6f43c8740dbb7bf05f1a9227e7d8_100x100_crop.jpg?8ad0f92,"We treat people and the root cause of a person's illness, not symptoms.",,"Tue - Wed: 10:00 am - 6:00 pm Fri: 10:00 am - 5:00 pm Sat: 10:00 am - 12:00 am",,,"all major credit cards, debit, check, paypal, cash",,,"http://www.drsfiorentino.com http://www.thecenterfornaturalhealth.com","Parking: Street, Lot, Self, On Site, Free Wheelchair Accessible: Yes","Diana C.",09/03/2015,five,"I have been under the care of Dr. Fiorentino for some time and I am very pleased with the improvements made to my health. Dr. Fiorentino has worked on my immune and endocrine system improving both. He is not only compassionate, a great listener but also a great teacher. He takes time to explain not only what is currently going on with your system, how to address it, but how his recommendations would impact and improve your system. He has created an atmosphere where I feel comfortable to ask questions and suggests things that I feel would help me. I also have a great appreciation for his ability to work in conjunction with other physicians for the good of his clients. Although his practice is in Connecticut and it is a long commute from New Jersey, he is definitely worth the drive! I highly recommend him to all my friends and to all my clients in private practice. Diana C.",,,,
946680,310702,"2020-09-27 03:00:54","C. C. Medical Services",http://www.drcalapai.net,ccmedical503@yahoo.com,"(516) 794-0404","1900 Hempstead Tpke","East Meadow",NY,11554,"1900 Hempstead Tpke,East Meadow,NY 11554","Nutritionists, Medical Information & Research, Medical Labs, Physicians & Surgeons, Physicians & Surgeons, Allergy & Immunology, Physicians & Surgeons, Nutrition, Physicians & Surgeons, Pediatrics, Physicians & Surgeons, Pediatrics-Allergy, Research & Development Labs, Weight Control Services",,,,40.72397,-73.56615,,"Board Certified in Family Medicine - Certified in Anti Aging Medicine - Certificate in Hyperbaric Therapy","Stem cells are unquestionably some of the most amazing cells in the human body. These are undifferentiated cells that do not have a direct ""blueprint"" or specific destiny. The can become differentiated into specialized cells anywhere throughout the body. They are classified as 2 different types of cells, those that are from embryonic origin and those called adult stem cells. Diseases that are currently available for treatment with stem cells include: Arthritis, Alzheimer's disease, COPD, Critical Limb Ischemia, Diabetes, Erectile Dysfunction, Frailty Syndrome, Liver Failure, Localized Ischemia, Lupus, Multiple Sclerosis, Parkinson's Disease, Pulmonary Fibrosis, Renal Failure, Rheumatoid Arthritis, Stroke, Vascular Insufficiency and Heart Failure.",,"Phone: (516) 433-3232 Fax: (516) 794-0332",,"amex, discover, visa, master card",,,http://www.drcalapai.net,"Specialties: Family Medicine, Family Practice",,,,,,,,
1091844,345315,"2020-09-27 03:04:12","Advanced Multi Services",http://advancedmultiservices.com,ams4you@live.com,"(805) 744-7464","4266 E Los Angeles Ave Ste 203","Simi Valley",CA,93063,"4266 E Los Angeles Ave Ste 203,Simi Valley,CA 93063","Paralegals, Legal Document Assistance, Medical Information & Research, Medical Practice Consultants, Notaries Public",5,"1 Review",,34.27139,-118.71133,,"""HERE TO ASSIST YOU PROFESSIONALLY AND EFFICIENTLY"" Se Habla Espa?ol","AMS is a document preparation service. We are here to assist you by providing many types of services and saving you money. If you are uncomfortable representing yourself, we can refer you to an Attorney who can best represent you.","Mon - Fri: 9:00 am - 5:00 pm Sat - Sun Closed",,,,,,http://advancedmultiservices.com,,stylistkween,06/13/2011,five,"Amazing! My divorce was finalized and I walked away with more than I asked for :) Thank you so much for ALL your help and support!!!",,,,
2998428,928055,"2020-09-27 04:01:18","Focus on Health Chiropractic",http://focusonhealthchiro.com/contact,,"(888) 690-5013","4200 Merchant St Ste 10",Columbia,MO,65203,"4200 Merchant St Ste 10,Columbia,MO 65203","Medical Clinics, Acupuncture, Alternative Medicine & Health Practitioners, Chiropractors & Chiropractic Services, Hospital & Nursing Home Consultants, Hospitals, Medical Information & Research, Medical Service Organizations, Physical Fitness Consultants & Trainers, Physical Therapy Equipment, Physicians & Surgeons, Physicians & Surgeons, Osteopathic Manipulative Treatment, Physicians & Surgeons, Sports Medicine, Physicians & Surgeons, Surgery-General, Rehabilitation Services",,,A+,38.93223,-92.3984,https://i2.ypcdn.com/blob/71e548aaa73cda066ff1a2386427ca982a541ea4_100x100_crop.jpg?8ad0f92,,"Offering chiropractics and acupuncture services. Welcome to Focus on Health Chiropractic! Focus On Health offers conservative healthcare through chiropractic care, acupuncture, functional rehabilitation, and massage therapy. We are located in the Village of Cherry Hill in southwest Columbia, Missouri.","Mon: 9:00 am - 6:00 pm Tue: 12:00 pm - 6:00 pm Wed - Thu: 9:00 am - 6:00 pm Fri: 9:00 am - 2:00 pm",,,"cash, check, debit, discover, insurance, master card, visa",,,"http://focusonhealthchiro.com/contact http://www.handsonhealthdo.com","Parking: Lot By Appointment Only: No",,,,,,,,
3037312,944496,"2020-09-27 04:02:23","Acu Health Care",http://www.traditionalchinesemedicinehouston.com,,"(713) 960-7890","5201 Richmond Ave",Houston,TX,77056,"5201 Richmond Ave,Houston,TX 77056","Medical Clinics, Acupuncture, Alternative Medicine & Health Practitioners, Medical Information & Research, Physicians & Surgeons",,,,29.73122,-95.4672,,,,"Mon - Fri: 9:00 am - 1:00 pm Sat: 2:00 pm - 6:00 pm",,,,,,http://www.traditionalchinesemedicinehouston.com,,,,,,,,,
3115201,976856,"2020-09-27 04:05:06","University of Nebraska Medical Center",http://www.unmc.edu,,"(402) 559-4000","600 S 42nd St",Omaha,NE,68198,"600 S 42nd St,Omaha,NE 68198","Colleges & Universities, Medical Centers, Medical Information & Research, Nursing Schools, Physicians & Surgeons",,,A+,41.2547,-95.9784,https://i2.ypcdn.com/blob/a7c3a9fa53611543208b0ccf1bc4f6461fc96e40_100x100_crop.jpg?e66d351,"Breakthroughs for life.",,"Mon - Thu: 5:30 am - 9:00 pm Fri: 5:30 am - 7:00 pm Sat - Sun: 8:00 am - 5:00 pm","Academic records & transcripts: (402) 559-2150 College of Medicine: (402) 559-4204 Student Services: (402) 559-4437 Campus security: (402) 559-4439 Public Relations: (402) 559-4353",,,,"Nebraska Medical Center Nebraska Health System Nebraska Medical Center, The University Hospital Clarkson Hospital",http://www.unmc.edu,"Specialties: Nursing",,,,,,,,
4360343,1362092,"2020-09-27 04:42:07","Alaska Regional Senior Health Clinic",http://www.alaskaseniorclinic.com,,"(907) 433-5100","11260 Old Seward Hwy Ste 107",Anchorage,AK,99515,"11260 Old Seward Hwy Ste 107,Anchorage,AK 99515","Medical Clinics, Assisted Living & Elder Care Services, Clinics, Conference Centers, Health & Welfare Clinics, Medical Centers, Medical Information & Research, Nurses, Nursing & Convalescent Homes, Opticians, Optometrists, Physicians & Surgeons, Physicians & Surgeons, Geriatrics, Physicians & Surgeons, Hematology (Blood), Physicians & Surgeons, Pediatrics, Senior Citizens Services & Organizations, Trade Shows, Expositions & Fairs",,,,61.11938,-149.8974,,,"We provide high-quality, cost-effective healthcare to Medicare beneficiaries in Anchorage.","Mon - Fri: 8:00 am - 5:00 pm Sat - Sun Closed",,,,,,http://www.alaskaseniorclinic.com,,,,,,,,,
5599919,1673716,"2020-09-27 05:13:25","Medsite Medical",https://www.medsitemedical.com,support@medsitemedical.com,"(888) 371-7123","8605 Santa Monica Blvd # 60101","West Hollywood",CA,90069,"8605 Santa Monica Blvd # 60101,West Hollywood,CA 90069","Marketing Programs & Services, Internet Marketing & Advertising, Marketing Consultants, Medical Information & Research, Web Site Design & Services",,,,34.08793,-118.37952,https://i2.ypcdn.com/blob/081befc1c778f56bc371d2f55c612f47cc28882b_100x100_crop.jpg?cbd0284,"#1 in Medical Website Design & Medical SEO","Medsite Medical is the leader in medical website design & medical SEO for doctors, dentists, surgeons, healthcare providers and medical practices. As a full-service digital agency, Medsite Medical helps physicians grow their medical practice and attract new patients with great websites and effective online marketing.",,"Phone: (310) 692-9280 Toll Free: (888) 371-7123",,"visa, discover, mastercard, all major credit cards, check, amex, company card",,,"Medsite Medical is the leader in medical website design & medical SEO for doctors, dentists, surgeons, healthcare providers and medical practices.",,,,,,,,,
5669636,1696862,"2020-09-27 05:15:28","Frontier Solution LLC",http://www.frontiersolution.com,,"(769) 300-1188","1485 Livingston Ln",Jackson,MS,39213,"1485 Livingston Ln,Jackson,MS 39213","Computer Technical Assistance & Support Services, Computer & Technology Law Attorneys, Computer Network Design & Systems, Computer Online Services, Computer Service & Repair-Business, Computer Software Publishers & Developers, Marketing Programs & Services, Medical Information & Research, Web Site Design & Services, Web Site Hosting",5,"3 Reviews",,32.39062,-90.20108,https://i1.ypcdn.com/blob/40be44a63c613534f883c002857362c952cdb2db_100x100_crop.jpg?cbd0284,"IT Solution For Every Aspect Of Your Business","We are a professional IT company with the ambitions to solve our day to day business issues. From Email integration, web hosting to desktop and mobile app development. Our goal is to provide the best and economical solution with our extensive yet professional experiences.","Mon - Fri: 7:00 am - 7:00 pm",,,"visa, discover, mastercard, all major credit cards, check, paypal",,,http://www.frontiersolution.com,,"Josh B.",09/25/2017,five,"We had a very limited budget and little time to spend on training our staff on how to update and maintain the new website. Frontier Solutions built us a beautiful website and delivered top notch customer service throughout the entire process. They worked with us on purchase orders and governmental processes with ease. Once the site was built the customer service continued to impress. They always call you back, fix the issues, and lend a helping hand regardless the time of day. В– Sgt. Bromen, Gulfport Police Department, Gulfport, MS. www.gulfportpolice.net","Mbk S.",04/16/2017,five,"There are many people that say what they'll do, but then they do something totally different. A lot of companies start out friendly and end up rude and snappy, but with Frontier Solutions, they do what they say they'll do, and they are friendly throughout the entire process"
5917961,1732279,"2020-09-27 05:18:54","Tri Star Medical Group",http://www.tristarmedical.com,,"(562) 424-7300","2690 Pacific Ave Ste 300","Long Beach",CA,90806,"2690 Pacific Ave Ste 300,Long Beach,CA 90806","Physicians & Surgeons, Alternative Medicine & Health Practitioners, CPR Information & Services, Chiropractors & Chiropractic Services, Counseling Services, Disability Services, Drug Testing, Health Recording Service, Medical Clinics, Medical Equipment & Supplies, Medical Information & Research, Medical Labs, Mental Health Services, Nurses, Osteopathic Clinics, Physical Therapists, Physical Therapy Clinics, Physicians & Surgeons Referral & Information Service, Psychiatric Clinics, Psychological Clinics, Sleep Disorders-Information & Treatment",,,,33.80584,-118.19333,https://i2.ypcdn.com/blob/f43bd4c8f80ec7b9739d6ca0e7ed86a95ccee0da_100x100_crop.jpg?8ad0f92,,,"Mon - Fri: 8:00 am - 6:00 pm","Main Office in Santa Ana, CA: (714) 975-7950",,,,,http://www.tristarmedical.com,,,,,,,,,
6068036,1740151,"2020-09-27 05:20:03","Orthopaedic Center Of Southern Illinois",https://orthocenter-si.com,,"(618) 545-0894","402 N Pleasant Ave",Centralia,IL,62801,"402 N Pleasant Ave,Centralia,IL 62801","Physicians & Surgeons, Orthopedics, Medical Centers, Medical Information & Research, Physical Therapists, Physical Therapy Clinics, Physicians & Surgeons, Physicians & Surgeons, Emergency Medicine, Physicians & Surgeons, Family Medicine & General Practice, Physicians & Surgeons, Hand Surgery, Physicians & Surgeons, Neurology, Physicians & Surgeons, Osteopathic Manipulative Treatment, Physicians & Surgeons, Pediatrics-Orthopedic Surgery, Physicians & Surgeons, Physical Medicine & Rehabilitation, Physicians & Surgeons, Podiatrists, Physicians & Surgeons, Rheumatology (Arthritis), Physicians & Surgeons, Sports Medicine, Physicians & Surgeons, Surgery-General, Sports Medicine & Injuries Treatment",,,,38.52896,-89.11609,,,"Brands Brethine","Mon - Fri: 7:00 am - 5:00 pm","Phone: (618) 242-3778 Phone: (618) 242-8887 Fax: (618) 545-0914",,"master card, visa, amex, cash, discover",,,https://orthocenter-si.com,,,,,,,,,
15175472,1925453,"2020-09-27 05:37:37","Res Companies",http://www.rescommunity.com,,"(631) 732-4794","1461 Lakeland Ave Unit 12",Bohemia,NY,11716,"1461 Lakeland Ave Unit 12,Bohemia,NY 11716","Medical Information & Research, Adult Day Care Centers, Home Managing Services, Speech-Language Pathologists",,,,40.77982,-73.10925,,,,"Mon - Fri: 9:00 am - 5:00 pm","Phone: (631) 732-0355 Phone: (631) 846-4740 Phone: (631) 732-0908 Phone: (631) 732-0491 Primary Phone: (631) 732-0908 Primary Phone: (631) 846-4740 Fax: (631) 732-0355",,,,,http://www.rescommunity.com,"Parking: On Site, Free Wheelchair Accessible: Yes",,,,,,,,
16555266,2230044,"2020-09-27 06:07:22","Manhattan Allied Network Corp",http://www.manhattanallied.com,jonathansuarez@manhattanallied.com,"(212) 686-0588","236 5th Ave","New York",NY,10001,"236 5th Ave,New York,NY 10001","Employment Consultants, Human Resource Consultants, Management Consultants, Medical Information & Research",,,,40.74435,-73.98778,,,,"Mon - Fri: 10:00 am - 5:00 pm Sat - Sun Closed","Fax: (212) 686-0589",,"all major credit cards, amex, carte blanche, check, company card, diners club, discover, insurance, jcb, mastercard, visa",,,http://www.manhattanallied.com,,,,,,,,,
17254745,2468046,"2020-09-27 06:30:35","ACROM International",,jquevedo@acrom.org,"(786) 953-8712","10454 NW 31st Ter",Doral,FL,33172,"10454 NW 31st Ter,Doral,FL 33172","Research Services, Clinical Labs, Counseling Services, Medical Information & Research, Psychologists, Research & Development Labs",,,,25.80283,-80.36626,,,"ACROM International (Advanced Clinical Research of Medicine) is a dedicated clinical research facility committed to the development and implementation of clinical trials in South Florida, contributing years of clinical experience in conducting Phase I thru Phase IV research studies throughout our community.","Mon - Fri: 8:00 am - 3:00 pm Sat - Sun: 8:00 am - 12:00 pm","Fax: (786) 953-7490",,,,,,"Parking: Lot",,,,,,,,
17431465,2529201,"2020-09-27 06:36:04","Biocomp Research Institute",http://www.biocompresearch.org,,"(310) 473-8500","2525 Sawtelle Blvd","Los Angeles",CA,90064,"2525 Sawtelle Blvd,Los Angeles,CA 90064","Medical Information & Research, Psychologists, Research & Development Labs",,,,34.03182,-118.436,,,,"Mon - Sat: 9:00 am - 4:00 pm","Phone: (323) 930-8500 TollFree: (800) 246-3526",,,,"Biocomp Research Biofeedback Institute of Los Angeles",http://www.biocompresearch.org,,,,,,,,,
17454250,2537125,"2020-09-27 06:36:36","Behavioral Healthcare Consultants",http://www.bhclanc.com,,"(717) 581-5255","1755 Oregon Pike Ste 200",Lancaster,PA,17601,"1755 Oregon Pike Ste 200,Lancaster,PA 17601","Medical Clinics, Clinics, Counseling Services, Counselors-Licensed Professional, Medical Information & Research, Psychologists, Social Service Organizations",,,,40.07224,-76.29895,,,,"Mon - Thu: 8:00 am - 7:00 pm Fri: 8:00 am - 4:00 pm Sat - Sun Closed","Phone: (717) 581-0554 Phone: (717) 581-5258 Fax: (717) 581-5259",,insurance,,,"http://www.bhclanc.com https://www.bhclanc.com",,,,,,,,,
19002622,2753095,"2020-09-27 06:58:57","Lippincott Williams Wilkens",http://lww.com,pdafeedback@lww.com,"(410) 528-4000","351 W Camden St Fl 4",Baltimore,MD,21201,"351 W Camden St Fl 4,Baltimore,MD 21201","Printing Services-Commercial, Computer Printers & Supplies, Medical Information & Research, Printers-Equipment & Supplies, Printing Services, Publishers",,,,39.28514,-76.62059,https://i1.ypcdn.com/blob/70e8ebe614cf6128373b36e1134e6cfe3a71d2f1_100x100_crop.jpg?8ad0f92,,"ACSM's Health & Fitness Journal is the official publication of the American College of Sports Medicine. The journal is printed by Lippincott Williams & Wilkins, which is one of the world s largest publishers in the English language. ACSM's Health & Fitness Journal provides information to fitness instructors, personal trainers and program managers. It covers various aspects of exercise science and nutrition research. The journal also features current topics of interest to the fitness industry. In addition, ACSM's Health & Fitness Journal provides information on continuing education credit opportunities. Lippincott Williams & Wilkins offers a range of health science books and new media solutions.","Mon - Fri: 9:00 am - 5:00 pm Sat - Sun Closed","Phone: (410) 949-8000 Fax: (410) 528-4414 Fax: (410) 361-8034 TollFree: (800) 222-3790",,"diners club",,"Williams & Wilkins Lippincott Williams & Wilkins LWW Lippincott Williams & Wilkins","http://lww.com https://shop.lww.com",,,,,,,,,