business_x_category.id,business.id,business.ts,business.business_name,business.home_page,business.email_address,business.phone,business.street,business.city,business.state,business.zip_code,business.full_address,business.category,business.rating,business.number_of_reviews,business.bbb_rating_or_license,business.latitude,business.longitude,business.cover_image,business.slogan,business.general_info,business.regular_hours,business.extra_phones,business.services_products,business.payment,business.price_range,business.aka,business.other_links,business.other_information,business.review_1_name,business.review_1_date,business.review_1_rating,business.review_1_text,business.review_2_name,business.review_2_date,business.review_2_rating,business.review_2_text
15980010,2011210,"2020-09-27 05:46:11","Expansi?n Inmobiliaria",http://www.expansioninmobiliaria.com.mx,contacto@expansioninmobiliaria.com.mx,"(442) 203-0036",Juriquilla,Quer?taro,NM,76230,"Juriquilla,Quer?taro,NM 76230","Real Estate Agents, Interior Designers & Decorators, Mortgages, Residential Care Facilities",,,,34.51994,-105.87009,,,,,,,,,,http://www.expansioninmobiliaria.com.mx,,,,,,,,,
16434975,2184500,"2020-09-27 06:02:52","Final Expense Burial Life Insurance",,gilbert@Term4Ca.com,"(510) 457-1020",,Oakland,CA,94608,"Oakland,CA 94608","Funeral Planning, Caskets, Insurance, Life Insurance, Mortgages",,,,,,,None,"We Offer Final Expense Life Insurance, 10 20 30 Year Term Life Insurance, Mortgage Protection and UL","Mon - Fri: Open 24 Hours","Cell: (510) 457-1020",,insurance,,,,,,,,,,,,
16488914,2203698,"2020-09-27 06:05:12","Final Expense Burial Life Insurance",,gilbert@Term4Ca.com,"(510) 457-1020",,"San Jose",CA,95122,"San Jose,CA 95122","Funeral Planning, Caskets, Insurance, Life Insurance, Mortgages",,,,,,,"We Come To You","We offer Final Expense Burial Life Insurance for Seniors and Mortgage Protection Insurance for Home Owners.","Mon - Sat: Open 24 Hours Sun Closed","Cell: (510) 457-1020",,insurance,,,,,,,,,,,,
16521730,2215569,"2020-09-27 06:06:19","Symmetry Financial/ Sutton Organization",https://www.facebook.com/Symmetry-Financial-GroupSutton-Organization-446822115508628/?ref=tn_tnmn,,"(912) 484-6810","6205 Love Dr",Irving,TX,75039,"6205 Love Dr,Irving,TX 75039","Business Plans Development, Financial Services, Funeral Information & Advisory Services, Life Insurance, Mortgages",,,,32.88999,-96.95415,https://i1.ypcdn.com/blob/53383397678a1267d51b8ae16a5ded607a032b49_100x100_crop.jpg?f832250,"Securing Your Future",,,,,,,,https://www.facebook.com/Symmetry-Financial-GroupSutton-Organization-446822115508628/?ref=tn_tnmn,,,,,,,,,
16540528,2223248,"2020-09-27 06:06:57","Global Credit LLC",http://www.gmcmt.com,info@globalmontana.com,"(406) 761-4367","100 1st Ave N","Great Falls",MT,59401,"100 1st Ave N,Great Falls,MT 59401","Mortgages, Employment Agencies, Employment Opportunities, Financial Services, Financing Services, Loans, Real Estate Loans",,,,47.50612,-111.30554,,"A world of financing options","Global Credit LLC is local, Montana-owned companies founded in 1987, with the resources and experience to work with you to find a solution to your financing needs. Global Credit LLC specializes in purchasing your existing long or short-term contracts and turning them into immediate cash for you. Get paid now for entire contracts you will be collecting smaller payments on for years. Global Credit LLC offers three direct solutions to your financing needs such as consumer financing for cars, trucks, RVs, etc. Call us today!","Mon - Fri: 8:00 am - 5:00 pm Sat - Sun Closed",,,"financing available",,,http://www.gmcmt.com,,,,,,,,,
16547837,2226624,"2020-09-27 06:07:03","Mortgage Recruiter",,,"(423) 923-9271",,Morristown,TN,37814,"Morristown,TN 37814","Employment Consultants, Employment Contractors, Loans, Mortgages",,,,,,,,,,,,,,"Mortgage Recruiting",,,,,,,,,,
16562442,2233328,"2020-09-27 06:07:47","Cascade Appraisal LLC",http://www.cascadeapp.com,cascade@cascadeapp.com,"(425) 947-5184","12828 Northup Way Ste 300",Bellevue,WA,98005,"12828 Northup Way Ste 300,Bellevue,WA 98005","Mortgages, Employment Agencies, Employment Opportunities, Financial Services, Loans, Real Estate Agents, Real Estate Appraisers, Real Estate Consultants, Real Estate Loans",,,,47.62853,-122.1699,https://i4.ypcdn.com/blob/25e88d87c5e66955070268cd5220d9de27408767_100x100_crop.jpg?41e4770,"Over 30+ Years Experience.","At Cascade Appraisal LLC, we are a leading provider of real estate valuations for the mortgage lending marketplace. We are a leading provider of appraisals for primary mortgages, secondary mortgages, mortgage refinancing, employee relocation, estate planning, and much more. Call us today for more information.","Mon - Fri: 8:00 am - 4:30 pm Sat - Sun Closed",,,"cash, check, visa, debit, master card",,,http://www.cascadeapp.com,,,,,,,,,
16574124,2238578,"2020-09-27 06:08:08","Jersey Shore Appraisals",https://www.appraisernj.net,jerseyshoreappraisals@verizon.net,"(732) 255-0030","254 Brick Blvd",Brick,NJ,08723,"254 Brick Blvd,Brick,NJ 08723","Mortgages, Appraisers, Attorneys, Bail Bonds, Business Brokers, Business Management, Commercial Real Estate, Divorce Assistance, Divorce Attorneys, Employment Agencies, Employment Opportunities, Family Law Attorneys, Financial Services, Financing Services, Loans, Real Estate Appraisers, Real Estate Consultants, Real Estate Loans, Taxes-Consultants & Representatives",,,,40.03687,-74.14307,,,"Residential and Commercial appraisals serving all of New Jersey. Fast professional service. FHA Certification & Affiliations Certified General Licensed MAI SRA/FHA Approved Products & Services Appraisal Reviews Appraisals Bankruptcies & Foreclosures Buyer Representation Certified Appraisals","Mon - Fri: 9:00 am - 5:00 pm Sat - Sun Closed","Fax: (732) 255-2249",,"cash, check",,,https://www.appraisernj.net,"Specialties: Home, Lots, Land, Residential, Acreage, House, Real Estate, Estates / Trusts / Probate",,,,,,,,
16577184,2239895,"2020-09-27 06:08:16","American Federal Bank",http://www.americanfederalbank.com,dabarr@americanfederal.com,"(218) 233-2791","215 5th St N",Fargo,ND,58102,"215 5th St N,Fargo,ND 58102","Financial Planning Consultants, Banks, Employment Agencies, Employment Opportunities, Financial Planners, Financial Services, Investment Management, Investments, Loans, Mortgages, Mutual Funds, Real Estate Loans",,,A+,46.87879,-96.78573,https://i3.ypcdn.com/blob/16a7569aa7cd0fae5821d327115a2b1821170e79_100x100_crop.jpg?d9a04b5,,"American Federal Bank is a financially-strong, long-established, employee-owned community bank serving agriculture, business and individuals in the Red River Valley of North Dakota and northwestern Minnesota for more than a century! We are a trusted advisers to our clients, helping them plan their financial future by identifying opportunities and finding the best solutions to help them reach their goals.","Mon - Fri: 8:00 am - 5:00 pm Sat - Sun Closed",,,"master card, visa",,,http://www.americanfederalbank.com,,,,,,,,,
16588728,2245136,"2020-09-27 06:08:46","Omega Financial Corporation",http://omegafin1.com,mark@omegafin1.com,"(401) 331-3330","100 Midway Rd",Cranston,RI,02920,"100 Midway Rd,Cranston,RI 02920","Real Estate Loans, Employment Agencies, Employment Opportunities, Financial Services, Financing Services, Loans, Mortgages",,,A+,41.76201,-71.45705,,"Residential Contruction Financing of Condo Developements, Subdivisions and Single Family Homes for Builders and Developers in just 5 days.","Omega Financial Corporation is a privately held company located in Cranston, RI. Our specialty is in the area of construction financing as well as lending to builders and developers. We have been serving the area for over the last 30 years with a mission to accommodate development needs.","Mon - Fri: 10:00 am - 4:00 pm Sat - Sun: Open 24 Hours",,,,,,http://omegafin1.com,,,,,,,,,
16592194,2246705,"2020-09-27 06:08:58","Oak Tree Finance",http://www.oaktreefinanceky.com,oaktreefinance01@gmail.com,"(270) 754-5626","707 W Everly Brothers Blvd","Central City",KY,42330,"707 W Everly Brothers Blvd,Central City,KY 42330","Employment Agencies, Employment Opportunities, Financial Services, Financing Services, Loans, Mortgages, Real Estate Loans",,,,37.28371,-87.12917,https://i3.ypcdn.com/blob/c2e98203ec77ed9e63d02a8a369dfda9a0b3a786_100x100_crop.jpg?d9a04b5,,"Muhlenberg County's only locally owned finance company. Our trusted financial advisers and counselors provide professional services for clients in Central City, Ky., and in all the surrounding areas. We specialize in a variety of categories ranging from personal loans to car loans, as well as college and tuition loans. Whether you need financing for your vehicle, college education, home improvements, or future vacations, we have a friendly staff of associates that are available for all your needs.","Mon - Fri: 8:00 am - 5:00 pm Sat - Sun Closed","Fax: (270) 754-5627",,"cash, check",,,http://www.oaktreefinanceky.com,,,,,,,,,
16612999,2256367,"2020-09-27 06:09:43","1st Summit Bank",,lbaumgardner@1stsummit.com,"(814) 262-4010","125 Donald Ln",Johnstown,PA,15904,"125 Donald Ln,Johnstown,PA 15904","Financing Services, Banks, Employment Agencies, Employment Opportunities, Financial Services, Loans, Mortgages, Real Estate Loans",,,,40.28111,-78.84647,,"Helping Ideas Come to Life with Home Equity Loans","1st Summit Banks mission is to be the premier financial relationship provider in our markets. We have 15 convenient locations throughout the Johnstown, Somerset, Cresson, Portage, Indiana, Park Hill, Westmont, Richland, Salix, Sidman, Ebensburg, and two convenient locations in Altoona and Johnstown Walmart & Greensburg & Latrobe Walmart in Westmoreland County. We are a member of FDIC as well as an Equal Housing Lender","Mon - Thu: 8:30 am - 5:00 pm Fri: 8:30 am - 7:00 pm Sat: 8:30 am - 12:00 pm",,,,,,,,,,,,,,,
16632993,2265566,"2020-09-27 06:10:48","Prospect Bank",,,"(217) 352-0077","1601 S Prospect Ave",Champaign,IL,61820,"1601 S Prospect Ave,Champaign,IL 61820","Banks, Commercial & Savings Banks, Employment Agencies, Employment Opportunities, Financial Services, Loans, Mortgages, Real Estate Loans",,,,40.09778,-88.25801,,"A fresh prospect for today's banking.","Prospect Bank serves the Champaign-Urbana area with high quality local banking focused on the convenience and efficiency that matters most to you. Whether you want the personal experience with the friendly staff, or the convenience of the easy to use online banking, Prospect Bank is the bank for you. Based on a healthy foundation of both experienced staff and a mission to live by, Prospect Bank is here to meet all your banking needs. Call us today for more information!","Mon - Sun: Open 24 Hours",,,"cash, check, debit",,,,,,,,,,,,
16666830,2281103,"2020-09-27 06:12:23",DigitalUnderwriter.Com,,Info@DigitalUnderwriter.Com,"(800) 535-4751","4851 Imperial Dr","Liberty Twp",OH,45011,"4851 Imperial Dr,Liberty Twp,OH 45011","Contractor Referral Services, Accounting Services, Employment Agencies, Financial Services, Mortgages",,,,39.38954,-84.45751,,,,"Mon - Sun: Open 24 Hours",,,"master card, check, paypal, visa",,,,,,,,,,,,
16671074,2283042,"2020-09-27 06:12:42","California Management Group LLC",,,"(877) 468-6212","77564 Country Club Dr Ste 221","Palm Desert",CA,92211,"77564 Country Club Dr Ste 221,Palm Desert,CA 92211","Employment Consultants, Mortgages, Property Maintenance",,,,33.75839,-116.31173,,,,"Mon - Fri: 8:00 am - 5:00 pm Sat - Sun Closed","president: (877) 468-6212",,"debit, paypal, cash, all major credit cards, financing available",,,,,,,,,,,,
16898293,2349052,"2020-09-27 06:18:36","Fidelity Bank",http://www.fidelitybankwf.com,,"(940) 763-2100","2525 Kell Blvd","Wichita Falls",TX,76308,"2525 Kell Blvd,Wichita Falls,TX 76308","Mortgages, Banks, Commercial & Savings Banks, Commercial Real Estate, Financial Planning Consultants, Financial Services, Financing Services, Investment Management, Investments, Loans, Office Buildings & Parks, Real Estate Loans",,,,33.88468,-98.52751,,,"When You're Ready, We're Ready. Six Locations to serve you. Call Or Stop In Today.","Mon - Fri: 9:00 am - 4:00 pm Sat - Sun Closed","24 Hour Account Information: (866) 763-2100",,,,,http://www.fidelitybankwf.com,"Specialties: Houses, Homes",,,,,,,,
16914377,2353313,"2020-09-27 06:18:58","Value Funding",https://www.valuefunding.net,,"(210) 764-6340",,,,,,"Financing Consultants, Farm Equipment, Mortgages, Office Furniture & Equipment-Renting & Leasing, Real Estate Loans",,,,,,,"Commercial Real Estate Lending in 50 Sates. Variety of residential home loan programs. Equipment Leasing with an Option to buy. Cash Flow management services with factoring of Accounts Receibable financing. Are you buyin or refinancing a businss? We offer a wide variety of Loan Programs USDA, SBA, Private equity funds or VA, FHA to suit your financing needs. Visit us on the web.","Commercial Real Estate Loans Nationwide Residential Loans from $50,000 - Conventional & Gov't Programs Business Financing Solutions with SBA, USDA - Gov't Programs and Private Equity Funds Equipment Leasing With Option To Buy Cash Flow Management Loans with Account Receivables Financing Many Loan Programs To Suit Your Financing Needs www.valuefunding.net "" Lending With A Touch of Class ""","Mon - Fri: 8:00 am - 8:00 pm Sat: 2:00 pm - 6:30 pm Sun: 11:00 am - 4:30 pm","FAX us toll free: (866) 529-3022",,"visa, master card, debit",,,"Commercial & Residential Real Estate Lending, Equipment Leasing, Account Receivable Financing",,,,,,,,,
16925592,2356235,"2020-09-27 06:19:17","First Community Bank",http://fcbot.com/,social@fcbot.com,"(361) 356-1196","416 N Water St","Corpus Christi",TX,78401,"416 N Water St,Corpus Christi,TX 78401","Financial Planners, Banks, Financial Services, Loans, Mortgages, Office Buildings & Parks, Real Estate Loans",,,A+,27.7955,-97.39249,,,"First Community Bank is a regional retail bank that serves residents and businesses in the Corpus Christi, Texas, area. It offers a variety of financial products and services, including traditional deposit services, loans, mortgages and Internet banking. First Community has four offices in Corpus Christi. and one each in Alice, Kingsville and Portland, Texas. The bank was founded in 1983 under the name First National Bank. It switched to First Community Bank in 2002. First Community is owned by Coastal Bend Bancshares, a one-bank holding company with total assets of more than $74 million.","Mon - Thu: 9:00 am - 4:00 pm Fri: 9:00 am - 5:00 pm Sat - Sun Closed","Phone: (361) 888-3700",,mastercard,,"1st Community Bank Building","http://fcbot.com http://fsbnm.com","Specialties: Vehicles",,,,,,,,
17019380,2380880,"2020-09-27 06:22:13","Phoenix Real Estate Investment Corp",http://www.phoenixreic.com,,"(408) 323-1289","1202 Kifer Rd",Sunnyvale,CA,94086,"1202 Kifer Rd,Sunnyvale,CA 94086","Financing Services, Investments, Mortgages, Office & Desk Space Rental Service, Real Estate Loan Processing",,,,37.37357,-121.99539,https://i4.ypcdn.com/blob/c2e164ede825cc272e1dc37426aced88029d4a44_100x100_crop.jpg?d9a04b5,,"Phoenix Real Estate Investment Corporation operates a highly professional, ethical, and agent-friendly full-service real estate, mortgage and investment company.","Mon - Fri: 9:00 am - 5:00 pm Sat - Sun Closed",,,"no credit cards",,,http://www.phoenixreic.com,,,,,,,,,
17023946,2382030,"2020-09-27 06:22:23","Frost - Downtown Corpus Christi",,,"(361) 883-3621","802 N Carancahua St","Corpus Christi",TX,78401,"802 N Carancahua St,Corpus Christi,TX 78401","Banks, ATM Locations, Annuities & Retirement Insurance Plans, Commercial & Savings Banks, Financial Planners, Financial Planning Consultants, Financial Services, Internet Banking, Investment Advisory Service, Investment Management, Investment Securities, Investments, Loans, Mortgages, Mutual Funds, Office Furniture & Equipment-Renting & Leasing, Stock & Bond Brokers, Surety & Fidelity Bonds",,,,27.79763,-97.39686,,"Banking. Investments. Insurance.","Texas roots. World-class service. From banking and insurance to all your investment needs, Frost is here for you. Literally. If you're in Texas, chances are there's a Frost nearby with folks you can trust to navigate you through any financial decision, no matter how simple or complicated. And because we put people first, you'll get the kind of customer service Frost has been known for since we first started serving this great state six generations ago. You'll also be able to take advantage of our time-tested, disciplined approach to helping you make the right financial decisions for your money.","Mon - Fri: 9:00 am - 5:00 pm Sat - Sun Closed",,,,,,,,,,,,,,,
17025547,2382433,"2020-09-27 06:22:23","Chesapeake Business Centre",http://www.chesapeakecentre.com,info@chesapeakecentre.com,"(615) 369-0600","205 Powell Pl",Brentwood,TN,37027,"205 Powell Pl,Brentwood,TN 37027","Office & Desk Space Rental Service, Commercial Real Estate, Loans, Mortgages, Office Buildings & Parks, Real Estate Loans",,,A+,36.0356,-86.81371,,,,"Mon - Thu: 8:00 am - 5:00 pm Fri: 8:00 am - 4:00 pm","1616 Westgate Cir Brentwood: (615) 844-6200",,,,,http://www.chesapeakecentre.com,"Parking: Lot",,,,,,,,
17098709,2402007,"2020-09-27 06:24:02","One Source Commercial Inc",http://one-source-commercial.com,info@oscre.biz,"(901) 767-0672","1148 Vickery Ln",Cordova,TN,38016,"1148 Vickery Ln,Cordova,TN 38016","Real Estate Loans, Commercial Real Estate, Mortgages, Office & Desk Space Rental Service, Real Estate Loan Processing",,,,35.157417,-89.77922,https://i4.ypcdn.com/blob/ad4665cf9c63c649827a2887c3f3c3373883485d_100x100_crop.jpg?d9a04b5,,,"Mon - Fri: 9:00 am - 5:00 pm","TollFree: (877) 205-8736",,,,,http://one-source-commercial.com,"Parking: On Site, Free Wheelchair Accessible: Yes",,,,,,,,
17491753,2550192,"2020-09-27 06:37:54","First National Bank",https://www.fnbo.com,,"(815) 472-6500","159 Stirling Pl Ste 2",Momence,IL,60954,"159 Stirling Pl Ste 2,Momence,IL 60954","Banks, ATM Locations, Loans, Mortgages",,,,41.17448,-87.6618,,,,,"Phone: (815) 472-6510",,"all major credit cards",,"First National Bank of Grant Park Momence First National Bank-Grant Park",https://www.fnbo.com,,,,,,,,,
17491762,2550195,"2020-09-27 06:37:54","Bank of the West",https://www.bankofthewest.com,virginia.victorin@bankofthewest.com,"(720) 304-0889","400 Center Dr",Superior,CO,80027,"400 Center Dr,Superior,CO 80027","Banks, ATM Locations, Loans, Mortgages",,,,39.95554,-105.17041,https://i2.ypcdn.com/blob/b84df1cfcb49ce008a7c931a68e40e94ccf2ee75_100x100_crop.jpg?f9d23e1,,,"Mon - Fri: 9:00 am - 5:00 pm Sat: 9:00 am - 12:00 pm Sun Closed","Phone: (720) 304-0893 Primary Phone: (720) 304-0890",,"master card, visa",,"Commercial Federal Bank",https://www.bankofthewest.com,,,,,,,,,
17491800,2550216,"2020-09-27 06:37:54","Citizens Bank",http://www.citizensbank.com,,"(810) 487-0160","6452 W Pierson Rd",Flushing,MI,48433,"6452 W Pierson Rd,Flushing,MI 48433","Banks, ATM Locations, Loans, Mortgages",,,,43.06081,-83.81009,,,,"Mon - Fri: 7:00 am - 7:00 pm",,,"all major credit cards",,,http://www.citizensbank.com,,,,,,,,,
17491812,2550225,"2020-09-27 06:37:54","Citizens Bank",http://www.citizensbank.com,janetholleran@citizensbank.com,"(814) 234-6301","341 Science Park Rd Ste 201","State College",PA,16803,"341 Science Park Rd Ste 201,State College,PA 16803","Banks, ATM Locations, Loans, Mortgages",,,,40.77852,-77.89496,,,,,,,"all major credit cards",,,http://www.citizensbank.com,,,,,,,,,
17491827,2550231,"2020-09-27 06:37:54","Towpath Credit Union",http://www.towpathcu.com,,"(330) 664-4700","2969 Smith Rd",Fairlawn,OH,44333,"2969 Smith Rd,Fairlawn,OH 44333","Credit Unions, ATM Locations, Banks, Commercial & Savings Banks, Financial Services, Loans, Mortgages, Real Estate Loans",,,A+,41.13636,-81.61683,https://i2.ypcdn.com/blob/a8416121503f86cf306e4e91895da204996841ec_100x100_crop.jpg?f9d23e1,"Proud of Our History, Excited About Our Future","Please Visit Our Web Site For More Information.","Mon - Tue: 9:00 am - 5:00 pm Wed: 10:00 am - 5:00 pm Thu - Fri: 9:00 am - 5:00 pm Sat: 9:00 am - 12:00 pm",,,,,,http://www.towpathcu.com,"Parking: Lot",,,,,,,,
17491843,2550236,"2020-09-27 06:37:54","Simmons Bank",http://simmonsbank.com,,"(866) 246-2400","1025 S Donaghey Ave",Conway,AR,72034,"1025 S Donaghey Ave,Conway,AR 72034","Commercial & Savings Banks, ATM Locations, Banks, Loans, Mortgages, Trust Companies",,,,35.06608,-92.45508,,,,,,,,,,"http://simmonsbank.com https://simmonsbank.com",,,,,,,,,
17491863,2550243,"2020-09-27 06:37:54","First National Bank",https://www.fnbo.com,,"(717) 814-5301","135 N George St",York,PA,17401,"135 N George St,York,PA 17401","Banks, ATM Locations, Loans, Mortgages",,,,39.96498,-76.72837,,,,"Mon - Sun: Open 24 Hours","Phone: (717) 650-2301",,"debit, all major credit cards",,"First National Bank ATM",https://www.fnbo.com,,,,,,,,,
17491869,2550244,"2020-09-27 06:37:54","First American Bank",,hsa@firstambank.com,"(708) 442-9600","15 Riverside Rd",Riverside,IL,60546,"15 Riverside Rd,Riverside,IL 60546","Commercial & Savings Banks, ATM Locations, Banks, Financial Services, Loans, Mortgages",,,,41.82698,-87.81841,https://i2.ypcdn.com/blob/096f0c52c2d01af8611ae07394f27eeae6077c83_100x100_crop.jpg?f9d23e1,,"Friendly professionals at First American Bank's branch at 15 Riverside Road in Riverside, IL, provide the answers and solutions you need. Open checking and savings accounts, apply for a mortgage or business loan, and much more at this location. Keep in mind, you also can manage your accounts anytime through Online and Mobile Banking.","Mon - Thu: 8:00 am - 5:00 pm Fri: 8:00 am - 6:00 pm Sat: 8:00 am - 1:00 pm Sun Closed",,,"all major credit cards",,,,"Parking: Lot, Free Wheelchair Accessible: Yes",,,,,,,,
17491889,2550250,"2020-09-27 06:37:54","Northwest Bank",http://www.snl.com/IRWeblinkX/branchdetails.aspx?iid=1137118&bankfacility=19088&Zip=44089&Street=&City=&State=,info@northwest.com,"(440) 967-3124","4455 Liberty Ave",Vermilion,OH,44089,"4455 Liberty Ave,Vermilion,OH 44089","Banks, ATM Locations, Commercial & Savings Banks, Loans, Mortgages",,,,41.42477,-82.34358,https://i2.ypcdn.com/blob/6f01c8d5d8ad4ae2e5b81d92a6105c3a06582be6_100x100_crop.jpg?f9d23e1,"Northwest Bank is a bank headquartered in Warren, Pennsylvania. It operates 172 branches in central",,"Mon - Thu: 9:00 am - 5:00 pm Fri: 9:00 am - 5:30 pm Sat: 9:00 am - 12:00 pm","Toll-Free: (877) 672-5678",,debit,,,"http://www.snl.com/IRWeblinkX/branchdetails.aspx?iid=1137118&bankfacility=19088&Zip=44089&Street=&City=&State= http://www.northwest.com",,,,,,,,,
17491898,2550254,"2020-09-27 06:37:54","TCF Bank",http://www.tcfbank.com,,"(800) 823-2265","7525 Lake St","River Forest",IL,60305,"7525 Lake St,River Forest,IL 60305","Banks, ATM Locations, Loans, Mortgages",,,,41.88831,-87.81307,https://i2.ypcdn.com/blob/4b5dd3360cf2c6bc3c5e8c240c448b5ff9b79f8a_100x100_crop.jpg?f9d23e1,,"At TCF Bank we have financial tools and products that suit your lifestyle. Find out how we can help you with checking, savings, loans, prepaid services and more. Whether youВ’re just starting out, planning for the future or shifting into high gear, we offer simple solutions designed to help you on your way. Member FDIC. Equal Housing Lender.","Mon - Thu: 9:00 am - 6:00 pm Fri: 9:00 am - 7:00 pm Sat: 10:00 am - 3:00 pm Sun Closed",,,debit,,,http://www.tcfbank.com/,,,,,,,,,
17491902,2550255,"2020-09-27 06:37:54","Bank of the West",https://www.bankofthewest.com,,"(715) 865-3461","5836 N County Road F","Stone Lake",WI,54876,"5836 N County Road F,Stone Lake,WI 54876","Banks, ATM Locations, Loans, Mortgages",,,,45.833733,-91.50929,https://i2.ypcdn.com/blob/b84df1cfcb49ce008a7c931a68e40e94ccf2ee75_100x100_crop.jpg?f9d23e1,,,"Mon - Fri: 9:00 am - 5:00 pm Sat - Sun Closed",,,"master card, visa",,,https://www.bankofthewest.com,,,,,,,,,