business_x_category.id,business.id,business.ts,business.business_name,business.home_page,business.email_address,business.phone,business.street,business.city,business.state,business.zip_code,business.full_address,business.category,business.rating,business.number_of_reviews,business.bbb_rating_or_license,business.latitude,business.longitude,business.cover_image,business.slogan,business.general_info,business.regular_hours,business.extra_phones,business.services_products,business.payment,business.price_range,business.aka,business.other_links,business.other_information,business.review_1_name,business.review_1_date,business.review_1_rating,business.review_1_text,business.review_2_name,business.review_2_date,business.review_2_rating,business.review_2_text
459230,158230,"2020-09-27 02:45:41","Take Two Video Pro",http://www.taketwovideopro.com,TakeTwo@Cableone.net,"(228) 697-7458","134 Balmoral Ave",Biloxi,MS,39531,"134 Balmoral Ave,Biloxi,MS 39531","Video Production Services, Aerial Photographers, Audio-Visual Creative Services, Audio-Visual Production Services, Commercial Photographers, Commercials-Radio & Television, Court & Convention Reporters, Motion Picture Film Services, Motion Picture Producers & Studios, Photography & Videography, Wedding Photography & Videography, Wedding Supplies & Services",5,"3 Reviews",,30.39155,-88.98528,,"NOW Shooting in HD!","A refreshing take on weddings & event videography. Acclaimed destination videographers based in Biloxi, MS. We provide high quality wedding films, wedding photography, green screen photo shoots, slide shows, & many other exciting services. Biloxi, New Orleans, Baton Rouge, Long Beach, Bay St Louis, Ocean Springs, Pascagoula, Moss Point, Mobile, Fair Hope, Pensacola. Your wedding day is going to be one of the most memorable days of your life. This point in time that you have chosen to join two lives as one should always be as clear in your memory as the day it happened & with Mississippi wedding photographers, it will be. Whether you choose to immortalize this day in photos or in a video, you will always be able to come back to the moment where your love was declared to the world.","Mon - Sat: 10:00 am - 5:00 pm Sun Closed",,,"check, discover, visa, mastercard, all major credit cards, debit",,,http://www.taketwovideopro.com,,"Sophie B.",04/01/2016,five,"John and his team did a wonderful job of my daughter's wedding. It was everything i hoped for and more! Artistic and very well done, i cant give enough stars for him and his teams professionlism and enthusiasm for detail! They even had a drone! I would suggest take two for a wedding or any other video needs! Thank you so much!",biofuel,03/15/2013,five,"John Lestrade Directed us in our convention suppling great Video & Audio Visuial. We needed a story told with an emotionial investment and they went above and beyound. Thanks"
459283,158240,"2020-09-27 02:45:41","Turner Video & Sound",http://www.facebook.com,turnervideo@comcast.net,"(877) 333-1062","284 Francis Rd",Decatur,IL,62522,"284 Francis Rd,Decatur,IL 62522","Recording Service-Sound & Video, Audio-Visual Creative Services, Audio-Visual Equipment-Renting & Leasing, Consumer Electronics, Electronic Equipment & Supplies-Wholesale & Manufacturers, Motion Picture Producers & Studios, Stereo, Audio & Video Equipment-Dealers, Stereo, Audio & Video Equipment-Renting & Leasing, Stereo, Audio & Video Equipment-Service & Repair, Stereo, Audio & Video Equipment-Wholesale & Manufacturers, Telecommunications-Equipment & Supply, Video Conferencing Equipment & Services, Video Equipment & Supplies, Video Equipment & Supplies-Renting & Leasing, Video Equipment-Installation, Service & Repair, Video Production Services",,,,39.83947,-89.05367,,"Professional live sound, video & lighting.","Turner Video has been editing and producing music and video in the central Illinois area for over 25 years. Now offering DVD/CD duplication, as well as laptops and data projector rentals, we are the choice throughout Illinois for weddings, videography, video scrap booking, radio and television commercials and more. We also have a professional live sound, video, and lighting service with video and music production. We do high definition video to give you the highest quality possible to capture your event. Call today, check out our site or see our work on You Tube to find out how we can help your next event or production be the best.","By Appointment Only",,,check,,,http://www.facebook.com,"Specialties: Weddings, Commercials",,,,,,,,
459402,158275,"2020-09-27 02:45:42","Playfish Media",http://playfishmedia.com,info@playfishmedia.com,"(206) 455-5783","111 S Lander St Ste 104",Seattle,WA,98134,"111 S Lander St Ste 104,Seattle,WA 98134","Video Production Services, Audio-Visual Production Services, Motion Picture Producers & Studios, Production Companies-Film, TV, Radio, Etc, Video Production Services-Commercial",,,A+,47.57959,-122.33395,https://i2.ypcdn.com/blob/f92b63a240ec75e023476ffb1b68f1d3ab091cdc_100x100_crop.jpg?f9d23e1,"Playfish Media is a full-service, Seattle-based video production company. We believe in people, deve",,"Mon - Fri: 9:00 am - 6:00 pm",,,"all major credit cards",,"Playfish Media LLC","http://playfishmedia.com https://playfishmedia.com http://playfishmedia.com/?utm_source=google&utm_medium=local&utm_campaign=gmb",,,,,,,,,
459650,158346,"2020-09-27 02:45:42","Show Services Inc",http://www.showservicesinc.com,,"(843) 815-3731","365 Red Cedar St Ste 201",Bluffton,SC,29910,"365 Red Cedar St Ste 201,Bluffton,SC 29910","Video Production Services, Audio-Visual Production Services, Motion Picture Producers & Studios",,,,32.25764,-80.86074,,,,,"Phone: (843) 815-3741 Fax: (843) 815-3741",,,,,"http://www.showservicesinc.com https://showservicesinc.com",,,,,,,,,
459665,158351,"2020-09-27 02:45:42","Stf Productions Inc",,,"(301) 215-7190","2 Bethesda Metro Ctr",Bethesda,MD,20814,"2 Bethesda Metro Ctr,Bethesda,MD 20814","Video Production Services, Audio-Visual Production Services, Motion Picture Producers & Studios, Video Production Services-Commercial",,,,38.98412,-77.09624,,,,,"Phone: (240) 482-1180 Fax Number: (240) 482-1180",,,,,,,,,,,,,,
459847,158399,"2020-09-27 02:45:42","Sparkworks Media",http://www.sparkworksmedia.com,info@sparkworksmedia.com,"(206) 284-5500","2400 Airport Way S Ste 100",Seattle,WA,98134,"2400 Airport Way S Ste 100,Seattle,WA 98134","Video Production Services, Audio-Visual Production Services, Motion Picture Film Services, Motion Picture Producers & Studios, Video Production Services-Commercial",,,A+,47.58174,-122.32085,,,,"Mon - Fri: 8:00 am - 5:00 pm",,,,,"Sparkworks Media Llc","http://www.sparkworksmedia.com https://www.sparkworksmedia.com",,,,,,,,,
460137,158491,"2020-09-27 02:45:42","Preferred Content",http://www.preferredcontent.net,info@preferredcontent.net,"(323) 782-9193","6363 Wilshire Blvd","Los Angeles",CA,90048,"6363 Wilshire Blvd,Los Angeles,CA 90048","Production Companies-Film, TV, Radio, Etc, Audio-Visual Production Services, Motion Picture Film Services, Motion Picture Producers & Studios, Video Production Services",,,,34.06405,-118.36744,,,"Preferred Content is a film, television and digital sales, project finance and advisory company",,,,,,"Preffered Content",http://www.preferredcontent.net,,,,,,,,,
460241,158523,"2020-09-27 02:45:42","Akf Court Reporting & Videotech Services",http://www.akf.com,ed@akf.com,"(412) 261-2323","436 Blvd Of The Allies",Pittsburgh,PA,15219,"436 Blvd Of The Allies,Pittsburgh,PA 15219","Video Production Services, Audio-Visual Production Services, Motion Picture Producers & Studios",,,,40.4371,-79.99907,,,,,"Phone: (412) 502-5567 Phone: (412) 261-2537 Phone: (412) 316-4030 Phone: (412) 316-4003 Fax: (412) 261-2537 TollFree: (888) 253-3376",,"amex, discover, master card, visa, all major credit cards",,"Akf Reporting AKF Video","http://www.akf.com https://www.akf.com",,,,,,,,,
460337,158556,"2020-09-27 02:45:42","Gameday Production",http://gamedaytv.com,malexander@gamedaytv.com,"(817) 430-8860","3575 Lone Star Cir","Fort Worth",TX,76177,"3575 Lone Star Cir,Fort Worth,TX 76177","Video Production Services, Audio-Visual Production Services, Commercial Photographers, Motion Picture Film Services, Motion Picture Producers & Studios, Photography & Videography, Portrait Photographers, Video Production Services-Commercial, Wedding Photography & Videography",,,,33.03074,-97.28086,,,,,,,,,"GameDay Productions, Inc.",http://gamedaytv.com,"Specialties: Motion Pictures, Movies, Photographs, Television, Tv",,,,,,,,
460444,158588,"2020-09-27 02:45:42","Off The Wire Studios",http://www.offthewirestudios.com,eric@offthewirestudios.com,"(757) 349-6897",,Norfolk,VA,23508,"Norfolk,VA 23508","Motion Picture Film Services, Audio-Visual Production Services, Motion Picture Producers & Studios, Photography & Videography, Production Companies-Film, TV, Radio, Etc, Recording Service-Sound & Video, Video Equipment & Supplies, Video Production Services, Video Production Services-Commercial",,,,,,,"No matter the size of the screen our projects are seen, everything from our studio is hot Off The Wire!","About Us: Eric Hales - Owner/founder of Off The Wire Studios, Eric has worked in the video/film business for the past 14 years. He trained in TV Production at the Chesapeake Center for Science & Technology 1998-2000 and graduated from Old Dominion University in 2005 with a B.S. Communications В– Film/Video. Eric has worked for networks including MTV, E!, A&E, BET, PBS, FOX, TRAVEL, and SPEED. He has worked on hundreds of projects, including music videos, commercials, TV shows, live broadcasts, and short and feature films. Producer, Director, Cinematographer, EditorВ… Eric does it all. John McClung - Co-founder of Off The Wire Studios and Programming Director atWRRW/WYOU, John has worked in the video/film business for 28 years. John has shot and co-produced three feature films with national distribution, seven TV shows, and hundreds of commercials, EPKВ’s, and music videos for artists including Missy Elliot, Gwen Stefani, Salt NВ’ Peppa, and Green Day. From 1988-2008, John co-owned Big Dog Video Productions. While running Big Dog, John mentored Hype Williams and Derrick Borte with fundamentals that helped launch their success in Hollywood. In addition to film and video production, John is a skilled technical engineer. He operates and repairs all types of broadcast equipment and provides complete engineering for radio stations, including FCC applications, as well as structuring, designing, and installing transmission, microwave, and studio equipment. An abstract thinker and visionary at heart, John brings his experience and innovation to Off The Wire Studios.",,,,"check, debit, financing available, paypal, travelers checks",,,"Main Website",,,,,,,,,
460635,158634,"2020-09-27 02:45:42","Suite Spot",http://suitespot.tv/locations/los-angeles,hello@suitespot.tv,"(213) 624-6310","639 S Spring St Apt 9c","Los Angeles",CA,90014,"639 S Spring St Apt 9c,Los Angeles,CA 90014","Video Production Services-Commercial, Audio-Visual Production Services, Motion Picture Producers & Studios, Production Companies-Film, TV, Radio, Etc, Video Production Services",,,,34.04521,-118.25214,https://i3.ypcdn.com/blob/b21c27debc6d7ee6b4156d0e67712bfb0c4234de_100x100_crop.jpg?e66d351,"Suite Spot is Your Creative & Professional Video Production Partner",,"Mon - Fri: 9:00 am - 6:00 pm",,,"debit, invoicing available, all major credit cards, amex, check, discover, master card, visa",,"Suite Spot LLC","http://suitespot.tv/locations/los-angeles http://suitespot.tv/los-angeles https://suitespot.tv/los-angeles",,,,,,,,,
460904,158716,"2020-09-27 02:45:42","Presentation Services",http://psav.com,,"(215) 365-7173","4101 Island Ave",Philadelphia,PA,19153,"4101 Island Ave,Philadelphia,PA 19153","Video Production Services, Audio-Visual Production Services, Motion Picture Producers & Studios",,,,39.89213,-75.23494,,,,,"Primary Phone: (215) 772-1003 Phone: (215) 772-1003 Fax: (215) 365-7173",,,,"Psav Presentation Service",http://psav.com,,,,,,,,,
460913,158718,"2020-09-27 02:45:42","Mindigital Video",http://www.mindigital.com,,"(330) 467-0667","8297 Harmon Dr",Macedonia,OH,44056,"8297 Harmon Dr,Macedonia,OH 44056","Video Production Services, Audio-Visual Production Services, Motion Picture Film Services, Motion Picture Producers & Studios, Video Production Services-Commercial",,,,41.31686,-81.5222,,,,,,,,,,http://www.mindigital.com,,,,,,,,,
461149,158789,"2020-09-27 02:45:42","Reel Sessions",http://reelsessions.com,production@reelsessions.com,"(310) 827-1000","701 Venice Blvd",Venice,CA,90291,"701 Venice Blvd,Venice,CA 90291","Production Companies-Film, TV, Radio, Etc, Audio-Visual Production Services, Digital Printing & Imaging, Motion Picture Producers & Studios, Video Production Services, Video Production Services-Commercial",,,,33.991497,-118.4581,,,"Reel Sessions is a production company based in Venice, California that specializes in television, film and print production.","Mon - Fri: 9:00 am - 6:00 pm Sat - Sun Closed","Fax: (310) 827-1018",,,,,http://reelsessions.com,"Parking: Lot",,,,,,,,
461174,158796,"2020-09-27 02:45:42","28th Street Productions",,mailforbrandonford@gmail.com,"(727) 432-6293",,,,,,"Audio-Visual Creative Services, Audio-Visual Production Services, Motion Picture Producers & Studios, Video Production Services, Wedding Supplies & Services",,,,,,,"Affordable Prices with Proven Reliability","We provide video production services for many types of events and films. Including weddings, birthdays,independent films and documentaries. Commercial,",,,,,,,,,,,,,,,,
461239,158814,"2020-09-27 02:45:42","U Edit Video",http://www.ueditvideo.com,owen@ueditvideo.com,"(972) 690-3348","1002 N Central Expy Ste 555",Richardson,TX,75080,"1002 N Central Expy Ste 555,Richardson,TX 75080","Video Production Services, Audio-Visual Production Services, CD, DVD & Cassette Duplicating Services, Motion Picture Producers & Studios",,,,32.96182,-96.72491,,,,"Mon - Fri: 9:00 am - 5:00 pm","Phone: (972) 980-4840 Primary Phone: (972) 980-4840 Fax Number: (972) 907-2440 Fax: (972) 234-6515 Fax: (972) 907-2440",,,,,http://www.ueditvideo.com,,,,,,,,,
461267,158821,"2020-09-27 02:45:42","Phoenix Production Services",http://www.filmwithpps.com,production@FilmWithPPS.com,"(480) 717-4117","3902 E Broadway Rd Ste B",Phoenix,AZ,85040,"3902 E Broadway Rd Ste B,Phoenix,AZ 85040","Video Production Services-Commercial, Advertising Agencies, Audio-Visual Production Services, Motion Picture Film Services, Motion Picture Producers & Studios, Production Companies-Film, TV, Radio, Etc, Video Production Services",,,,33.40779,-111.99711,https://i2.ypcdn.com/blob/406ee8321ab0938a2cf715639230be009765a8a4_100x100_crop.jpg?f9d23e1,"Video production, coordination, crew, and gear for your next project","For about twenty years, our company has been servicing the Arizona film community and has been a witness to the evolution of the production model. It has always been our belief that the best way for our company to succeed is to help our clients succeed. We've seen firsthand the increasing business challenges faced by our customers these last few years.","Mon - Fri: 8:00 am - 4:00 pm","Phone: (602) 832-7080",,"amex, cash, check, discover, master card, visa, all major credit cards, debit, invoicing available, paypal",,"It Service In Phoenix","http://www.filmwithpps.com https://www.filmwithpps.com/?utm_source=gmb&utm_medium=organic&utm_campaign=phoenix",,,,,,,,,
461286,158823,"2020-09-27 02:45:42","La Dolce Video & Design",http://www.ladolce.pro,info@ladolcevideo.com,"(906) 226-6200","2208 Us Highway 41 S",Marquette,MI,49855,"2208 Us Highway 41 S,Marquette,MI 49855","Video Production Services-Commercial, Advertising Agencies, Advertising Specialties, Audio-Visual Creative Services, Audio-Visual Production Services, Commercial Photographers, Computer System Designers & Consultants, Internet Products & Services, Motion Picture Film Services, Motion Picture Producers & Studios, Video Production Services, Wedding Photography & Videography",,,,46.50388,-87.36288,,,,"Mon - Fri: 8:00 am - 5:00 pm",,,,,,"http://www.ladolce.pro http://ladolcevideo.com",,,,,,,,,
461309,158830,"2020-09-27 02:45:42","Ascent Video",http://ascentvideo.com,,"(304) 724-1660","45 Baltusrol Dr","Charles Town",WV,25414,"45 Baltusrol Dr,Charles Town,WV 25414","Video Production Services, Audio-Visual Production Services, Motion Picture Producers & Studios",,,,39.2896,-77.90166,,,,"Mon - Sun: Open 24 Hours",,,"all major credit cards, check, amex, discover, mastercard, visa",,,http://ascentvideo.com,,,,,,,,,
461418,158870,"2020-09-27 02:45:42","Victory Studios",http://www.victorystudios.com,info@victorystudios.com,"(206) 508-6315","2247 15th Ave W",Seattle,WA,98119,"2247 15th Ave W,Seattle,WA 98119","Motion Picture Film Services, Audio-Visual Creative Services, Audio-Visual Equipment, Consumer Electronics, Motion Picture Producers & Studios, Television & Radio Stores, Video Production Services",,,A+,47.64024,-122.37661,https://i2.ypcdn.com/blob/c91162da32d5650e40a9e768d7400de1556bb13c_100x100_crop.jpg?e66d351,"A World Class Production Company with facilities to match.","Victory Studios is a communications and production services company, based in Seattle, which offers postproduction facilities. Established in 1978, it provides full-service audio, telecine, DVD services, crews, sound stages, duplication and multimedia. It has special expertise in high definition as it is one of the very first postproduction facilities in the United States involved in high definition in collaboration with Sony. The company has gradually extended its services and caters also to the requirements of video, film and television companies. Victory Studios provides services, such as editing, color enhancement, Web services, crew and production services, studio rentals, and audio, and duplication services.","Mon - Fri: 8:00 am - 8:00 pm Sat - Sun Closed","toll free to Victory: (888) 282-1776",,"visa, amex, discover, debit, check, paypal, travelers checks, mastercard",,,http://www.victorystudios.com,"Parking: Lot",,,,,,,,
461889,158998,"2020-09-27 02:45:42","Tecolote Productions",,,"(310) 274-7928","280 S Beverly Dr Ste 311","Beverly Hills",CA,90212,"280 S Beverly Dr Ste 311,Beverly Hills,CA 90212","Production Companies-Film, TV, Radio, Etc, Audio-Visual Production Services, Motion Picture Producers & Studios, Video Production Services",,,,34.06244,-118.39872,,,,,,,,,"Tecolote Productions Inc",,,,,,,,,,
462134,159081,"2020-09-27 02:45:52","Penumbra Productions",,archaismic@earthlink.net,"(360) 373-2230","1014 Warren Ave",Bremerton,WA,98337,"1014 Warren Ave,Bremerton,WA 98337","Video Production Services, Audio-Visual Production Services, Motion Picture Producers & Studios",,,,47.57059,-122.63259,,,,"Mon - Sun: 10:00 am - 10:00 pm","Phone: (360) 769-8115 Phone: (360) 850-7876",,,,,,"Parking: Lot",,,,,,,,
462151,159088,"2020-09-27 02:45:52","Optasia Productions Inc",http://www.optasiaproductions.com,,"(513) 793-1303","7359 E Kemper Rd Ste B",Cincinnati,OH,45249,"7359 E Kemper Rd Ste B,Cincinnati,OH 45249","Video Production Services, Audio-Visual Production Services, Motion Picture Film Services, Motion Picture Producers & Studios, Video Production Services-Commercial",,,,39.28091,-84.35846,,,,,,,,,"Optasia Productions LLC","http://www.optasiaproductions.com https://www.optasiaproductions.com",,,,,,,,,
462246,159119,"2020-09-27 02:45:52","MarketME Video Production",http://www.marketmevideo.tv,info@marketmevideo.tv,"(415) 465-9200","633 Quarry Rd Ste D","San Carlos",CA,94070,"633 Quarry Rd Ste D,San Carlos,CA 94070","Video Production Services-Commercial, Audio-Visual Production Services, Motion Picture Film Services, Motion Picture Producers & Studios, Photography & Videography, Video Production Services",,,,37.51629,-122.26773,https://i2.ypcdn.com/blob/5e80e086f1c871d0682f095dcdf9601a51287c77_100x100_crop.jpg?e66d351,,"MarketME is a video production company from the San Francisco Bay Area. MarketME's headquarters are situated right in the heart of the San Francisco Peninsula. We are professional filmmakers and video marketing experts. We've worked with industry leading brands both domestically and internationally. MarketME offers a variety of different video production services both large and small scale. Our goal is to provide you with a product that will not go unnoticed by your target audience.","Mon - Sat: 9:00 am - 5:00 pm Sun: 9:00 am - 7:00 pm",,,"amex, master card, visa, discover, cash, paypal",,,"http://www.marketmevideo.tv https://www.marketmevideo.tv",,,,,,,,,
462355,159155,"2020-09-27 02:45:52","Dog & Pony Productions",http://www.dogandponyinc.com,dogandponyinc@aol.com,"(402) 391-7691","8928 L St",Omaha,NE,68127,"8928 L St,Omaha,NE 68127","Video Production Services, Audio-Visual Production Services, Motion Picture Producers & Studios, Video Production Services-Commercial",,,,41.21294,-96.04966,,,,,,,,,"Dog & Pony Productions, Inc.","http://www.dogandponyinc.com http://www.dogandponyinc.net",,,,,,,,,
462389,159166,"2020-09-27 02:45:52","Josh Birt Media Productions",http://www.joshbirt.com,josh@joshbirt.com,"(412) 944-9905","7240 Mcknight Rd",Pittsburgh,PA,15237,"7240 Mcknight Rd,Pittsburgh,PA 15237","Production Companies-Film, TV, Radio, Etc, Audio-Visual Production Services, Motion Picture Producers & Studios, Video Production Services, Video Production Services-Commercial",,,,40.53595,-80.01057,,"Pittsburgh's full service video production company",,"Mon - Fri: 9:00 am - 5:00 pm","Phone: (412) 719-7182 Primary Phone: (412) 719-7182",,"amex, debit, master card, visa, cash",,,"http://www.joshbirt.com https://www.joshbirt.com",,,,,,,,,
462620,159223,"2020-09-27 02:45:52","Soundview Services Inc",http://www.soundviewservices.com,info@soundviewservices.com,"(703) 777-9570","1 Phillips Dr NW",Leesburg,VA,20176,"1 Phillips Dr NW,Leesburg,VA 20176","Video Production Services, Audio-Visual Production Services, Motion Picture Producers & Studios",,,,39.1206,-77.57987,,,,,"Primary Phone: (703) 309-9415 Phone: (703) 777-9572 TollFree: (866) 680-8189",,paypal,,,http://www.soundviewservices.com,,,,,,,,,
462639,159229,"2020-09-27 02:45:52",Trishul,,,"(870) 862-6500","716 W 19th St","El Dorado",AR,71730,"716 W 19th St,El Dorado,AR 71730","Video Production Services, Audio-Visual Production Services, Motion Picture Producers & Studios",,,,33.23705,-92.67334,,,,,,,,,"Trishul Llc",,,,,,,,,,
462657,159234,"2020-09-27 02:45:52","Deluca Photography and Video Productions LLC",http://www.delucaphoto.com,info@delucaphoto.com,"(330) 801-5607","1000 Meadow Park Dr",Akron,OH,44333,"1000 Meadow Park Dr,Akron,OH 44333","Wedding Photography & Videography, Advertising Agencies, Audio-Visual Production Services, Motion Picture Producers & Studios, Photography & Videography, Portrait Photographers, Video Production Services, Video Production Services-Commercial",,,,41.16401,-81.64831,https://i3.ypcdn.com/blob/ed59eded49b966ebc56a39fc0a8af4e03879fe73_100x100_crop.jpg?e66d351,"Love looks like this.",,"Mon - Fri: 9:00 am - 5:00 pm","Primary Phone: (330) 801-5607",,"check, visa, mastercard, amex, discover, debit, all major credit cards",,,http://www.delucaphoto.com,,,,,,,,,