business_x_category.id,business.id,business.ts,business.business_name,business.home_page,business.email_address,business.phone,business.street,business.city,business.state,business.zip_code,business.full_address,business.category,business.rating,business.number_of_reviews,business.bbb_rating_or_license,business.latitude,business.longitude,business.cover_image,business.slogan,business.general_info,business.regular_hours,business.extra_phones,business.services_products,business.payment,business.price_range,business.aka,business.other_links,business.other_information,business.review_1_name,business.review_1_date,business.review_1_rating,business.review_1_text,business.review_2_name,business.review_2_date,business.review_2_rating,business.review_2_text
2531019,778313,"2020-09-27 03:46:39","Budget Rent A Car",https://www.budget.com,,"(319) 287-8026","2790 Livingston Ln",Waterloo,IA,50703,"2790 Livingston Ln,Waterloo,IA 50703","Car Rental, Moving Equipment Rental, Truck Rental",,,,42.55043,-92.39599,https://i1.ypcdn.com/blob/c2493ede7fed4c0d6600098bbd309718bde30da9_100x100_crop.jpg?f9d23e1,,,"Mon - Fri: 7:30 am - 6:00 pm Sat: 9:00 pm - 10:00 pm Sun: 12:00 pm - 10:00 pm","Fax: (319) 233-2011",,"debit, amex, discover, master card, visa, company card, diners club",,"Budget Rent A Car System Inc.",https://www.budget.com,,,,,,,,,
2531040,778325,"2020-09-27 03:46:39","Budget Rent A Car",https://www.budget.com,,"(305) 667-3180","6796 Bird Rd",Miami,FL,33155,"6796 Bird Rd,Miami,FL 33155","Car Rental, Moving Equipment Rental, Truck Rental",,,,25.73321,-80.30477,https://i2.ypcdn.com/blob/c2493ede7fed4c0d6600098bbd309718bde30da9_100x100_crop.jpg?f9d23e1,,,"Mon - Fri: 7:30 am - 7:00 pm Sat: 8:00 am - 4:00 pm Sun: 9:00 am - 1:00 pm","Fax: (305) 667-3207",,"amex, company card, debit, diners club, discover, master card, visa",,"Budget Car Rental",https://www.budget.com,,,,,,,,,
2531081,778340,"2020-09-27 03:46:40","Budget Rent A Car",https://www.budget.com,,"(651) 453-1057","5448 S Robert Trl","Inver Grove Heights",MN,55077,"5448 S Robert Trl,Inver Grove Heights,MN 55077","Car Rental, Moving Equipment Rental, Truck Rental",,,,44.87054,-93.07925,https://i2.ypcdn.com/blob/c2493ede7fed4c0d6600098bbd309718bde30da9_100x100_crop.jpg?f9d23e1,,,"Mon - Fri: 7:30 am - 6:00 pm Sat: 8:00 am - 1:00 pm Sun: 10:00 am - 2:00 pm","Fax: (651) 455-1568",,"company card, diners club, debit, amex, discover, master card, visa, cash",,"Budget Car Rental",https://www.budget.com,,,,,,,,,
2531108,778351,"2020-09-27 03:46:40","Budget Rent A Car",https://www.budget.com,,"(910) 487-0104","419 Cross Creek Mall Ste 400",Fayetteville,NC,28303,"419 Cross Creek Mall Ste 400,Fayetteville,NC 28303","Car Rental, Moving Equipment Rental, Truck Rental",,,,35.0731,-78.96381,https://i2.ypcdn.com/blob/c2493ede7fed4c0d6600098bbd309718bde30da9_100x100_crop.jpg?f9d23e1,,,"Mon - Fri: 8:00 am - 6:00 pm Sat: 9:00 am - 2:00 pm Sun: 9:00 am - 12:00 pm",,,"amex, diners club, discover, master card, visa",,,https://www.budget.com,,,,,,,,,
2531137,778359,"2020-09-27 03:46:40","Budget Rent A Car",https://www.budget.com,W-Selby@budgettruck.com,"(732) 316-2941","1819 State Route 35","South Amboy",NJ,08879,"1819 State Route 35,South Amboy,NJ 08879","Car Rental, Moving Equipment Rental, Truck Rental",,,,40.408226,-74.13081,https://i2.ypcdn.com/blob/c2493ede7fed4c0d6600098bbd309718bde30da9_100x100_crop.jpg?f9d23e1,,,,,,"cash, debit",,"Budget Rent A Car System",https://www.budget.com,,,,,,,,,
2531170,778369,"2020-09-27 03:46:40","Budget Rent A Car",https://www.budget.com,,"(803) 926-1945","880 Ermine Rd","West Columbia",SC,29170,"880 Ermine Rd,West Columbia,SC 29170","Car Rental, Moving Equipment Rental, Truck Rental",,,,33.95679,-81.1299,https://i2.ypcdn.com/blob/c2493ede7fed4c0d6600098bbd309718bde30da9_100x100_crop.jpg?f9d23e1,,,,"Fax: (803) 822-5113 TollFree: (800) 527-7000",,"amex, discover, master card, visa",,,https://www.budget.com,,,,,,,,,
2531249,778396,"2020-09-27 03:46:40","Budget Rent A Car",https://www.budget.com,,"(847) 884-2080","805 W Higgins Rd",Schaumburg,IL,60195,"805 W Higgins Rd,Schaumburg,IL 60195","Car Rental, Moving Equipment Rental, Truck Rental",1,"1 Review",,42.04931,-88.09981,https://i2.ypcdn.com/blob/c2493ede7fed4c0d6600098bbd309718bde30da9_100x100_crop.jpg?f9d23e1,,,"Mon - Fri: 7:00 am - 6:00 pm Sat: 7:00 am - 3:00 pm Sun: 9:00 am - 1:00 pm","Fax: (847) 884-4809",,"visa, amex, discover, master card, company card, debit, diners club",,"Budget Truck Rental - Schaumburg Budget Rent A Car Schaumburg/hoffman Estates Budget Car Rental",https://www.budget.com,,malentz,06/04/2008,one,"First impression...one gentleman standing at desk with 'Budget' shirt on didn't know how to help, I had to wait for the 'manager'. Manager came in with customer who was having problems. Manger was clearly frustrated and being rude to the customer was being calm even though he was the one who should have been frustrated. Customer ended up leaving after Manger could not/would not help him. After waiting 30 minutes while the manager waiting on 2-3 other people who were dropping off I find out that the main reservation line booked my moving rental truck at a different location then the one we specifically discussed even though I gave my address and zip code and it was quite clear this one was 1 mile from my house versus 20. (Hey 20 miles from my zip code instead of 1 x $.79 a mile is $15 more to them, what do they care? )... Okay, not this particular business fault per say but they ARE affiliated with Budge correct? I mean that IS the name on the sign, trucks...etc..etc.. Anyway, as luck would have it this particular location DID have trucks available (5 in the parking lot to be exact). Great right? The man at this location refused to take my coupon (even though the reservation I originally booked was at the rate with the coupon) because 'no coupons this weekend' ... Do not give this place your business. They were rude, unprofessional and had no idea was true 'customer service' really is.",,,,
2531281,778407,"2020-09-27 03:46:40","Budget Rent A Car",https://www.budget.com,,"(314) 231-6822","338 N 4th St","Saint Louis",MO,63102,"338 N 4th St,Saint Louis,MO 63102","Car Rental, Moving Equipment Rental, Truck Rental",,,,38.6281,-90.18695,https://i2.ypcdn.com/blob/c2493ede7fed4c0d6600098bbd309718bde30da9_100x100_crop.jpg?f9d23e1,,,,,,"amex, discover, master card, visa",,"Budget Rent A Car System Inc.",https://www.budget.com,,,,,,,,,
2531297,778411,"2020-09-27 03:46:40","Budget Rent A Car",https://www.budget.com,,"(972) 293-9475","108 S Clark Rd","Cedar Hill",TX,75104,"108 S Clark Rd,Cedar Hill,TX 75104","Car Rental, Moving Equipment Rental, Truck Rental",,,,32.58917,-96.94202,https://i1.ypcdn.com/blob/c2493ede7fed4c0d6600098bbd309718bde30da9_100x100_crop.jpg?f9d23e1,,,"Mon - Fri: 7:00 am - 6:00 pm Sat - Sun: 8:00 am - 12:00 pm","Primary Phone: (330) 792-8735 Fax: (972) 291-7730",,"amex, discover, master card, visa, company card, debit, diners club",,"Budget Rent A Car System Inc. Budget Car Rental",https://www.budget.com,,,,,,,,,
2531336,778429,"2020-09-27 03:46:40","Budget Rent A Car",https://www.budget.com,,"(630) 585-5512","504 S Route 59",Naperville,IL,60540,"504 S Route 59,Naperville,IL 60540","Car Rental, Moving Equipment Rental, Truck Rental",,,,41.76234,-88.20566,,,,"Mon - Fri: 8:00 am - 6:00 pm Sat: 9:00 am - 2:00 pm Sun: 10:00 am - 2:00 pm",,,"amex, company card, debit, diners club, discover, master card, visa",,,https://www.budget.com,,,,,,,,,
2531425,778454,"2020-09-27 03:46:40","Budget Rent A Car",https://www.budget.com,,"(563) 441-7622","1437 Grant St",Bettendorf,IA,52722,"1437 Grant St,Bettendorf,IA 52722","Car Rental, Moving Equipment Rental, Truck Rental",,,,41.5259,-90.51178,https://i1.ypcdn.com/blob/c2493ede7fed4c0d6600098bbd309718bde30da9_100x100_crop.jpg?f9d23e1,,,,,,,,"Budget Rent A Car Budget Rent A Car",https://www.budget.com,,,,,,,,,
2531436,778459,"2020-09-27 03:46:40","Budget Rent A Car",https://www.budget.com,,"(615) 563-6300","212 S Mccrary St",Woodbury,TN,37190,"212 S Mccrary St,Woodbury,TN 37190","Car Rental, Moving Equipment Rental, Truck Rental",,,,35.82567,-86.06944,https://i2.ypcdn.com/blob/c2493ede7fed4c0d6600098bbd309718bde30da9_100x100_crop.jpg?f9d23e1,,,,,,,,,https://www.budget.com,,,,,,,,,
2531490,778475,"2020-09-27 03:46:40","Budget Rent A Car",https://www.budget.com,,"(301) 495-5583","619 Sligo Ave","Silver Spring",MD,20910,"619 Sligo Ave,Silver Spring,MD 20910","Car Rental, Moving Equipment Rental, Truck Rental",,,,38.99132,-77.01454,https://i1.ypcdn.com/blob/c2493ede7fed4c0d6600098bbd309718bde30da9_100x100_crop.jpg?f9d23e1,,,"Mon - Fri: 8:00 am - 7:00 pm Sat: 9:00 am - 2:00 pm Sun: 10:00 am - 2:00 pm","Phone: (240) 646-7171 Fax: (301) 495-5584",,"discover, master card, visa, company card, debit, diners club, amex",,"Budget Rent A Car System Inc. Budget Rent A Car System",https://www.budget.com,,,,,,,,,
2531601,778514,"2020-09-27 03:46:40","Budget Rent A Car",https://www.budget.com,,"(202) 289-5374","50 Massachusetts Ave NE Unit Csm2",Washington,DC,20002,"50 Massachusetts Ave NE Unit Csm2,Washington,DC 20002","Car Rental, Moving Equipment Rental, Truck Rental",,,,38.89688,-77.00636,https://i2.ypcdn.com/blob/e4fd74421310d501dfdb880a431779673d133091_100x100_crop.jpg?f9d23e1,,"Budget Car Rental Washington operates one of the world's best-known car rental brands. Budget is an industry leader in providing vehicle rental services to value-conscious travelers.","Mon - Fri: 7:00 am - 10:00 pm Sat: 7:00 am - 5:00 pm Sun: 8:00 am - 10:00 pm","Phone: (202) 289-5373 Fax: (202) 289-7015",,"amex, discover, master card, visa, all major credit cards, debit, diners club",,"Budget Car Rental",https://www.budget.com,,,,,,,,,
2531656,778535,"2020-09-27 03:46:40","Budget Rent A Car",https://www.budget.com,,"(912) 355-0805","7070 Abercorn St",Savannah,GA,31406,"7070 Abercorn St,Savannah,GA 31406","Car Rental, Moving Equipment Rental, Truck Rental",,,,32.01207,-81.11325,https://i1.ypcdn.com/blob/c2493ede7fed4c0d6600098bbd309718bde30da9_100x100_crop.jpg?f9d23e1,,,"Mon - Fri: 7:00 am - 5:00 pm Sat: 7:00 am - 1:00 pm Sun: 8:30 am - 12:30 pm","Fax: (912) 355-0954",,"amex, company card, debit, diners club, discover, master card, visa",,,https://www.budget.com,,,,,,,,,
2531694,778551,"2020-09-27 03:46:40","Budget Rent A Car",https://www.budget.com,,"(415) 928-4414","333 Ofarrell St","San Francisco",CA,94102,"333 Ofarrell St,San Francisco,CA 94102","Car Rental, Moving Equipment Rental, Truck Rental",,,,37.78564,-122.41041,https://i2.ypcdn.com/blob/c2493ede7fed4c0d6600098bbd309718bde30da9_100x100_crop.jpg?f9d23e1,,"Reliable Rent-A-Car is a family-operated car rental company serving San Francisco for over 30 years. Nestled in its original location at the heart of Union Square, Reliable is a community staple, loyal to its repeat customers and visitors alike.","Mon - Fri: 7:30 am - 6:00 pm Sat - Sun: 8:00 am - 3:00 pm","Phone: (628) 895-0436 Phone: (415) 928-7864 Fax: (415) 861-4115 TollFree: (866) 359-1331",,"amex, company card, debit, diners club, discover, master card, visa",,"City Rent-A-Car",https://www.budget.com,,,,,,,,,
2531759,778573,"2020-09-27 03:46:40","Budget Rent A Car",https://www.budget.com,,"(678) 996-9779","5570 Jimmy Carter Blvd",Norcross,GA,30093,"5570 Jimmy Carter Blvd,Norcross,GA 30093","Car Rental, Moving Equipment Rental, Truck Rental",,,,33.91101,-84.20785,https://i2.ypcdn.com/blob/c2493ede7fed4c0d6600098bbd309718bde30da9_100x100_crop.jpg?f9d23e1,,,"Mon - Fri: 8:00 am - 6:00 pm Sat: 8:00 am - 4:00 pm Sun: 9:00 am - 2:00 pm","Phone: (770) 447-9897 Fax: (678) 822-0966",,"amex, company card, debit, diners club, discover, master card, visa",,,https://www.budget.com,,,,,,,,,
2531763,778575,"2020-09-27 03:46:40","Budget Rent A Car",https://www.budget.com,,"(661) 575-0854","38241 6th St E",Palmdale,CA,93550,"38241 6th St E,Palmdale,CA 93550","Car Rental, Moving Equipment Rental, Truck Rental",,,,34.57614,-118.11847,https://i2.ypcdn.com/blob/c2493ede7fed4c0d6600098bbd309718bde30da9_100x100_crop.jpg?f9d23e1,,,"Mon - Fri: 7:30 am - 6:00 pm Sat: 8:00 am - 3:00 pm Sun: 9:00 am - 2:00 pm",,,"visa, amex, discover, master card",,"Budget Car Rental",https://www.budget.com,,,,,,,,,
2531810,778597,"2020-09-27 03:46:40","Budget Rent A Car",https://www.budget.com,,"(732) 738-0788","125 Raritan Center Pkwy",Edison,NJ,08837,"125 Raritan Center Pkwy,Edison,NJ 08837","Car Rental, Moving Equipment Rental, Truck Rental",,,,40.51931,-74.33911,https://i1.ypcdn.com/blob/c2493ede7fed4c0d6600098bbd309718bde30da9_100x100_crop.jpg?f9d23e1,,,"Mon - Fri: 8:00 am - 5:00 pm Sat: 8:00 am - 12:00 pm",,,"discover, master card, visa, amex",,"Budget Car Rentals",https://www.budget.com,,,,,,,,,
2531814,778599,"2020-09-27 03:46:40","Budget Rent A Car",https://www.budget.com,,"(336) 855-1511","4324 W Wendover Ave",Greensboro,NC,27407,"4324 W Wendover Ave,Greensboro,NC 27407","Car Rental, Moving Equipment Rental, Truck Rental",,,,36.05758,-79.89006,https://i2.ypcdn.com/blob/c2493ede7fed4c0d6600098bbd309718bde30da9_100x100_crop.jpg?f9d23e1,,,,,,,,"BUDGET CAR RENTAL Budget Rent A Car System Inc.",https://www.budget.com,,,,,,,,,
2531842,778606,"2020-09-27 03:46:40","Budget Rent A Car",https://www.budget.com,,"(407) 886-5075","1532 E Semoran Blvd",Apopka,FL,32703,"1532 E Semoran Blvd,Apopka,FL 32703","Car Rental, Moving Equipment Rental, Truck Rental",,,,28.67236,-81.48124,https://i1.ypcdn.com/blob/c2493ede7fed4c0d6600098bbd309718bde30da9_100x100_crop.jpg?f9d23e1,,,,,,,,,https://www.budget.com,,,,,,,,,
2531855,778612,"2020-09-27 03:46:40","Budget Rent A Car",https://www.budget.com,rob_varilek@budget.com,"(605) 341-9040","1947 Deadwood Ave","Rapid City",SD,57702,"1947 Deadwood Ave,Rapid City,SD 57702","Car Rental, Moving Equipment Rental, Truck Rental",,,,44.10322,-103.27154,https://i2.ypcdn.com/blob/c2493ede7fed4c0d6600098bbd309718bde30da9_100x100_crop.jpg?f9d23e1,,,"Mon - Fri: 8:00 am - 5:00 pm Sat: 8:00 am - 2:00 pm","Phone: (605) 341-3956 Phone: (605) 341-7548 Phone: (605) 334-4211 TollFree: (800) 527-0700",,"amex, discover, master card, visa, cash, debit",,"Budget Rent A Car System Inc.",https://www.budget.com,"Specialties: Pleasure, Leisure, A C, Cooling",,,,,,,,
2531868,778617,"2020-09-27 03:46:40","Budget Rent A Car",https://www.budget.com,,"(952) 445-8763","485 Marschall Rd",Shakopee,MN,55379,"485 Marschall Rd,Shakopee,MN 55379","Car Rental, Moving Equipment Rental, Truck Rental",,,,44.795956,-93.507996,https://i1.ypcdn.com/blob/c2493ede7fed4c0d6600098bbd309718bde30da9_100x100_crop.jpg?f9d23e1,,,,,,,,,https://www.budget.com,,,,,,,,,
2531932,778644,"2020-09-27 03:46:40","Budget Rent A Car",https://www.budget.com,,"(205) 330-0077","1104 Mcfarland Blvd",Northport,AL,35476,"1104 Mcfarland Blvd,Northport,AL 35476","Car Rental, Moving Equipment Rental, Truck Rental",,,,33.23797,-87.56985,https://i1.ypcdn.com/blob/c2493ede7fed4c0d6600098bbd309718bde30da9_100x100_crop.jpg?f9d23e1,,,"Mon - Fri: 8:00 am - 6:00 pm",,,"amex, company card, debit, diners club, discover, master card, visa",,"Budget Car Rental",https://www.budget.com,,,,,,,,,
2532071,778693,"2020-09-27 03:46:40","Budget Rent A Car",https://www.budget.com,,"(330) 479-8833","3910 Tuscarawas St W",Canton,OH,44708,"3910 Tuscarawas St W,Canton,OH 44708","Car Rental, Moving Equipment Rental, Truck Rental",,,,40.79703,-81.41967,https://i1.ypcdn.com/blob/c2493ede7fed4c0d6600098bbd309718bde30da9_100x100_crop.jpg?f9d23e1,,,"Mon - Fri: 8:00 am - 6:00 pm Sat: 8:00 am - 3:00 pm Sun: 9:00 am - 1:00 pm","Fax: (330) 479-8825",,"amex, company card, debit, diners club, discover, master card, visa",,"Budget Car Rental",https://www.budget.com,,,,,,,,,
2532105,778703,"2020-09-27 03:46:40","Budget Rent A Car",https://www.budget.com,,"(919) 840-4781","1000 Trolley Car Way",Morrisville,NC,27560,"1000 Trolley Car Way,Morrisville,NC 27560","Car Rental, Moving Equipment Rental, Truck Rental",1,"1 Review",,35.83437,-78.846596,https://i2.ypcdn.com/blob/e4fd74421310d501dfdb880a431779673d133091_100x100_crop.jpg?f9d23e1,,"Budget Car Rental Raleigh operates one of the world's best-known car rental brands. Budget is an industry leader in providing vehicle rental services to value-conscious travelers.","Mon - Sun: 4:00 am - 1:00 am","Fax: (919) 840-3251 TollFree: (800) 527-0700",,"amex, company card, debit, diners club, discover, master card, visa",,"Budget Rental car",https://www.budget.com,,harrismj75,12/27/2010,one,"This is the ABSOLUTE WORST rental car company I have ever dealt with. Their staff is rude and unaccommodating, their cars are second-rate (at best), and their place of business is about as warm and welcoming as a Russian Gulag prison. My girlfriend and I rented a car from them to take to Philly for Christmas Weekend, but the sudden onset of blizzard conditions forced us to cancel our plans. Naturally, since we had to return the car 2 days earlier than planned, we assumed we'd get a partial refund for the days that we didn't use it. WRONG. Not only did Budget refuse to grant us a partial refund, their staff did a PISS-POOR job of explaining to us exactly why we were getting charged THE SAME RATE for having the car 3 days as we would have for 5. Needless to say, this company will never get another cent from me. In fact, the only reason I gave them a 1-star rating is that I wasn't able to go any lower than that.",,,,
2532128,778711,"2020-09-27 03:46:40","Budget Rent A Car",https://www.budget.com,,"(706) 327-5501","3250 W Britt David Rd Ste 111",Columbus,GA,31909,"3250 W Britt David Rd Ste 111,Columbus,GA 31909","Car Rental, Moving Equipment Rental, Truck Rental",,,,32.52046,-84.94121,https://i1.ypcdn.com/blob/c2493ede7fed4c0d6600098bbd309718bde30da9_100x100_crop.jpg?f9d23e1,,,"Mon - Sun: 7:00 am - 9:00 pm","Fax: (706) 327-1249 TollFree: (800) 479-0000 TollFree: (800) 621-2844",,"amex, company card, debit, diners club, discover, master card, visa",,"Budget Car Rental",https://www.budget.com,,,,,,,,,
2532165,778722,"2020-09-27 03:46:40","Budget Rent A Car",https://www.budget.com,customercare@budgetkc.com,"(913) 262-2926","7501 Shawnee Mission Pkwy",Mission,KS,66202,"7501 Shawnee Mission Pkwy,Mission,KS 66202","Car Rental, Moving Equipment Rental, Truck Rental",,,,39.01457,-94.67261,https://i1.ypcdn.com/blob/c2493ede7fed4c0d6600098bbd309718bde30da9_100x100_crop.jpg?f9d23e1,,,"Mon - Fri: 7:30 am - 6:00 pm Sat: 10:00 am - 2:00 pm","Phone: (913) 262-3854 Phone: (816) 243-5757 Fax: (913) 262-3854",,"amex, discover, master card, visa, company card, debit, diners club",,"Budget Rent A Car Systems",https://www.budget.com,,,,,,,,,
2532181,778727,"2020-09-27 03:46:40","Budget Rent A Car",https://www.budget.com,chambers_pat@ryder.com,"(321) 784-0634","8401 Astronaut Blvd","Cape Canaveral",FL,32920,"8401 Astronaut Blvd,Cape Canaveral,FL 32920","Car Rental, Moving Equipment Rental, Truck Rental",,,,28.3921,-80.60927,https://i2.ypcdn.com/blob/c2493ede7fed4c0d6600098bbd309718bde30da9_100x100_crop.jpg?f9d23e1,,,"Mon - Fri: 8:00 am - 6:00 pm Sat - Sun: 8:00 am - 4:00 pm","Fax: (321) 784-8395",,"company card, diners club, amex, debit, discover, master card, visa, cash",,"Budget Rent A Car Cape Canaveral Budget Car Rental",https://www.budget.com,,,,,,,,,
2532190,778731,"2020-09-27 03:46:40","Budget Rent A Car",https://www.budget.com,,"(214) 642-5260","636 W Tarrant Rd","Grand Prairie",TX,75050,"636 W Tarrant Rd,Grand Prairie,TX 75050","Car Rental, Moving Equipment Rental, Truck Rental",,,,32.75767,-97.00888,https://i2.ypcdn.com/blob/c2493ede7fed4c0d6600098bbd309718bde30da9_100x100_crop.jpg?f9d23e1,,,,,,,,,https://www.budget.com,,,,,,,,,
2532223,778742,"2020-09-27 03:46:40","Budget Rent A Car",https://www.budget.com,budgetcustomerservice@budgetgroup.com,"(217) 378-8584","11 Airport Rd Ste 8",Savoy,IL,61874,"11 Airport Rd Ste 8,Savoy,IL 61874","Car Rental, Moving Equipment Rental, Truck Rental",,,,40.03706,-88.26423,https://i2.ypcdn.com/blob/c2493ede7fed4c0d6600098bbd309718bde30da9_100x100_crop.jpg?f9d23e1,,,"Mon - Fri: 7:30 am - 9:00 pm Sat: 9:00 am - 8:00 pm Sun: 9:00 am - 9:00 pm","Phone: (217) 355-9002 Fax: (217) 378-8597 TollFree: (800) 621-2844",,"amex, discover, master card, visa, company card, debit, diners club",,,https://www.budget.com,,,,,,,,,
2532244,778753,"2020-09-27 03:46:40","Budget Rent A Car",https://www.budget.com,,"(480) 563-2271","5401 N Scottsdale Rd",Scottsdale,AZ,85250,"5401 N Scottsdale Rd,Scottsdale,AZ 85250","Car Rental, Moving Equipment Rental, Truck Rental",,,,33.5141,-111.92485,https://i2.ypcdn.com/blob/c2493ede7fed4c0d6600098bbd309718bde30da9_100x100_crop.jpg?f9d23e1,,,"Mon - Fri: 8:00 am - 5:00 pm Sat: 8:00 am - 3:00 pm Sun: 9:00 am - 1:00 pm","Fax: (480) 947-0381",,"amex, company card, debit, diners club, discover, master card, visa",,,https://www.budget.com,,,,,,,,,
2532247,778754,"2020-09-27 03:46:40","Budget Rent A Car",https://www.budget.com,,"(702) 736-1212","5275 E Craig Rd","Las Vegas",NV,89115,"5275 E Craig Rd,Las Vegas,NV 89115","Car Rental, Moving Equipment Rental, Truck Rental",,,,36.24017,-115.05754,https://i2.ypcdn.com/blob/c2493ede7fed4c0d6600098bbd309718bde30da9_100x100_crop.jpg?f9d23e1,,,,"Phone: (702) 651-1077",,,,"Budget Rent A Car System",https://www.budget.com,,,,,,,,,
2532250,778755,"2020-09-27 03:46:40","Budget Rent A Car",https://www.budget.com,,"(978) 531-1936","1 Newbury St",Peabody,MA,01960,"1 Newbury St,Peabody,MA 01960","Car Rental, Moving Equipment Rental, Truck Rental",,,,42.51933,-70.99792,,,,"Mon - Fri: 8:00 am - 6:00 pm Sat: 8:00 am - 4:00 pm Sun: 10:00 am - 3:00 pm",,,"amex, company card, debit, diners club, discover, master card, visa",,,https://www.budget.com,,,,,,,,,
2532313,778775,"2020-09-27 03:46:40","Budget Rent A Car",https://www.budget.com,,"(631) 981-5041","100 Arrival Ave",Ronkonkoma,NY,11779,"100 Arrival Ave,Ronkonkoma,NY 11779","Car Rental, Moving Equipment Rental, Truck Rental",,,,40.78973,-73.09759,https://i1.ypcdn.com/blob/c2493ede7fed4c0d6600098bbd309718bde30da9_100x100_crop.jpg?f9d23e1,,,"Mon - Fri: 7:00 am - 12:00 am Sat - Sun: 8:00 am - 12:00 am","Phone: (631) 467-3987",,"amex, discover, master card, visa, company card, debit, diners club",,"Budget Car Rental Budget Rent A Car Islip Mcarthur Airport",https://www.budget.com,,,,,,,,,
2532327,778780,"2020-09-27 03:46:40","Budget Rent A Car",https://www.budget.com,,"(410) 744-1308","6610 Baltimore National Pike",Catonsville,MD,21228,"6610 Baltimore National Pike,Catonsville,MD 21228","Car Rental, Moving Equipment Rental, Truck Rental",,,,39.28774,-76.76602,https://i1.ypcdn.com/blob/c2493ede7fed4c0d6600098bbd309718bde30da9_100x100_crop.jpg?f9d23e1,,,"Mon - Fri: 7:30 am - 6:00 pm Sat: 8:00 am - 4:00 pm Sun: 9:00 am - 2:00 pm","Phone: (410) 724-5000 Phone: (410) 724-5990 Fax: (410) 744-8692",,"amex, discover, master card, visa, company card, debit, diners club",,"Budget Rent A Car System Inc. Budget Rent A Car Catonsville, MD Budget Car Rental",https://www.budget.com,,,,,,,,,