business_x_category.id,business.id,business.ts,business.business_name,business.home_page,business.email_address,business.phone,business.street,business.city,business.state,business.zip_code,business.full_address,business.category,business.rating,business.number_of_reviews,business.bbb_rating_or_license,business.latitude,business.longitude,business.cover_image,business.slogan,business.general_info,business.regular_hours,business.extra_phones,business.services_products,business.payment,business.price_range,business.aka,business.other_links,business.other_information,business.review_1_name,business.review_1_date,business.review_1_rating,business.review_1_text,business.review_2_name,business.review_2_date,business.review_2_rating,business.review_2_text
641071,225648,"2020-09-27 02:52:03","MapDispatch .com Inc.",,,"(202) 509-5780","2300 N Pershing Dr Ste 201",Arlington,VA,22201,"2300 N Pershing Dr Ste 201,Arlington,VA 22201","Moving Services-Labor & Materials, Courier & Delivery Service, Local Trucking Service, Movers, Moving-Self Service, Shipping Services, Transportation Services, Trucking-Light Hauling, Used Furniture",,,,38.88041,-77.08624,,"Local moving - name your price!","WWW.MAPDISPATCH .COM... The ?Blue Book? of local moves. Tell us about your move, and we?ll suggest a price. Then, make an offer! We?ll show it to dozen of movers, and we?ll contact you with interest.","Mon - Sun: Open 24 Hours",,,,,,,,,,,,,,,
641227,225693,"2020-09-27 02:52:03","Priority Courier Service",,Forpcservice@gmail.com,"(803) 446-5411","1909 Tall Pines Cir",Columbia,SC,29205,"1909 Tall Pines Cir,Columbia,SC 29205","Delivery Service, Courier & Delivery Service, Expediting Service, Moving Equipment Rental, Moving-Self Service",,,,33.96425,-80.98208,,,,"Mon - Sun: Open 24 Hours",,,"debit, check",,,,,,,,,,,,
644015,226387,"2020-09-27 02:52:14","ANMI EXPRESS CORP",,alejandroarias684@hotmail.com,"(786) 356-8768","11413 NW 76th Ter",Medley,FL,33178,"11413 NW 76th Ter,Medley,FL 33178","Delivery Service, Courier & Delivery Service, Logistics, Moving-Self Service, Transportation Services",,,,25.8429,-80.38283,,,,"Mon - Fri: 9:00 am - 6:00 pm Sat - Sun Closed","MobilePhone: (786) 356-8768",,"visa, master card, check, paypal, cash",,,,,,,,,,,,
644646,226533,"2020-09-27 02:52:14","Portland Movers Ready",http://portlandmoversready.com,portlandmoversready@gmail.com,"(503) 953-6537",,portland,OR,97230,"portland,OR 97230","Movers & Full Service Storage, Car Loading & Unloading, Courier & Delivery Service, Delivery Service, Movers, Movers-Commercial & Industrial, Moving Services-Labor & Materials, Moving-Self Service, Piano & Organ Moving, Relocation Service, Rubbish & Garbage Removal & Containers, Trash Hauling, Trucking-Light Hauling",5,"6 Reviews",A+,,,https://i4.ypcdn.com/blob/57781f6ab607eae15b95eca71172a2f3892d1714_100x100_crop.jpg?41e4770,"a custom moving labor service","1000's of satisfied customers 7 days a week same day service no job to big or small","Mon - Sun: 6:00 am - 11:00 pm",,,"cash only",,,"http://portlandmoversready.com https://www.hirerush.com/profile/jeff-r-201",,"John C.",07/18/2018,five,"Fast efficient and hard working crew. I have used this company twice and have nothing but rave reviews for them","Derek B.",07/08/2018,five,"IВ’ve hired this moving company twice and theyВ’ve done an excellent job both times. They are hard working and very reasonably priced. They will wrap and protect your valuables with moving blankets and shrink wrap if needed. As much as I hate moving, these guys made it easier and I will hire them again the next time I move."
647080,227160,"2020-09-27 02:52:18","G.F. Movers & Delivery Co",,Gfmovers2@gmail.com,"(202) 702-2795",,Laurel,MD,20707,"Laurel,MD 20707","Delivery Service, Courier & Delivery Service, Moving-Self Service",5,"1 Review",,,,,"When you call G.F. Movers you've made the right move!!!!","We have the best services at a reasonable price","Mon - Fri: 8:00 am - 6:00 pm Sat: 8:00 am - 5:00 pm Sun Closed",,,"cash only",,,,,dwaynemass,04/09/2012,five,"finally i found a good moving company that is affordable and professional these guys are very good they gave me a flat rate fee, free estimate and they even pick my stuff up from the storage unit and then brought it to my house. They came 30 minutes before the moving time they even called me upon there arrival. when they got to my home they where very polite, clean professional look, very fast and handled my furniture with extreme care they made sure everything was safely wrapped before they carried it out just in case i didn't tape it good. they did the furniture set up for me an decorated my house for me. for now on i will be using gf movers for all my delivery needs an i highly recommend using them if you want to save money because these guys are really good movers at good price they not out to rip people off.... THANK YOU GF MOVERS YOU GUY ARE THE BEST IM GLAD I FOUND YOUR COMPANY ONLINE. WHOEVER READ THIS CHECKOUT GF MOVERS ON ANGIESLIST.COM AN CREATE AN ACCOUNT SEE MORE LISTINGS",,,,
647466,227249,"2020-09-27 02:52:18","London Boy co.",,jlondon.tre84@yahoo.com,"(817) 333-4221","2516 Thannisch ave","fort worth",TX,76105,"2516 Thannisch ave,fort worth,TX 76105","Moving-Self Service, Courier & Delivery Service, Movers, Trash Hauling, Trucking-Light Hauling",,,,32.71428,-97.29063,,,,"Mon - Sun: 6:00 am - 6:00 pm","MobilePhone: (817) 333-4221",,"cash only",,,,,,,,,,,,
648475,227514,"2020-09-27 02:52:18","Move n Haul",,,"(786) 213-0530","19034 nw 46th ave","Miami Gardens",FL,33055,"19034 nw 46th ave,Miami Gardens,FL 33055","Moving-Self Service, Courier & Delivery Service, Trash Hauling",,,,25.9462,-80.27706,,,,,,,,,,,,,,,,,,,
650008,227934,"2020-09-27 02:52:19","NowShip Atlanta",http://www.nowship.com,,"(888) 411-3927","7468 Old Jonesboro Rd",Atlanta,GA,30354,"7468 Old Jonesboro Rd,Atlanta,GA 30354","Moving-Self Service, Courier & Delivery Service, Freight Forwarding, Packing & Crating Service, Shipping Services",,,,33.66546,-84.387024,,"NowShip to the world В–itВ’s never been so easy","NowShip puts you in control locally so you can ship globally. NowShip offers door to door solutions for excess baggage, small cartons, crated personal effects and larger household goods and personal effects shipments from anywhere to anywhere. With NowShip you have access to a global transportation system with local agents and locations, packing materials and crates delivered to your residence, and moving solutions available with a click of a button. NowShip offers agent assistance with packing and the purchase of appropriate packing materials","Mon - Fri: 9:00 am - 5:00 pm Sat - Sun Closed",,,"all major credit cards, check, debit",,,"NowShip to the world its never been so easy",,,,,,,,,
650599,228092,"2020-09-27 02:52:29","Roel MOVING and delivery",,,"(713) 591-9479","8047 grow ln",Houston,TX,77040,"8047 grow ln,Houston,TX 77040","Moving-Self Service, Courier & Delivery Service, Home Furnishings, Packaging Service, Storage Household & Commercial",,,,29.84868,-95.51401,https://i3.ypcdn.com/blob/660572ee4afde6868eb73496b08012e1e3d8f915_100x100_crop.jpg?d9a04b5,,,"Mon - Sun: Open 24 Hours",,,,,,,,,,,,,,,
650723,228120,"2020-09-27 02:52:29","Quick Express Moving",,,"(347) 631-2995","10219 Avenue J",Brooklyn,NY,11236,"10219 Avenue J,Brooklyn,NY 11236","Moving Services-Labor & Materials, Courier & Delivery Service, Local Trucking Service, Moving-Self Service, Transportation Providers",,,,40.64491,-73.8947,,"Moving forward with Quick Express!",,"Mon - Thu: 7:00 am - 11:00 pm Sat - Sun: 7:00 am - 11:00 pm",,,"visa, discover, mastercard, all major credit cards, debit, paypal",,,,,,,,,,,,
653089,228740,"2020-09-27 02:52:29","NowShip Baltimore Washington",http://www.nowship.com,,"(888) 411-3927","10305 Guilford Rd",Jessup,MD,20794,"10305 Guilford Rd,Jessup,MD 20794","Moving-Self Service, Courier & Delivery Service, Freight Forwarding, Packing Materials-Shipping, Shipping Services",,,,39.14385,-76.80791,,"NowShip to the world В–itВ’s never been so easy","NowShip offers packing materials, packing assistance, and crating services. Crates delivered to your residenceDomestic Trucking Services",,"Mon - Fri 9am-5pm: (888) 411-3927",,"all major credit cards, check, debit",,,"One fixed shipping price guaranteed",,,,,,,,,
654609,229114,"2020-09-27 02:52:31","National Storage Centers",,,"(707) 837-8894","7500 Conde Ln",Windsor,CA,95492,"7500 Conde Ln,Windsor,CA 95492","Courier & Delivery Service, Boat Storage, Boxes-Paper, Delivery Service, Furniture Stores, Home Decor, Movers, Moving Boxes, Moving-Self Service, Self Storage, Shipping Services, Storage Household & Commercial, Truck Rental, Warehouses-Merchandise, Wine Storage",,,,38.53095,-122.79618,,"Convenient Location. All Ground Level Units - Drive to Your Space. Clean & Well Maintained Storage Property. Call Us Today for Move-In Specials!","Welcome to National Storage Centers in Windsor. We proudly serve the communities of Sonoma County, California with our modern public storage facility. Our staff is here to assist you in any way we possibly can. At National Storage Centers our mission is to provide quality service and products at the lowest possible cost to you. Customer satisfaction and value is our top priority. Our friendly knowledgeable staff is here to offer a solution for all your household and business storage needs. National Storage Centers is conveniently located off of Highway 101, on Conde Lane in Windsor. Whenever you are in need some extra space, we offer a variety of unit sizes and services to ensure all of your needs are met. We offer storage for personal, household or business use. All storage units are on the ground floor for easier access. Other amenities include climate-controlled spaces, convenient gate hours, 6am-9pm, keypad gate access, 24/7 video surveillance, clean & well-maintained, indoor car & boat storage, boxes & moving supplies, deliveries accepted and a live-in resident manager. We know you have a lot of options when choosing a place to store in Windsor. Give us a call to learn about how easy and affordable it is to store your household or business items with us! Visit our website for detailed driving directions.","Mon - Sat: 9:00 am - 6:00 pm Sun: 10:00 am - 2:00 pm",,,"check, debit, master card, visa",,,,,,,,,,,,
654723,229152,"2020-09-27 02:52:31","PA.M. Taxi Service/Minuteride, LLC",,phillipmjmc383@gmail.com,"(866) 220-6701","2009 highway 9 E",Dillon,SC,29536,"2009 highway 9 E,Dillon,SC 29536","Moving-Self Service, Courier & Delivery Service, Taxis",,,,34.40499,-79.33621,,,,"Mon - Sat: 6:00 am - 12:00 am Sun: 2:00 pm - 12:00 am","MobilePhone: (917) 500-3422",,"all major credit cards",,,,,,,,,,,,
655254,229303,"2020-09-27 02:52:31","Motivated Moving Solutions",http://www.motivatedmovingsolutions.com,InfoMMS20@gmail.com,"(703) 772-7171","3835 Persimmon Cir",Fairfax,VA,22031,"3835 Persimmon Cir,Fairfax,VA 22031","Moving Services-Labor & Materials, Courier & Delivery Service, Moving Boxes, Moving-Self Service, Transportation Services",,,A+,38.84341,-77.2685,,,,"Mon - Sun: Open 24 Hours","Business Cell: (703) 772-7171",,"discover, paypal, cash, visa, master card, amex",,,"Make Your Next Move, Your Best Move!",,,,,,,,,
656793,229711,"2020-09-27 02:52:31","Vaqueros Moving Services",,,"(817) 564-8859","2519 Burney RD",Arlington,TX,76006,"2519 Burney RD,Arlington,TX 76006","Moving Services-Labor & Materials, Courier & Delivery Service, Moving Boxes, Moving-Self Service, Packaging Service",5,"1 Review",,32.77902,-97.06646,https://i4.ypcdn.com/blob/59bce3e87f2ed0ef100226756d25806e110a8eca_100x100_crop.jpg?41e4770,,,"Mon - Sat: 7:00 am - 10:00 pm",,,,,,,,"Kris A.",05/19/2016,five,"The guys we got were real moving pros clean cut and very nice.Very fast but took great care of everything stretch wrapped everything for extra protection.The move went great very satisfied I recommend Vaqueros Moving Services to the DFW?",,,,
659699,230485,"2020-09-27 02:52:36","Dustin's Delivery & Moving Service",,DustinsDelivery@gmail.com,"(304) 231-6689","67800 mall ring rd","Saint Clairsville",OH,43950,"67800 mall ring rd,Saint Clairsville,OH 43950","Delivery Service, Courier & Delivery Service, Movers, Movers-Commercial & Industrial, Moving-Self Service",,,,40.06891,-80.86717,,,,"Mon: 6:00 am - 10:00 pm Tue: 6:00 am - 3:00 pm Wed: 10:00 am - 3:00 pm Thu - Sat: 4:30 pm - 10:00 pm Sun: 6:00 am - 10:00 pm","Call or Text: (304) 231-6689",,"all major credit cards, paypal",,,,,,,,,,,,
661229,230859,"2020-09-27 02:52:36","Budget Storage",http://www.budgetstoragetallahassee.net,darbyjones@professionalfiduciary.com,"(850) 792-8689","2816 Joel Brown Dr",Tallahassee,FL,32301,"2816 Joel Brown Dr,Tallahassee,FL 32301","Movers & Full Service Storage, Air Cargo & Package Express Service, Cold Storage Warehouses, Courier & Delivery Service, Delivery Service, Movers, Moving Equipment Rental, Moving-Self Service, Public & Commercial Warehouses, Self Storage, Shipping Services, Storage Household & Commercial",5,"1 Review",,30.44889,-84.22845,,"Quality And Excellent Rates.","Budget Storage in Tallahassee, FL is owned by an FSU graduate who wants to give prospective and current customers a good reason to store their prized possession in this facility! We are always trying to improve our service and appreciate all your feedback. Call or email with all your comments and inquiries.We have an excellent history, solid reputation, and years of experience taking care of business and personal needs of our customers. We appreciate you visiting our website and hope to have the opportunity to show you the reasons we are the best! Our property maintains a clean and safe facility. Our on-site managers are helpful, courteous, and professional.","Mon - Sun: 6:00 am - 9:00 pm",,,"amex, master card, visa",,,http://www.budgetstoragetallahassee.net,"Parking: Lot",kathy42,06/17/2008,five,"Nice facility, great prices. Definitley recommend!",,,,
662786,231250,"2020-09-27 02:52:37","Able Rentals, Inc.",http://www.abletruckrental.com,barntruckrental@gmail.com,"(201) 731-8818","260 Grand Ave",Englewood,NJ,07631,"260 Grand Ave,Englewood,NJ 07631","Moving Equipment Rental, Boxes-Corrugated & Fiber, Boxes-Paper, Car Rental, Contractors Equipment & Supplies, Contractors Equipment Rental, Courier & Delivery Service, Delivery Service, Industrial Equipment & Supplies, Movers, Moving-Self Service, Self Storage, Shipping Services, Trailer Renting & Leasing, Truck Rental",,,A+,40.88485,-73.97773,,"your premiere neighborhood truck rental, box and moving supply company","Able Truck Rental is your premiere neighborhood truck rental, box and moving supply company. Whether you are packing your one bedroom apartment or you are directing a large scale corporate move, Able Rentals will give you the personal attention needed to make your moving experience an easy and cost-effective process.","Mon - Sun: Open 24 Hours",,,,,,http://www.abletruckrental.com,,,,,,,,,
664436,231657,"2020-09-27 02:52:37","Open Rhode Trucking",,openrhodetrucking@gmail.com,"(401) 862-7033","88 bend st",warwick,RI,02889,"88 bend st,warwick,RI 02889","Moving-Self Service, Courier & Delivery Service, Shipping Services, Transportation Services, Trucking-Light Hauling",,,,41.71233,-71.38375,,,"We are small-scale shipping company that tailors to individual shipments and personalized service.","Mon - Sun: Open 24 Hours",,,"paypal, cash, travelers checks",,,,,,,,,,,,
665659,231984,"2020-09-27 02:52:37","IZY MOVING AND DELIVERY industry",,,"(240) 694-5291","19284 circle gate dr",Germantown,MD,20874,"19284 circle gate dr,Germantown,MD 20874","Moving Services-Labor & Materials, Courier & Delivery Service, Delivery Service, Moving-Self Service",5,"1 Review",,39.17237,-77.2653,https://i4.ypcdn.com/blob/b7324ffb02a07e58100eefa5aab0541cfd08e667_100x100_crop.jpg?41e4770,,,"Mon - Sun: 9:00 am - 9:00 pm","second Business phone: (240) 694-5252",,"visa, discover, mastercard, all major credit cards, amex, debit",,,,,"Anthony A.","Edited: 09/07/2016",five,"Well organized Team! , they came on time with a Big 26ft Box truck and took good care of our Furniture. i definitely suggest them for your next Move.",,,,
668380,232703,"2020-09-27 02:52:43","Affordable Moving by Heatwole Auction Team Since 1987",http://www.hatauctions.com,,"(540) 435-9320","169 Pleasant hill rd",harrisonburg,VA,22801,"169 Pleasant hill rd,harrisonburg,VA 22801","Movers & Full Service Storage, Courier & Delivery Service, Movers, Moving Boxes, Moving Services-Labor & Materials, Moving-Self Service",,,,38.43143,-78.89998,https://i4.ypcdn.com/blob/b2ed240063f69d2f554da537bc4d40684c61fafb_100x100_crop.jpg?41e4770,,,"Mon - Fri: 8:30 am - 4:30 pm",,,"check, cash, no credit cards",,,"auctions &amp.amp.amp.amp. moving",,,,,,,,,
668890,232846,"2020-09-27 02:52:43","Falcon Six Delivery",,,"(954) 873-9199",,"Fort Lauderdale",FL,33320,"Fort Lauderdale,FL 33320","Delivery Service, Courier & Delivery Service, Machinery Movers & Erectors, Moving-Self Service, Piano & Organ Moving",,,,,,,,"CALL our helpful staff 954-873-9199 or 561-247-5189","Mon - Sun: Open 24 Hours",,,"check, paypal, all major credit cards",,,,,,,,,,,,
672435,233778,"2020-09-27 02:52:49","NowShip Myrtle Beach, South Carolina",http://www.nowship.com,,"(888) 411-3927","600 11th Ave N","Surfside Beach",SC,29575,"600 11th Ave N,Surfside Beach,SC 29575","Moving-Self Service, Courier & Delivery Service, Packing & Crating Service, Shipping Services",,,,33.61815,-78.97067,,"NowShip to the world В–itВ’s never been so easy","NowShip puts you in control locally so you can ship globally. NowShip offers door to door solutions for excess baggage, small cartons, crated personal effects and larger household goods and personal effects shipments from anywhere to anywhere. With NowShip you have access to a global transportation system with local agents and locations, packing materials and crates delivered to your residence, and moving solutions available with a click of a button.","Mon - Fri: 9:00 am - 5:00 pm Sat - Sun Closed",,,"all major credit cards, check, debit",,,"NowShip to the world its never been so easy",,,,,,,,,
673400,234026,"2020-09-27 02:52:54","NowShip New York",http://www.nowship.com,,"(888) 411-3927","175-18 147th Ave","Addisleigh Park",NY,11434,"175-18 147th Ave,Addisleigh Park,NY 11434","Moving-Self Service, Courier & Delivery Service, Freight Forwarding, Packing Materials-Shipping, Shipping Services",,,,40.66106,-73.77073,,"NowShip to the world В–itВ’s never been so easy","NowShip puts you in control locally so you can ship globally. NowShip offers door to door solutions for excess baggage, small cartons, crated personal effects and larger household goods and personal effects shipments from anywhere to anywhere. With NowShip you have access to a global transportation system with local agents and locations, packing materials and crates delivered to your residence, and moving solutions available with a click of a button. NowShip offers agent assistance with packing and the purchase of appropriate packing materials","Mon - Fri: 9:00 am - 5:00 pm Sat - Sun Closed","TollFree: (888) 411-3927",,"all major credit cards, check, debit",,,"NowShip to the world its never been so easy",,,,,,,,,
674701,234349,"2020-09-27 02:52:54","AJ Moving & Delivery LLC",http://www.ajmoversvirginia.com,info@ajmoversvirginia.com,"(703) 647-0694","9104 Manassas Dr","Manassas Park",VA,20111,"9104 Manassas Dr,Manassas Park,VA 20111","Movers & Full Service Storage, Courier & Delivery Service, Moving Services-Labor & Materials, Moving-Self Service, Piano & Organ Moving",,,A,38.76873,-77.44376,,"WE TAKE PRIDE IN WHAT WE DO!","all moving services for northern va, md, and dc.","Mon - Sun: 6:00 am - 8:00 pm","Phone: (571) 527-7004",,"visa, master card, amex, discover, check, cash",,,"moving and storage company northern va",,,,,,,,,
678184,235272,"2020-09-27 02:52:59","MadMax Haul & Source",http://madmaxhaulsource.wix.com/madmaxhaulsource,madmaxhaulsource@gmail.com,"(214) 727-8351","7650 McCallum Blvd",Dallas,TX,75252,"7650 McCallum Blvd,Dallas,TX 75252","Handyman Services, Courier & Delivery Service, Moving-Self Service, Trash Hauling",,,,32.98718,-96.77563,,,,"Mon - Sun: 9:00 am - 7:00 pm",,,,,,"MadMax Haul & Source Website",,,,,,,,,
680036,235804,"2020-09-27 02:52:59","Quick Movers",http://quickmovershouston.com,Service@quickmovershouston.com,"(832) 335-7416","7245 Fairbanks N Houston Rd",Houston,TX,77040,"7245 Fairbanks N Houston Rd,Houston,TX 77040","Delivery Service, Courier & Delivery Service, Movers, Movers & Full Service Storage, Moving Services-Labor & Materials, Moving-Self Service, Self Storage","4,5","10 Reviews",,29.87936,-95.52698,https://i3.ypcdn.com/blob/ae7db757c0cee17e7c66f541a63239b721fec00c_100x100_crop.jpg?d9a04b5,,,"Mon - Sat: 7:00 am - 8:00 pm",,,"discover, diners club, jcb, amex, visa, all major credit cards, master card",,,http://quickmovershouston.com,,"Graham G.",05/02/2017,five,"My wife and I contacted Henry from QM and they got us the best price in town to move our stuff between apartments. They were right on time the day of moving and worked professionally, quickly, and carefully. My experience with QM was more than exceptional. They took all of the stress out of moving and we were able to relax a bit and enjoy our new apartment. I would definitely recommend QM to anyone looking to move and will be using their services again in the future!","Nayeli C.",04/26/2017,five,"This is the first moving company I ever hire. I believe I have now been spoiled. Henry contacted me for moving my piano, I already had another moving company lined up, but Henry was very persistent and extremely flexible and easy to work with so I decided to give him a chance and I am glad I did. He showed up on a Sunday at 7am with the best attitude and ready to work. Needless to say, he will forever handle any moving needs for the rest of my life. I contacted the company I had lined up and explained the situation and even they were impressed by Henry."
680684,235971,"2020-09-27 02:52:59","Marus Delivery Services",,htcmarus@aol.com,"(203) 455-7728",,,,,,"Moving-Self Service, Courier & Delivery Service",,,,,,,"BEST SELECTION ,LOW PRICES","M.HTC DELIVERY SERVICES PACKING, MOVING & COURIER SERVICES CLEANOUTS CALL MARUS@ (203)455-7728 OR E-MAIL @ HTCMARUS@AOL .COM About Us :Our company is based on the belief that our customers' needs are of the utmost importance. Our entire team is committed to meeting those needs. As a result, a high percentage of our business is from repeat customers and referrals. We would welcome the opportunity to earn your trust and deliver you the best service in the industry. Location: BRIDGEPORT, CT 06610 LOW HOUR LY RATES {4 HOUR MINIMUN REQUIRED}. OTHER FEE'S APPLIED FOR OUT OF STATE MOVES OR DELIVERIES. Mon - Fri: 7AM - 8PM Sat: 9AM - 9PM SUN: 10 AM-3 PM","Mon - Sun: Open 24 Hours",,,"cash only",,,,,,,,,,,,