business_x_category.id,business.id,business.ts,business.business_name,business.home_page,business.email_address,business.phone,business.street,business.city,business.state,business.zip_code,business.full_address,business.category,business.rating,business.number_of_reviews,business.bbb_rating_or_license,business.latitude,business.longitude,business.cover_image,business.slogan,business.general_info,business.regular_hours,business.extra_phones,business.services_products,business.payment,business.price_range,business.aka,business.other_links,business.other_information,business.review_1_name,business.review_1_date,business.review_1_rating,business.review_1_text,business.review_2_name,business.review_2_date,business.review_2_rating,business.review_2_text
979547,318139,"2020-09-27 03:01:44","Anderson Stone Company",,,"(765) 644-8311","6032 Dr Martin Luther King Jr Blvd",Anderson,IN,46013,"6032 Dr Martin Luther King Jr Blvd,Anderson,IN 46013","Landscaping Equipment & Supplies, Building Materials, Landscaping & Lawn Services, Lawn & Garden Equipment & Supplies, Mulches, Stone Natural",,,,40.05334,-85.71711,,,,,"Fax Number: (765) 644-8313 Fax: (765) 644-8313",,,,,,,,,,,,,,
979656,318162,"2020-09-27 03:01:44","American Soil & Stone",http://www.americansoil.com,,"(510) 292-3000","2121 San Joaquin St",Richmond,CA,94804,"2121 San Joaquin St,Richmond,CA 94804","Flagstone, Building Contractors, Building Materials, Fountains Garden, Display, Etc, Garden Ornaments, Landscaping Equipment & Supplies, Lawn & Garden Equipment & Supplies, Masonry Contractors, Mulches, Sand & Gravel, Stone Cutting, Stone Natural, Topsoil",,,A+,37.90632,-122.31498,https://i1.ypcdn.com/blob/e2e6e545aef9795f58cdd4e16877d4b7b37e1034_100x100_crop.jpg?f9d23e1,"Over 8 acres of Inventory of Stone, Soil, Mulch and Compost","For over 25 years, American Soil & Stone has been supplying the professional design community with a rich variety of products and services for all types of creative projects. From blended soils for rooftop gardens to select stone for building restoration, cobble stone for streets and parking areas to unique fountains and spectacular specimen boulders, American Soil & Stone is the professional's choice.With two convenient San Francisco Bay area locations - 8 acres in Richmond and 3.5 acres in San Rafael - AS&S carries an expansive inventory and our experienced staff can provide personalized services to better support the unique needs of your projects.","Mon - Sat: 7:00 am - 5:00 pm Sun: 9:00 am - 5:00 pm",,,"cash, all major credit cards, visa, mastercard, amex, discover",,,http://www.americansoil.com,,,,,,,,,
979964,318223,"2020-09-27 03:01:44","Clifford Stone & Material Co",,cliffordstonecompany@gmail.com,"(219) 462-4055","2900 Campbell St",Valparaiso,IN,46385,"2900 Campbell St,Valparaiso,IN 46385","Landscaping Equipment & Supplies, Garden Centers, Landscaping & Lawn Services, Mulches, Stone Natural",,,,41.4946,-87.0652,,,,,,,,,,,,,,,,,,,
980066,318242,"2020-09-27 03:01:44","Bianchi's Brickyard",http://www.bianchibrickyard.com,austin@bianchibrickyard.com,"(910) 454-4445","7995 River Rd",Southport,NC,28461,"7995 River Rd,Southport,NC 28461","Granite, Brick-Clay-Common & Face, Building Contractors, Building Materials, Landscape Designers & Consultants, Landscaping & Lawn Services, Masonry Contractors, Masonry Equipment & Supplies, Mulches, Stone Natural, Stone Products, Topsoil",5,"1 Review",,33.96748,-78.03136,,"FREE Quote Contact us for your no obligation quote","D.L. Bianchi's Construction Company and D.L. Bianchi's Brickyard Supply has the resources, experience, and knowledge to start and finish your job on time and on budget...","Mon - Fri: 7:30 am - 5:00 pm Sat - Sun Closed",,,,,,http://www.bianchibrickyard.com,"Specialties: Wood, Contractors, Exterior",1beachmomnc,12/01/2007,five,"Shop for your beautiful custom brick or browse the huge selection of natural stones for that dry stack garden wall, pathway or patio. Friendly expert help and delivery",,,,
980381,318324,"2020-09-27 03:01:44","CBS Topsoil Inc",,,"(330) 538-0009","15200 Mahoning Ave",Diamond,OH,44412,"15200 Mahoning Ave,Diamond,OH 44412","Topsoil, Crushed Stone, Dump Truck Service, Excavation Contractors, Firewood, Garden Centers, Grading Contractors, Landscaping Equipment & Supplies, Lawn & Garden Equipment & Supplies, Mulches, Stone Natural",,,,41.09942,-80.93756,,,,,"Phone: (330) 533-6863",,,,,,,,,,,,,,
980843,318430,"2020-09-27 03:01:44","Federouch Landscape Supply",http://www.fls-pgh.com,,"(724) 941-6965","202 Sherman Ave",Pittsburgh,PA,15223,"202 Sherman Ave,Pittsburgh,PA 15223","Topsoil, Building Materials, Crushed Stone, Demolition Contractors, Firewood, Garden Centers, Landscape Contractors, Landscaping Equipment & Supplies, Lawn & Garden Equipment & Supplies, Mulches, Recycling Centers, Sand & Gravel, Stone Natural, Trucking",,,,40.49197,-79.9568,,,,Monday-Sunday,"TollFree: (800) 371-7644 TollFree: (800) 867-7645 Toll Free: (800) 867-7645",,"master card, discover, visa",,,http://www.fls-pgh.com,,,,,,,,,
980905,318444,"2020-09-27 03:01:44","J&R Mulch",https://www.jandrmulch.com,jason@jrmulch.com,"(717) 749-7795","14287 Anthony Hwy",Waynesboro,PA,17268,"14287 Anthony Hwy,Waynesboro,PA 17268","Stone Natural, Brick-Clay-Common & Face, Building Contractors, Building Materials, Crushed Stone, Heating Stoves, Landscaping Equipment & Supplies, Lawn & Garden Equipment & Supplies, Masonry Contractors, Mulches, Playground Equipment, Playgrounds, Sand & Gravel, Stone Products, Stone-Retail",,,,39.73061,-77.57113,,"Your complete outdoor store. (also firewood and wood pellets)","J & R Mulch is located in Waynesboro, Pennsylvania and provides the following: mulch, decorative stone, vinyl swing sets(Full color brochures & price lists available for swingsets) Flagstone , fieldstone,standup stone & pattern stone in stock. We also carry good quality railroad ties by the piece. Pavers & wall blocks also available from Nicolock.","Mon - Sat: 8:00 am - 5:00 pm Sun Closed",,,"all major credit cards, amex",,,https://www.jandrmulch.com,"Parking: Lot, Free Wheelchair Accessible: Yes",,,,,,,,
980934,318453,"2020-09-27 03:01:44",KingВ’s,http://kingsmulchandstone.com,kingslandscaping@tds.net,"(317) 769-3671","8175 E. 550 S.",Zionsville,IN,46077,"8175 E. 550 S.,Zionsville,IN 46077","Mulches, Excavation Contractors, Firewood, Garden Centers, Landscape Contractors, Landscape Designers & Consultants, Landscaping & Lawn Services, Landscaping Equipment & Supplies, Stone Natural, Topsoil",5,"1 Review",,39.96085,-86.31462,https://i1.ypcdn.com/blob/274839fc95acc075ad7460131dbbd2b629086639_100x100_crop.jpg?f9d23e1,"1 Day Delivery - Check out our catalog",,"Mon - Fri: 8:00 am - 5:00 pm Sat: 8:00 am - 12:00 pm Sun Closed","Fax: (317) 769-5258",,"all major credit cards, visa, mastercard, amex, discover, cash, check",,King's,"Primary Website",,angrice,02/29/2012,five,"We had mulch delived, came same day ordered. I am very happy with the mulch. Holding up nice. It did not fade like the mulch I had purchaced in the past. Will do buisness with these guys again for all my lawn care needs. A+",,,,
980983,318461,"2020-09-27 03:01:44","Rocks 'n' Roots Landscape & Pond Supplies",http://rocksnroots.com,info@rocksnroots.com,"(586) 752-4900",,,,,,"Salt, Concrete & Pumice Bricks, Concrete Aggregates, Hydroseeding, Mulches, Ponds & Pond Supplies, Retaining Walls, Rock Shops, Stone Natural, Topsoil, Water Gardens",,,,,,,,"Landscape & Pond Supplies We offer a friendly, helpful and informative atmosphere to make any landscape project, whether a single bag of mulch or a complete landscaping, be an easy and fun experience. The Zendt family--owners and operators of Rocks 'n' Roots, currently in our fourth generation--has been serving the landscape industry since 1928. Since our beginning we have been accumulating knowledge of the best landscape materials for landscape enrichment, and through our prior years as landscape contractors we have become experts in the installation of those goods. Rocks 'n' Roots employees are given 'hands on' experience through seminars, instructional videos, and one-on-one tutoring. We pride ourselves on having one of Michigan's largest selections of landscape hardgoods, and are constantly bringing in new and innovative products. So come on in--because everybody needs a little r'n'r!","Mon - Sun Closed Holiday Hours 2020/09/07 Closed Holiday Hours 2020/11/26 Closed Holiday Hours 2019/12/31 Closed Holiday Hours 2020/12/25 Closed Holiday Hours 2020/07/04 Closed",,,"mastercard, discover, visa, cash, check, android pay, apple pay, samsung pay",,,http://rocksnroots.com,,,,,,,,,
981008,318468,"2020-09-27 03:01:44","Rocky's Stone & More",http://www.rockysstone.com,sales@rockysstone.com,"(817) 473-3110","7973 Rendon Bloodworth Rd",Mansfield,TX,76063,"7973 Rendon Bloodworth Rd,Mansfield,TX 76063","Stone Natural, Concrete Products-Wholesale & Manufacturers, Landscape Contractors, Landscaping Equipment & Supplies, Mulches, Patio Builders, Patio Equipment & Supplies, Rock Shops, Sand & Gravel, Stone Natural-Wholesale & Manufacturers",,,A+,32.58026,-97.18703,,,"Rocky's Stone & More provides Natural Stones, Belgard, Soil, Sand, and Mulch, Outdoor Cooking and Giant Loaders to the Mansfield, TX area","Mon - Sat: 7:30 am - 5:00 pm Sun: 11:00 am - 3:00 pm",,,"check, debit, mastercard, all major credit cards, amex, discover, master card, visa",,,http://www.rockysstone.com,"Specialties: Stones, Ponds",,,,,,,,
981090,318482,"2020-09-27 03:01:44","Mulch Masters LLC",http://www.mulchmasters.com,info@mulchmastersuae.com,"(904) 727-1100","230 Lee Rd",Jacksonville,FL,32225,"230 Lee Rd,Jacksonville,FL 32225","Mulches, Garden Centers, Landscape Contractors, Landscape Designers & Consultants, Landscaping & Lawn Services, Landscaping Equipment & Supplies, Lawn & Garden Equipment & Supplies, Masonry Equipment & Supplies, Nurseries-Plants & Trees, Sand & Gravel, Stone Natural, Topsoil",,,A+,30.32707,-81.53684,https://i1.ypcdn.com/blob/1f797cf1a4d7289db6d9ff2aefbb4a96d948462d_100x100_crop.jpg?f9d23e1,,,"Mon - Fri: 8:00 am - 5:00 pm",,,"discover, visa, amex, mastercard",,,http://www.mulchmasters.com,"Bike Parking: No Services: Landscape Designers",,,,,,,,
981334,318542,"2020-09-27 03:01:44","All TYPE Rental & Gardening",,alltyperentals@aol.com,"(352) 793-1001","8390 S US 301",Bushnell,FL,33513,"8390 S US 301,Bushnell,FL 33513","Rock Shops, Asphalt Paving & Sealcoating, Clay, Mulches, Rental Service Stores & Yards, Stone Natural, Topsoil",,,,28.63365,-82.12756,,,,"Mon - Fri: 8:30 am - 5:00 pm Sat: 8:30 am - 4:00 pm Sun Closed","MobilePhone: (352) 303-0226 Fax: (352) 793-1003",,"check, no credit cards",,,,,,,,,,,,
981413,318558,"2020-09-27 03:01:44",Thegrassstore.com,http://www.thegrassstore.com/our-location,sales@thegrassstore.com,"(936) 273-9273","12868 Highway 105 W",Conroe,TX,77304,"12868 Highway 105 W,Conroe,TX 77304","Landscaping Equipment & Supplies, Landscape Designers & Consultants, Landscaping & Lawn Services, Lawn Maintenance, Mulches, Sod & Sodding Service, Stone Natural",5,"3 Reviews",,30.34543,-95.55635,,,,"Mon - Fri: 8:00 am - 4:00 pm Sat: 8:00 am - 2:00 pm","Phone: (936) 588-2244 Phone: (281) 615-6648 Phone: (936) 213-9273",,"master card, visa, discover",,"Grass Store The Grass Store The Grass Store.Com Grass Store LLC",http://www.thegrassstore.com/our-location,,"Bonnie J.",09/29/2017,five,"I had a load of 20 pallets delivered to my new home today and driver was on time, courtesy, and most accommodating to where I wanted the pallets of grass distributed. He had a team to lay the grass and did it on a timely manner. The grass was a dark green and was exceptionally thick and healthly I would suggest to anyone needing a perfect green yard to contact The Grass Store, you won't be disappointed. BBWittig","Mark S.","Edited: 08/22/2016",five,"A solid endorsement goes out to Curtis at the Grass Store! His team did a great job laying enriched soil and close to 7 pallets of fantastic grass. My yard looks better than ever! Unfortunately, the delivery truck that shipped the material was too heavy for our driveway and it cracked a section of it. A lesser person or company would have run the other way, blame the builder for pouring a low quality slab, or argue it wasnВ’t their fault. Curtis had the integrity to accept responsibility for the mistake and arranged to have the section replaced by a qualified concrete vendor! ThatВ’s integrity and thatВ’s a person / company you want to service you! Thanks Curtis. MUCH Appreciated!"
981788,318650,"2020-09-27 03:01:44","Garden Path The",http://www.thegardenpathstonecenter.com,thegardenpathstonecenter@yahoo.com,"(318) 473-2441","57 Ross Ln",Alexandria,LA,71303,"57 Ross Ln,Alexandria,LA 71303","Stone Natural, Garden Centers, Iron Work, Landscaping & Lawn Services, Landscaping Equipment & Supplies, Lawn & Garden Equipment & Supplies, Masonry Equipment & Supplies, Mulches, Nurseries-Plants & Trees, Sand & Gravel",,,,31.29178,-92.54354,,,"Central Louisiana's largest supplier of natural stone, pottery, pond supplies, and ironwork. Serving Louisiana for over 23 years, we carry an extensive selection of products for landscape, home applications, and night lighting.","Mon - Fri: 8:00 am - 5:00 pm Sat: 8:00 am - 11:30 am Sun Closed",,,,,,http://www.thegardenpathstonecenter.com,"Parking: Lot Services: Ironwork, Sand Delivery",,,,,,,,
981960,318699,"2020-09-27 03:01:44","Landscape Depot",,info@lsdepot.com,"(321) 259-1620","6370 Us Highway 1",Rockledge,FL,32955,"6370 Us Highway 1,Rockledge,FL 32955","Nurseries-Plants & Trees, Crushed Stone, Garden Centers, Hardware Stores, Landscape Contractors, Landscape Designers & Consultants, Landscaping & Lawn Services, Landscaping Equipment & Supplies, Lawn & Garden Equipment & Supplies, Masonry Equipment & Supplies, Mulches, Sand & Gravel, Stone Natural, Topsoil",,,A+,28.23541,-80.67568,https://i1.ypcdn.com/blob/2627b9874c7be1265142039e77d11dc61815d19e_100x100_crop.jpg?f9d23e1,,"Landscape Depot of Brevard has provided outstanding customized service to our clients for over 30 years. This has earned us the reputation of one of Central Florida's premier landscape companies. With over 30 years of experience in Brevard we have been able to continually & reliably offer our services and strive to provide effective landscape solutions both in terms of aesthetic appeal and cost effectiveness. Our professional team guarantees that you are in good hands and is excited to work with you to improve your landscape whether it is through guidance, materials, or service. No matter the type of service or design you are looking for Landscape Depot can help by providing you the highest quality of service in the industry while ensuring you are satisfied with the finished project. Our team understands that your landscaping is an extension of you & continually strive to treat every customer individually and with the same level of care and commitment.","Mon - Sat: 7:00 am - 6:00 pm Sun: 8:00 am - 5:00 pm","Phone: (321) 259-4238 Phone: (321) 600-4575 Phone: (321) 622-6942 Fax Number: (321) 259-1623",,"visa, all major credit cards, amex, financing available, mastercard",,,,"Services: Gravel / Boulders / Landscaping Stone, Sand / Soil / Mulch, Pavers and Manufactured Block, Full Service Nursery and Sod, Sheds, Pottery and Statuary&amp.#10.We Install All that We Sell!",,,,,,,,
982096,318730,"2020-09-27 03:01:44","Bushel Stop Inc",http://thebushelstops.com,mlan@bellsouth.net,"(561) 498-4009","8596 W Atlantic Ave","Delray Beach",FL,33446,"8596 W Atlantic Ave,Delray Beach,FL 33446","Garden Centers, Landscaping & Lawn Services, Landscaping Equipment & Supplies, Masonry Equipment & Supplies, Mulches, Nurseries-Plants & Trees, Stone Natural",,,,26.45266,-80.18143,,"One Stop Landscape Supply",,"Mon - Fri: 7:30 am - 5:00 pm Sat: 7:30 am - 4:00 pm Sun Closed","Lake Worth: (561) 433-8764",,"all major credit cards",,,http://thebushelstops.com,,,,,,,,,
982286,318778,"2020-09-27 03:01:44","Yost Sand and Gravel",http://www.yostsandandgravel.com,yostsandandgravel@yahoo.com,"(734) 397-1183","45697 Ecorse Rd","Van Buren Twp",MI,48111,"45697 Ecorse Rd,Van Buren Twp,MI 48111","Stone Natural, Building Contractors, Concrete Contractors, Crushed Stone, Dump Truck Service, Foundation Contractors, Garden Centers, General Contractors, Landscaping Equipment & Supplies, Lawn & Garden Equipment & Supplies, Masonry Contractors, Mulches, Patio Builders, Quarries, Sand & Gravel, Sand & Gravel Handling Equipment, Shipping Services, Stone Products, Stone-Retail, Topsoil, Trucking",,,,42.24681,-83.48924,,"Contact us today!","* All Types of Sand & Gravel * Screening Topsoil & Peat in Our Yard ""Dirt Cheap"" * Topsoil - Mulches - Peat Mix * Garden Wall & Flagstone * Landscape & Nurserymen Equipment & Supplies * Retail & Wholesale * Commercial Accounts Welcome * Topsoil Special, $12 a yard, pick up and delivery available. Free Fill delivery available. Also Screened fill sand, 14$ per yard.","Mon - Fri: 8:00 am - 6:00 pm Sat: 8:00 am - 5:00 pm Sun: 10:00 am - 2:00 pm",,,"amex, discover, visa, mastercard",,"A-Bushel Center Of Yost Sand & Gravel","http://www.yostsandgravel.com http://www.2yostsandandgravel.com",,,,,,,,,
982503,318825,"2020-09-27 03:01:44","Erickson's Landscape Supply",http://www.ericksonslandscapesupply.com,ericksonslandscapesupply@gmail.com,"(262) 878-5420","18917 Spring St","Union Grove",WI,53182,"18917 Spring St,Union Grove,WI 53182","Stone Natural, Concrete Equipment & Supplies, Landscaping Equipment & Supplies, Lawn & Garden Equipment & Supplies, Mulches, Ready Mixed Concrete, Sand & Gravel, Topsoil",,,A+,42.70414,-88.04462,,,,"Mon - Fri: 8:00 am - 5:00 pm Sat: 8:00 am - 12:00 pm",,,"visa, amex, all major credit cards, check, mastercard, discover",,,"http://www.ericksonslandscapesupply.com http://ericksonlandscapesupply.com","Parking: Lot",,,,,,,,
982525,318827,"2020-09-27 03:01:44","Phoenix Stone Company",http://phoenixstoneco.com,,"(586) 465-6255","74 Floral Ave","Mount Clemens",MI,48043,"74 Floral Ave,Mount Clemens,MI 48043","Stone Natural, Crushed Stone, Flagstone, Landscaping Equipment & Supplies, Lawn & Garden Equipment & Supplies, Mulches, Sand & Gravel, Stone Products",,,,42.59413,-82.8944,,,"The Phoenix Stone Company services Michigan, Ohio, Indiana and Ontario from our wholesale stone center in Mt. Clemens, Michigan. We provide natural flagstones, wall stones, boulders, decorative gravels, bagged stone, soil and mulches, as well as concrete pavers and wall, edging, weed barriers and athletic field products. Our customers include landscape supply yards, garden centers, nurseries, schools, and local landscape contractors and home owners.","Mon - Fri: 8:00 am - 5:00 pm Sat: 8:00 am - 12:00 pm",,,"all major credit cards",,,http://phoenixstoneco.com,,,,,,,,,
982532,318829,"2020-09-27 03:01:44","Mulch & More Landscaping & Gardening Supply",http://www.mulchandmore-clover.com,info@mulchandmore-clover.com,"(803) 222-3355","3342 Filbert Hwy",Clover,SC,29710,"3342 Filbert Hwy,Clover,SC 29710","Mulches, Garden Centers, Landscape Contractors, Landscaping & Lawn Services, Landscaping Equipment & Supplies, Lawn & Garden Equipment & Supplies, Sand & Gravel, Stone Natural",,,A+,35.08553,-81.2266,,,,"Mon - Fri: 10:00 am - 5:00 pm Sat: 8:30 am - 12:00 am",,,"all major credit cards, discover, amex",,"Mulch & More Landscape and Garden Supply","http://www.mulchandmore-clover.com https://www.mulchandmore-clover.com","Parking: Lot Wheelchair Accessible: Yes",,,,,,,,
982712,318874,"2020-09-27 03:01:44","Southern Mulch",http://www.southernmulch.com,info@southernyardproducts.com,"(864) 582-2275","3981 Highway 9","Boiling Springs",SC,29316,"3981 Highway 9,Boiling Springs,SC 29316","Mulches, Landscaping & Lawn Services, Stone Natural",3,"2 Reviews",,35.04923,-81.98685,,,,"Mon - Sat: 8:00 am - 5:00 pm","Phone: (864) 342-7795 Phone: (864) 814-3050 Fax: (864) 342-7795 Fax: (864) 814-3050 TollFree: (800) 643-0315",,"cash, discover, amex, master card, visa, all major credit cards, check",,"Southern Mulch Co Southern Mulch (Boiling Springs)",http://www.southernmulch.com,"Parking: Lot, Private Wheelchair Accessible: Yes","Tony B.",04/18/2016,one,"I concur with the other review. The manage at the boiling springs store knew what he was talking about and very helpful. Southern much states that they always want to hear from their customers, we'll hear this..you lost a great manager and really dropped the ball on this one. I believe there will be several lost customers due to this.","Mar B.",04/16/2016,five,"I will no longer be doing any business with this company. They let go of one hell of manager today and when I went in the store today they didn't know how to run the place with out him. My company has always bought from southern mulch but will never again and I attend to spread the word to all my buddies. This place is a joke now! They sure made a mistake on this one."
982870,318912,"2020-09-27 03:01:44","Alley's Trucking & Materials",https://www.landscapematerialtemple.com,,"(254) 947-5757","5500 W Fm 93",Temple,TX,76502,"5500 W Fm 93,Temple,TX 76502","Sand & Gravel, Crushed Stone, Dump Truck Service, Garden Centers, Landscaping Equipment & Supplies, Mulches, Stone Natural, Stone Products, Topsoil, Trucking",,,,31.04431,-97.42632,https://i1.ypcdn.com/blob/e002d0b0d90427e91e7996c9569d611446cfb116_100x100_crop.jpg?f9d23e1,,"Are you looking for top-quality landscape materials? Look no further than AlleyВ’s Trucking & Materials in Bell County, TX. For more than 25 years we have hauled topsoil mixes, garden soil mixes, and compost soil mixes all over the Temple area. We also offer a large variety of stone, gravel, mulch, and sand. We pride ourselves on carrying the finest quality products in a wide variety of colors, styles, shapes, and sizes. Our highly trained staff, professional delivery crews, and top-of-the-line equipment will ensure you get the best product on the market on time and for the perfect price. Stop by or contact us today!","Mon - Fri: 8:00 am - 4:30 pm Sat: 8:00 am - 2:00 pm Sun Closed",,,"cash, check",,,https://www.landscapematerialtemple.com,,,,,,,,,
982890,318920,"2020-09-27 03:01:44","Mr Mulch Inc",http://mrmulchseaford.com,kay74@yahoo.com,"(302) 629-5737","22288 Coverdale Rd",Seaford,DE,19973,"22288 Coverdale Rd,Seaford,DE 19973","Mulches, Crushed Stone, Landscaping & Lawn Services, Sand & Gravel, Stone Natural",,,A+,38.67868,-75.54839,,,,"Mon - Fri: 7:00 am - 5:00 pm",,,,,"Mr. Mulch Seaford","http://mrmulchseaford.com http://seafordconcreteproducts.com",,,,,,,,,