business_x_category.id,business.id,business.ts,business.business_name,business.home_page,business.email_address,business.phone,business.street,business.city,business.state,business.zip_code,business.full_address,business.category,business.rating,business.number_of_reviews,business.bbb_rating_or_license,business.latitude,business.longitude,business.cover_image,business.slogan,business.general_info,business.regular_hours,business.extra_phones,business.services_products,business.payment,business.price_range,business.aka,business.other_links,business.other_information,business.review_1_name,business.review_1_date,business.review_1_rating,business.review_1_text,business.review_2_name,business.review_2_date,business.review_2_rating,business.review_2_text
974062,316839,"2020-09-27 03:01:28","Ohio Mulch",http://www.ohiomulch.com,info@ohiomulch.com,"(614) 921-9330","4120 Roberts Rd",Columbus,OH,43228,"4120 Roberts Rd,Columbus,OH 43228","Mulches, Garden Centers, Landscaping & Lawn Services, Masonry Equipment & Supplies, Nurseries-Plants & Trees, Sand & Gravel, Stone Natural, Topsoil",,,,40.00587,-83.10711,,,"Ohio Mulch is a landscape supply company proudly serving Ohio residents with quality mulch, stone and topsoil products for over 34 years. Visit our site for current specials. We have locations in In Columbus, Cincinnati, Dayton, Delaware, and many other cities throughout central Ohio. We deliver bulk stone, sand, gravel, and mulch to thousands of customers.","Mon - Sat: 7:00 am - 6:00 pm Sun: 11:00 am - 4:00 pm",,,"mastercard, amex, discover, visa",,,website,,,,,,,,,
974211,316871,"2020-09-27 03:01:28","Tim Wallace Landscape Supply & Nursery",http://timwallacelandscapesupply.com,,"(815) 467-6780","5681 White Willow Rd",Minooka,IL,60447,"5681 White Willow Rd,Minooka,IL 60447","Landscaping Equipment & Supplies, Farm Supplies, Garden Centers, Landscape Contractors, Landscaping & Lawn Services, Lawn & Garden Equipment & Supplies, Mulches, Nurseries-Plants & Trees, Sand & Gravel, Stone Natural, Topsoil",,,,41.47521,-88.36024,,,,"Mon - Sat: 9:00 am - 4:00 pm Sun Closed","Phone: (815) 467-6181 Phone: (815) 634-6780 Fax: (815) 467-6181",,"master card, visa, cash, debit, discover, all major credit cards, amex",,"Tim Wallace Landscape Supl Inc Tim Wallace Landscape Supply Inc Tim Wallace Snowplow Supply",http://timwallacelandscapesupply.com,,,,,,,,,
974844,317017,"2020-09-27 03:01:33","La Lawn & Sod",http://www.lalawnandsod.com,lalawnandsod@yahoo.com,"(318) 861-4800","9466 Paxton Rd",Shreveport,LA,71106,"9466 Paxton Rd,Shreveport,LA 71106","Stone Natural, Erosion Control, Hydrologists, Irrigation Systems & Equipment, Landscape Contractors, Landscape Designers & Consultants, Landscaping & Lawn Services, Landscaping Equipment & Supplies, Lawn & Garden Equipment & Supplies, Lawn Maintenance, Nurseries-Plants & Trees, Nursery & Growers Equipment & Supplies, Sod & Sodding Service, Sprinklers-Garden & Lawn, Sprinklers-Garden & Lawn, Installation & Service",,,A+,32.40877,-93.75091,,,,"Mon - Fri: 9:00 am - 5:00 pm",,,,,,http://www.lalawnandsod.com,"Specialties: Chemicals",,,,,,,,
975393,317155,"2020-09-27 03:01:33","Porter Garden Center",http://portergardencenter.com,,"(256) 381-9612","401 Woodward Ave","Muscle Shoals",AL,35661,"401 Woodward Ave,Muscle Shoals,AL 35661","Nurseries-Plants & Trees, Garden Centers, Plants, Stone Natural",5,"1 Review",,34.75646,-87.66656,,,"Porter's Garden Center Specializes In All Types Of Stone, Field Stone, Flag Stone, Wall Block And Paver Tiles. Shop Porter's Garden Center For All Varieties Of Plants, Trees, Shrubs And Hanging Baskets.","Mon - Sat: 8:00 am - 5:00 pm",,,,,,"http://portergardencenter.com https://portergardencenter.com",,lassmomof3,12/14/2009,five,"Love to go here and dream. Staff is very helpful in selection and questions regarding plants.",,,,
976650,317458,"2020-09-27 03:01:33","Ken Mulch Inc",http://ken-mulch.com,kenmulch75@gmail.com,"(502) 964-7222","2708 Outer Loop",Louisville,KY,40219,"2708 Outer Loop,Louisville,KY 40219","Mulches, Landscaping Equipment & Supplies, Lawn & Garden Equipment & Supplies, Nurseries-Plants & Trees, Stone Natural, Topsoil",5,"1 Review",A+,38.13489,-85.71704,https://i1.ypcdn.com/blob/889d575064755827ecea3b60320e64be0cbe1980_100x100_crop.jpg?f9d23e1,"Here for All Your Hard To Find Landscape Needs","Ken-Mulch, Inc. is a leader in landscaping material sales in Louisville, selling top quality products in bulk! The first mulch company in Kentuckiana, we are committed in bringing homeowners, professional landscapers, and commercial property owners the best products at the best possible price. We carry the largest selection of mulches, topsoil, pond supplies, Rose granite, brick chips, trees, shrubs, plants, and more! By the scoop and/or the five gallon bucket, our products are always in-stock and available for delivery!","Mon - Sat: 8:00 am - 5:00 pm Sun Closed Holiday Hours 2020/01/01 Closed Holiday Hours 2020/05/25 Closed Holiday Hours 2020/09/07 Closed Holiday Hours 2020/11/26 Closed Holiday Hours 2019/12/31 Closed Holiday Hours 2020/12/25 Closed Holiday Hours 2020/07/04 Closed",,,"amex, visa, discover, mastercard",,,"Primary Website","Price Range : Average","Cecil R.",04/05/2017,five,"billy delivered gravel to my home awhile back and was a great guy... he delivered promptly and put it just where i needed it thanks billy",,,,
977361,317613,"2020-09-27 03:01:33","Leserra's Nursery And Landscaping",https://www.leserrasnursery.com,LeserraNursery@aol.com,"(954) 426-8021","5330 W Hillsboro Blvd","Coconut Creek",FL,33073,"5330 W Hillsboro Blvd,Coconut Creek,FL 33073","Stone Natural, Gardeners, Landscape Designers & Consultants, Landscaping & Lawn Services, Landscaping Equipment & Supplies, Lawn & Garden Equipment & Supplies, Mulches, Nurseries-Plants & Trees, Plants, Sod & Sodding Service",,,,26.31713,-80.19589,https://i2.ypcdn.com/blob/c6a06ea1bb77a0fe6f5684cfecca459fc9fc3933_100x100_crop.jpg?f9d23e1,,"We want you to walk out your door and be happy with what you see. Whether you want to decorate your patio or re-landscape your entire yard, we will be there to help guide you along the way. For more information please call 954-426-8021!","Mon - Sat: 7:30 am - 5:00 pm Sun: 9:00 am - 4:00 pm",,,"cash, check, discover, master card, visa",,,website,,,,,,,,,
977639,317683,"2020-09-27 03:01:33","Oak Shade Nursery & Garden Ctr",https://www.facebook.com/oakshadenursery,,"(609) 268-1502","434 Oakshade Rd",Shamong,NJ,08088,"434 Oakshade Rd,Shamong,NJ 08088","Nurseries-Plants & Trees, Crushed Stone, Garden Centers, Irrigation Consultants, Irrigation Systems & Equipment, Landscape Contractors, Landscape Designers & Consultants, Landscaping & Lawn Services, Landscaping Equipment & Supplies, Sprinklers-Garden & Lawn, Sprinklers-Garden & Lawn, Installation & Service, Stone Natural, Stone Natural-Wholesale & Manufacturers, Stone Products, Stone-Retail, Tree Service",5,"1 Review",A+,39.81745,-74.75936,,,"Our companies provide a wide range of services and products for landscaping every part of your yard. From stone and pavers to a huge variety of flowering trees, shrubs and colorful flowers for the summer, we at Oakshade Nursery care about your outdoor living spaces. We offer just about anything a homeowner could want.Our Garden Center and Design Offices are located at 434 Oakshade Rd. in Shamong, NJ, right next to Windswept Stone Co. where we provide our customers with one-stop shopping for all your landscape needs. If you have any question or need to contact us, please feel free.","Mon - Sun: 8:30 am - 5:00 pm",,,,,"Oakshade Nursery",https://www.facebook.com/oakshadenursery,,clouran,07/21/2013,five,"Can't say enough good things about Oakshade Nursery! Larry Zimmer and his landscape/hardscape crew were great. They worked with my husband and I every step of the way. Did things the way I wanted and offered options when I wasn't sure what I wanted. They were prompt, very professional and had good attention to detail. Love the job they did!",,,,
977732,317706,"2020-09-27 03:01:33","Willow Creek Landscape Supply",,,"(706) 235-4356","2415 Cedartown Hwy SE",Rome,GA,30161,"2415 Cedartown Hwy SE,Rome,GA 30161","Stone Natural, Garden Centers, Landscape Contractors, Landscaping Equipment & Supplies, Lawn & Garden Equipment & Supplies, Masonry Equipment & Supplies, Nurseries-Plants & Trees",,,A+,34.19198,-85.20048,,,"Willow Creek Landscape Supply was established in 2006 and is owned and operated by Russ Head and family. Russ has been associated with the landscape and water garden industry since 1995 in the Rome area. We are a local, family owned business with one goal, to serve you!","Mon - Fri: 7:30 am - 5:30 pm Sat: 8:00 am - 4:00 pm Sun Closed",,,"visa, debit, check, cash, mastercard",,,,,,,,,,,,
977930,317748,"2020-09-27 03:01:33","Buck Jones Nursery",http://www.buckjones.com,,"(770) 963-8227","689 Grayson New Hope Rd",Lawrenceville,GA,30045,"689 Grayson New Hope Rd,Lawrenceville,GA 30045","Nurseries-Plants & Trees, Landscaping & Lawn Services, Landscaping Equipment & Supplies, Lawn & Garden Equipment & Supplies, Mulches, Nursery-Wholesale & Growers, Sod & Sodding Service, Stone Natural, Topsoil",,,,33.91456,-83.92366,,"Gardners helping Gardners","One of Atlanta's largest, oldest, and most repsected suppliers of nursery and landscape supplies. The sales staff has over 100 years of combined experience in the horticulture industry. We offer the best quality for the money, backed with exceptional service, most convenient to customers.","Mon - Fri: 8:00 am - 5:00 pm Sat: 8:00 am - 2:00 pm",,,"discover, amex, visa, mastercard, check",,,http://www.buckjones.com,,,,,,,,,
981098,318482,"2020-09-27 03:01:44","Mulch Masters LLC",http://www.mulchmasters.com,info@mulchmastersuae.com,"(904) 727-1100","230 Lee Rd",Jacksonville,FL,32225,"230 Lee Rd,Jacksonville,FL 32225","Mulches, Garden Centers, Landscape Contractors, Landscape Designers & Consultants, Landscaping & Lawn Services, Landscaping Equipment & Supplies, Lawn & Garden Equipment & Supplies, Masonry Equipment & Supplies, Nurseries-Plants & Trees, Sand & Gravel, Stone Natural, Topsoil",,,A+,30.32707,-81.53684,https://i1.ypcdn.com/blob/1f797cf1a4d7289db6d9ff2aefbb4a96d948462d_100x100_crop.jpg?f9d23e1,,,"Mon - Fri: 8:00 am - 5:00 pm",,,"discover, visa, amex, mastercard",,,http://www.mulchmasters.com,"Bike Parking: No Services: Landscape Designers",,,,,,,,
981789,318650,"2020-09-27 03:01:44","Garden Path The",http://www.thegardenpathstonecenter.com,thegardenpathstonecenter@yahoo.com,"(318) 473-2441","57 Ross Ln",Alexandria,LA,71303,"57 Ross Ln,Alexandria,LA 71303","Stone Natural, Garden Centers, Iron Work, Landscaping & Lawn Services, Landscaping Equipment & Supplies, Lawn & Garden Equipment & Supplies, Masonry Equipment & Supplies, Mulches, Nurseries-Plants & Trees, Sand & Gravel",,,,31.29178,-92.54354,,,"Central Louisiana's largest supplier of natural stone, pottery, pond supplies, and ironwork. Serving Louisiana for over 23 years, we carry an extensive selection of products for landscape, home applications, and night lighting.","Mon - Fri: 8:00 am - 5:00 pm Sat: 8:00 am - 11:30 am Sun Closed",,,,,,http://www.thegardenpathstonecenter.com,"Parking: Lot Services: Ironwork, Sand Delivery",,,,,,,,
981950,318699,"2020-09-27 03:01:44","Landscape Depot",,info@lsdepot.com,"(321) 259-1620","6370 Us Highway 1",Rockledge,FL,32955,"6370 Us Highway 1,Rockledge,FL 32955","Nurseries-Plants & Trees, Crushed Stone, Garden Centers, Hardware Stores, Landscape Contractors, Landscape Designers & Consultants, Landscaping & Lawn Services, Landscaping Equipment & Supplies, Lawn & Garden Equipment & Supplies, Masonry Equipment & Supplies, Mulches, Sand & Gravel, Stone Natural, Topsoil",,,A+,28.23541,-80.67568,https://i1.ypcdn.com/blob/2627b9874c7be1265142039e77d11dc61815d19e_100x100_crop.jpg?f9d23e1,,"Landscape Depot of Brevard has provided outstanding customized service to our clients for over 30 years. This has earned us the reputation of one of Central Florida's premier landscape companies. With over 30 years of experience in Brevard we have been able to continually & reliably offer our services and strive to provide effective landscape solutions both in terms of aesthetic appeal and cost effectiveness. Our professional team guarantees that you are in good hands and is excited to work with you to improve your landscape whether it is through guidance, materials, or service. No matter the type of service or design you are looking for Landscape Depot can help by providing you the highest quality of service in the industry while ensuring you are satisfied with the finished project. Our team understands that your landscaping is an extension of you & continually strive to treat every customer individually and with the same level of care and commitment.","Mon - Sat: 7:00 am - 6:00 pm Sun: 8:00 am - 5:00 pm","Phone: (321) 259-4238 Phone: (321) 600-4575 Phone: (321) 622-6942 Fax Number: (321) 259-1623",,"visa, all major credit cards, amex, financing available, mastercard",,,,"Services: Gravel / Boulders / Landscaping Stone, Sand / Soil / Mulch, Pavers and Manufactured Block, Full Service Nursery and Sod, Sheds, Pottery and Statuary&amp.#10.We Install All that We Sell!",,,,,,,,
982097,318730,"2020-09-27 03:01:44","Bushel Stop Inc",http://thebushelstops.com,mlan@bellsouth.net,"(561) 498-4009","8596 W Atlantic Ave","Delray Beach",FL,33446,"8596 W Atlantic Ave,Delray Beach,FL 33446","Garden Centers, Landscaping & Lawn Services, Landscaping Equipment & Supplies, Masonry Equipment & Supplies, Mulches, Nurseries-Plants & Trees, Stone Natural",,,,26.45266,-80.18143,,"One Stop Landscape Supply",,"Mon - Fri: 7:30 am - 5:00 pm Sat: 7:30 am - 4:00 pm Sun Closed","Lake Worth: (561) 433-8764",,"all major credit cards",,,http://thebushelstops.com,,,,,,,,,
982910,318925,"2020-09-27 03:01:44","Big John's Nursery",http://www.bigjohnsnursery.com,bigjohnsnursery@att.net,"(972) 291-2231","621 Straus Rd","Cedar Hill",TX,75104,"621 Straus Rd,Cedar Hill,TX 75104","Stone Natural, Landscape Contractors, Landscaping & Lawn Services, Nurseries-Plants & Trees, Sprinklers-Garden & Lawn, Sprinklers-Garden & Lawn, Installation & Service",,,A+,32.60029,-96.95137,,,,"Mon - Sat: 8:00 am - 6:00 pm Sun: 9:00 am - 5:00 pm",,,"all major credit cards, amex, discover, master card, visa",,,http://www.bigjohnsnursery.com,"Price Range : Average Specialties: Ponds",,,,,,,,
983482,319074,"2020-09-27 03:01:49","Buck Jones Nursery",http://www.buckjoneswoodstock.net,tnobis@buckjones.com,"(770) 345-5506","7470 Hickory Flat Hwy",Woodstock,GA,30188,"7470 Hickory Flat Hwy,Woodstock,GA 30188","Nurseries-Plants & Trees, Landscaping Equipment & Supplies, Lawn & Garden Equipment & Supplies, Mulches, Sod & Sodding Service, Stone Natural, Topsoil",,,,34.15908,-84.40995,,"Gardeners helping Gardeners",,"Mon - Fri: 7:30 am - 4:30 pm",,,"all major credit cards, amex, discover, visa, mastercard",,,http://www.buckjoneswoodstock.net,"Parking: Lot, Private Price Range : Average Services: Install Sod",,,,,,,,
983593,319097,"2020-09-27 03:01:49","Lake Oroville Landscape Center",http://www.lakeorovillelandscapecenter.com,ronmonago@gmail.com,"(530) 538-8300","5929 Lincoln Blvd",Oroville,CA,95966,"5929 Lincoln Blvd,Oroville,CA 95966","Landscaping Equipment & Supplies, Artificial Grass, Concrete Equipment & Supplies, Fountains Garden, Display, Etc, Landscape Designers & Consultants, Landscaping & Lawn Services, Lawn & Garden Equipment & Supplies, Nurseries-Plants & Trees, Ready Mixed Concrete, Rental Service Stores & Yards, Rock Shops, Sand & Gravel, Sheds, Soil Conditioners, Stone Natural",4,"5 Reviews",,39.4689,-121.54864,https://i1.ypcdn.com/blob/e44c15766f9cb237be720f43adf9cc382c22320d_100x100_crop.jpg?f9d23e1,"HERE TO MEET ALL YOUR LANDSCAPING NEEDS","We are a retail landscape supply yard. Local and family-owned and operated since 2005. HWY 70, East on Ophir Rd, North on Lincoln Blvd, 1/4 mile on the right.","Mon - Fri: 8:00 am - 5:00 pm Sat: 8:00 am - 3:00 pm",,,"check, mastercard, visa, debit, amex, discover",,,http://www.lakeorovillelandscapecenter.com,,"Mylene dianne C.",03/18/2019,five,"Reliable and good customer service. Highly recommended","Gene H.",03/21/2017,five,"Went to landscape center to pick out materials for our new backyard. What a great selection of stone. Had Monago's Landscape Design design and install our back yard."
985243,319476,"2020-09-27 03:01:50","River Valley Horticultural Products Inc",,,"(501) 821-4770","21701 Lawson Rd","Little Rock",AR,72210,"21701 Lawson Rd,Little Rock,AR 72210","Nursery & Growers Equipment & Supplies, Ceramics-Equipment & Supplies, Decorative Ceramic Products, Garden Centers, Landscaping Equipment & Supplies, Lawn & Garden Equipment & Supplies, Mulches, Nurseries-Plants & Trees, Stone Natural, Stone Natural-Wholesale & Manufacturers",,,,34.71588,-92.51727,https://sapi.everyscape.com/XmlApi/Image.svc/Images/VSTHUMB/VS1839525_W287_H93,,,"Mon - Sat: 8:00 am - 5:00 pm Sun Closed",,,,,"River Valley Hort Products",,,,,,,,,,
986186,319680,"2020-09-27 03:01:50","Innovative Mulching",http://www.innovativemulching.com,,"(904) 246-8524","11205 Beach Blvd",Jacksonville,FL,32246,"11205 Beach Blvd,Jacksonville,FL 32246","Mulches, Garden Centers, Landscape Contractors, Masonry Equipment & Supplies, Nurseries-Plants & Trees, Stone Natural",,,,30.28741,-81.5293,https://i1.ypcdn.com/blob/a5d55c1fe30c3f9581039b5be43d953d4f344fcd_100x100_crop.jpg?f9d23e1,,,,,,,,,http://www.innovativemulching.com,,,,,,,,,
987742,320047,"2020-09-27 03:01:53","Richards Tree Farm",http://www.richardstreefarm.com,richards.treefarm@ainop.com,"(570) 223-8134","5064 Milford Rd","East Stroudsburg",PA,18302,"5064 Milford Rd,East Stroudsburg,PA 18302","Landscaping Equipment & Supplies, Garden Centers, Landscape Contractors, Lawn & Garden Equipment & Supplies, Nurseries-Plants & Trees, Stone Natural",5,"1 Review",,41.05229,-75.10336,,,,"Mon - Sat: 9:00 am - 5:00 pm Sun: 9:00 am - 4:00 pm","Phone: (570) 223-6717 Fax: (570) 223-6717 Fax Number: (570) 223-6717",,"amex, discover, master card, visa",,"Richards Seth H",http://www.richardstreefarm.com,,bird_house,11/06/2011,five,"Very knowedgable and helpful. Fast delivery and reasonable prices.",,,,
987997,320105,"2020-09-27 03:01:53","Rogers Rock & Stone",http://www.rogersrockandstone.com,info@bbbnebraska.org,"(402) 332-3187","10909 Highway 6",Gretna,NE,68028,"10909 Highway 6,Gretna,NE 68028","Stone Natural, Building Materials, Landscape Contractors, Landscaping Equipment & Supplies, Nurseries-Plants & Trees, Rock Shops, Sand & Gravel",,,A+,41.15009,-96.23761,,,,"Mon - Fri: 8:30 am - 6:00 pm Sat: 8:30 am - 3:00 pm",,,"all major credit cards",,"Rogers Rock & Stone LLC","http://www.rogersrockandstone.com https://www.rogersrockandstone.com/menu.html","Parking: Lot, Free Specialties: Ponds",,,,,,,,
988044,320116,"2020-09-27 03:01:53","Rudi Wortmann Nurseries Ltd.",http://www.wortmannnurseries.com,rudi@wortmannnurseries.com,"(734) 216-5056","217 S Parker Rd","Ann Arbor",MI,48103,"217 S Parker Rd,Ann Arbor,MI 48103","Landscape Designers & Consultants, Landscape Contractors, Masonry Contractors, Nurseries-Plants & Trees, Stone Natural",,,,42.28689,-83.89782,https://i1.ypcdn.com/blob/e63ef22ca6c1e1ec439d1a8ef47d3e2d8e192424_100x100_crop.jpg?f9d23e1,"Skilled labor performed expeditiously: the only surprise.","We have been in business for over 31 years planting the fields with Amelanchier and Carpinus, and by doing landscape work. We have expanded our business offering sales and installations for New York bluestone and, our most current product line, Elbe River sandstone from Germany.",,,,"check, cash",,,"Grower and seller of European Hornbeam",,,,,,,,,
988430,320200,"2020-09-27 03:01:53","Flood's Nursery & Landscaping",http://floodsnurseryandfarmmarket.com,info@floodsnurseryandfarmmarket.com,"(570) 839-7499","425 Carlton Rd","Mount Pocono",PA,18344,"425 Carlton Rd,Mount Pocono,PA 18344","Nurseries-Plants & Trees, Garden Centers, Landscape Designers & Consultants, Mulches, Nursery-Wholesale & Growers, Stone Natural, Topsoil",,,,41.12669,-75.3111,,,,"Mon - Fri: 9:00 am - 5:00 pm Sat: 10:00 am - 5:00 pm Sun: 10:00 am - 4:00 pm","Phone: (570) 839-0721",,,,,http://floodsnurseryandfarmmarket.com,,,,,,,,,
989332,320418,"2020-09-27 03:01:53","Kushners Garden & Patio",http://www.kushners.com,,"(330) 269-7406","2421 E Western Reserve Rd",Youngstown,OH,44514,"2421 E Western Reserve Rd,Youngstown,OH 44514","Garden Centers, Landscape Contractors, Landscape Designers & Consultants, Landscaping & Lawn Services, Landscaping Equipment & Supplies, Lawn & Garden Equipment & Supplies, Masonry Equipment & Supplies, Mulches, Nurseries-Plants & Trees, Patio & Outdoor Furniture, Sod & Sodding Service, Stone Natural",,,A+,40.98735,-80.60708,,,"Kushners has been serving the valley since 1940, using this experience to bring you the newest plants and proven gardening products to insure your project meets your expectations, and maintenance products to continue giving you years of enjoyable gardening.","Mon - Fri: 8:00 am - 6:00 pm Sat: 8:00 am - 4:00 pm",,,"discover, visa, mastercard",,,"http://www.kushners.com http://kushners.com/?utm_source=YP.com%20Network&utm_medium=YP.com%20Network&utm_campaign=YP.com%20Network","Specialties: Pools & Spas, Sidewalks Services: Aluminum Bark Cushions Deck & Porch Sets Decorative Accents Garden Decor Mulches Patio Furniture Patios Pond & Pool Supplies Pool Supplies Shrubs Swimming Pool Furniture",,,,,,,,
989629,320485,"2020-09-27 03:01:53","Burkdell Mulch",http://www.unilock.com,,"(618) 549-2211",,Carbondale,IL,62901,"Carbondale,IL 62901","Mulches, Garden Centers, Landscape Contractors, Landscaping Equipment & Supplies, Masonry Equipment & Supplies, Nurseries-Plants & Trees, Stone Natural",,,,,,,,,,,,,,,http://www.unilock.com,,,,,,,,,
989996,320574,"2020-09-27 03:01:53","Willems Landscape Service Inc",http://www.willemslandscape.com,willemslandscape@yahoo.com,"(920) 336-1749","3661 Creamery Rd","De Pere",WI,54115,"3661 Creamery Rd,De Pere,WI 54115","Stone Natural, Garden Centers, Landscape Contractors, Landscape Designers & Consultants, Landscaping & Lawn Services, Landscaping Equipment & Supplies, Lawn & Garden Equipment & Supplies, Mulches, Nurseries-Plants & Trees, Snow Removal Service, Topsoil",,,A+,44.43478,-88.01668,https://i1.ypcdn.com/blob/1449b603b33dd4f79311e6683320099fa7614202_100x100_crop.jpg?f9d23e1,"Complete line of landscape materials","Serving the Greater Green Bay area's landscaping needs for over 40 years. We carry a variety of trees, shrubs, mulches, decorative stone, edging, and weed barriers. We deliver anywhere in the greater Green Bay area.",,"Fax: (920) 336-3447",,"check, no credit cards, cash",,,"Landscape and gardening materials and supplies","Parking: Self, On Site, Free Wheelchair Accessible: Yes Specialties: Soil, Walls Services: Evergreens, Design &amp. Installation, Decorative Stone, Walks &amp. Patios, Seed &amp. Sod, Pulverized Top Soil, Perennial Flowers, Garden Mix, Flowering Shrubs, Flagstone Walls, We Plant Trees, Shredded Bark, Shade Trees. &nbsp.Please call for store&nbsp.hours.",,,,,,,,
991335,320868,"2020-09-27 03:01:53","Bryant Nurseries",,,"(815) 875-6432","21 E Bryant Pkwy",Princeton,IL,61356,"21 E Bryant Pkwy,Princeton,IL 61356","Mulches, Landscape Contractors, Landscape Designers & Consultants, Landscaping & Lawn Services, Masonry Equipment & Supplies, Nurseries-Plants & Trees, Stone Natural",,,,41.362934,-89.42702,,,,"Mon - Fri: 8:00 am - 5:00 pm Sat - Sun Closed",,,"check, no credit cards",,"Bryant Nurseries LLC",,,,,,,,,,