business_x_category.id,business.id,business.ts,business.business_name,business.home_page,business.email_address,business.phone,business.street,business.city,business.state,business.zip_code,business.full_address,business.category,business.rating,business.number_of_reviews,business.bbb_rating_or_license,business.latitude,business.longitude,business.cover_image,business.slogan,business.general_info,business.regular_hours,business.extra_phones,business.services_products,business.payment,business.price_range,business.aka,business.other_links,business.other_information,business.review_1_name,business.review_1_date,business.review_1_rating,business.review_1_text,business.review_2_name,business.review_2_date,business.review_2_rating,business.review_2_text
340546,112262,"2020-09-27 02:41:05","Graphic Packaging",http://graphicpkg.com,david@graphicpkg.com,"(503) 286-1621","3400 N Marine Dr",Portland,OR,97217,"3400 N Marine Dr,Portland,OR 97217","Paper Products, Packaging Materials, Packaging Service",,,A+,45.61154,-122.70215,,,,,"Phone: (503) 283-2009 Phone: (503) 286-3559 Phone: (360) 696-4623 Primary Phone: (503) 283-2009 Primary Phone: (503) 286-3559",,,,"Graphic Packaging Intl Graphic Packaging Inc Graphic Packaging International Graphic Packaging International, Inc",http://graphicpkg.com,,,,,,,,,
340873,112358,"2020-09-27 02:41:05","International Paper Container Div.",http://internationalpaper.com,,"(209) 526-4700",,,,,,"Paper Manufacturers, Lumber-Wholesale, Office Equipment & Supplies, Packaging Service, Paper Brokers & Mill Representatives, Paper Products-Wholesale & Manufacturers, Paper-Wholesale & Manufacturers, Stationery Stores",,,,,,,,"International Paper Company, which spans more than 40 countries and employs approximately 83,000 people worldwide, has the capabilities to export products to more than 120 nations. International Paper Company is a worldwide leader in the paper, packaging and wood products industry. It does significant business in paper and paper distribution, packaging and forest products, which include building materials. With nearly 8.5 million acres of land managed in the United States, the company is one of the world's largest private landowners. It distributes printing, packaging, graphic arts, maintenance and industrial products principally through more than 270 distribution branches located primarily in the United States. In addition, International Paper Company owns more than half of Carter Holt Harvey, a New Zealand paper and forest products company with operations in New Zealand and Australia. International Paper Company has its headquarters in Memphis, Tenn., with a location in Modesto, Calif.",,"Phone: (661) 526-4700 Primary Phone: (209) 522-5260 Phone: (209) 236-1713 Fax: (209) 526-0557 TollFree: (800) 695-5732",,"master card, visa",,"International Paper Co Container Division International Paper Company",http://internationalpaper.com,,,,,,,,,
340923,112373,"2020-09-27 02:41:05","Frontier Packaging Inc",http://www.frontierpackaging.com,sales@frontierpackaging.com,"(206) 575-7772","1201 Andover Park E Ste 101",Tukwila,WA,98188,"1201 Andover Park E Ste 101,Tukwila,WA 98188","Paper Products, Boxes-Corrugated & Fiber, Packaging Materials, Packaging Materials-Wholesale & Manufacturers, Packaging Service, Paper Manufacturers, Paper Products-Wholesale & Manufacturers",,,A+,47.44455,-122.25206,https://i3.ypcdn.com/blob/ab99182209306ed732a95658a677c50eac15c437_100x100_crop.jpg?63f80dd,,"Established in 1985, Frontier Packaging is a manufacturer and distributor of packaging materials. It serves the food and beverage and agricultural industries. The company offers cartoons, poly bags, boxes, paper bags, containers and fiber trays. It also provides packaging services for the wine industry. Frontier Packaging offers laminated films and pouches, tapes, staples and absorbent pads. The company provides design, maintenance and marketing services. In addition, it offers shipping containers and trays.","Mon - Fri: 8:00 am - 5:00 pm Sat - Sun Closed","Primary Phone: (206) 575-7558 Phone: (206) 575-7558 Fax: (206) 575-3777 TollFree: (800) 767-7333",,discover,,,http://www.frontierpackaging.com,"Wheelchair Accessible: Yes",,,,,,,,
341045,112422,"2020-09-27 02:41:05",ProAmpac,http://www.ampaconline.com,Greg.Tucker@proampac.com,"(513) 671-1777","12025 Tricon Rd",Cincinnati,OH,45246,"12025 Tricon Rd,Cincinnati,OH 45246","Packaging Materials, Packaging Materials-Wholesale & Manufacturers, Packaging Service, Paper Products, Plastic Bags",,,A+,39.30002,-84.47025,,,"Ampac Packaging is a privately owned flexible packaging and labeling services provider. It offers a range of tamper-evident plastic bags for retailers, banks, casinos and mail order applications. Through its retail division, the company paper and plastic shopping bags for the domestic and international retail industry. The company manufactures more than 200 types of customized and proprietary film blends and high-performance roll-stocks, as well as stand-up pouches with a variety of closures, fitments and spouts. Ampac Packaging maintains over 15 manufacturing centers throughout the United States, Germany, China, India and United Kingdom. Additionally, the company supplies digital art files in various software program formats that include Illustrator, Pagemaker, Freehand, Photoshop and QuarkXpress.","Mon - Fri: 9:00 am - 5:00 pm","Primary Phone: (513) 671-1781 Phone: (513) 671-1781 Fax: (513) 671-2920 TollFree: (800) 543-7030 TollFree: (800) 472-0809",,,,"Ampac Holdings Ampac Plastics Incorporated Ampac Holdings LLC Amko Plastics Inc Ampac Plastics Inc","http://www.ampaconline.com http://www.proampac.com",,,,,,,,,
341181,112470,"2020-09-27 02:41:05","International Paper",,,"(630) 585-3400","4160 Campus Dr",Aurora,IL,60504,"4160 Campus Dr,Aurora,IL 60504","Paper Products, Packaging Service, Paper Manufacturers, Paper Products-Wholesale & Manufacturers, Stationery Stores",,,,41.77654,-88.22053,,,"The Weyerhaeuser Company is an international forest products company with annual sales of more than $22 billion. Its businesses touch nearly every aspect of the forest products industry, from growing and harvesting tress to producing, pulp, paper, packaging and building products. Weyerhaeuser is one of the world s largest producers of softwood and hardwood lumber. The company has ranked on Fortune magazine s ranking of America s largest corporations since 1956. The company also has a real estate division that builds homes. The Weyerhaeuser Company was founded in 1900 and employs more than 55,000 people in 18 countries, including a facility in Bedford Park, Ill.",,"Phone: (630) 978-1046",,"visa, master card",,"International Paper Co International Paper Company",,,,,,,,,,
341328,112518,"2020-09-27 02:41:05","Midland Paper & Packaging",http://www.midlandpaper.com,bill.distler@midlandpaper.com,"(502) 964-2704","3805 Business Park Dr",Louisville,KY,40213,"3805 Business Park Dr,Louisville,KY 40213","Paper Products, Packaging Materials, Packaging Service",,,A+,38.17664,-85.69025,,,,,"Phone: (847) 777-2457 Phone: (502) 969-8181",,,,"Midland Paper Pkgng & Supls Midland Paper Packaging & Supplies",http://www.midlandpaper.com,,,,,,,,,
341485,112569,"2020-09-27 02:41:05","International Paper",http://www.internationalpaper.com,carol.sutton@ipaper.com,"(513) 248-6000","6283 Tri-Ridge Blvd",Loveland,OH,45140,"6283 Tri-Ridge Blvd,Loveland,OH 45140","Paper Manufacturers, Packaging Service, Paper Products-Wholesale & Manufacturers, Stationery Stores",,,A+,39.22505,-84.28574,,,,,"Phone: (513) 248-6076 Primary Phone: (513) 248-6000 Phone: (513) 965-2777 TollFree: (800) 207-4003",,"master card, visa",,"Ryan, Thomas International Paper Company Ryan, Thomas W, ATY International Paper Co",http://www.internationalpaper.com,,,,,,,,,
341693,112635,"2020-09-27 02:41:05","Polycell Packaging Corp",http://polycell.com.au,,"(562) 483-6000","12851 Midway Pl",Cerritos,CA,90703,"12851 Midway Pl,Cerritos,CA 90703","Packaging Materials-Wholesale & Manufacturers, Mail & Shipping Services, Packaging Materials, Packaging Service, Packing & Crating Service, Paper Manufacturers",,,,33.88587,-118.05862,,,"Polycell Packaging Corporation - your number one choice for bubble and foam packaging materials was first established in 1970. For more then 30 years, Polycell has been providing high quality packaging products, fast friendly services and all at very affordable prices. Polycell is an international business having nine factories crossing three continents: America, Australia, and Asia. We manufacture bubble, foam and packaging related product, which include cushioned mailers, pouches, laminations, and anti-static products. We continue to expand our product line and we have, as a result, established ourselves as one of the major manufacturers of bubble and foam in the world.Being one of the leading manufacturers in bubble and foam products, we understand the importance of environmental protection. We utilize Low-Density Polyethylene ( LDPE ) resin material to produce our bubble and foam, which is non-toxic, odorless and 100% recyclable. We re-use our bubble and foam material regularly to reduce cost as well as waste, helping you save money and protecting the environment at the same time.Recognizing the importance of customer service, we strive to meet your most demanding needs. With our fleet of delivery vehicles and professional drivers, we are able to respond to your urgent orders rapidly. Polycell is responsive, efficient and ost of all friendly. Our knowledgeable customer service and sales representatives are product trained to respond to your questions and provide packaging solutions quickly. We process your orders electronically and professionally to ensure that your products are delivered safely and on time by our courteous skilled drivers.Polycell Packaging Corporation's ultimate vision is to provide you with outstanding customer service and high quality products at reasonable prices. By achieving this vision, our relationship will strengthen and both the customer and the company profits will soar. So let us be your most valuable protective packaging materials specialists today!",,"Phone: (562) 376-4660 Primary Phone: (562) 376-4660 Phone: (562) 483-6006 Fax: (562) 483-6006 TollFree: (888) 923-7400",,"amex, discover, master card, visa",,"Polycell International Corp Polycell Packaging Corporation","http://polycell.com.au http://polycellpkg.com",,,,,,,,,
341703,112637,"2020-09-27 02:41:05","Us Pak And Ship",http://www.uspakandship.com,sgrebinar@uspackandship.com,"(561) 413-9845","9770 S Military Trl","Boynton Beach",FL,33436,"9770 S Military Trl,Boynton Beach,FL 33436","Shipping Services, Mail & Shipping Services, Moving Boxes, Packaging Materials, Packaging Service, Packing & Crating Service, Paper Manufacturers, Paper Products, Paper-Shredded, Shipping Room Supplies, Truck Rental",,,A+,26.53104,-80.12092,https://i3.ypcdn.com/blob/71a72f05e71719fed5cec80483191ce0b09d8afe_100x100_crop.jpg?63f80dd,"WE OFFER AFFORDABLE SHIPPING SOLUTIONS We are an all-inclusive, one-stop pack and ship store offering your shipping to anywhere in the world.","WE OFFER AFFORDABLE SHIPPING SOLUTIONS We are an all-inclusive, one-stop pack and ship store offering your shipping to anywhere in the world. We offer packing service and crating service for safe delivery of your packages anywhere in the U.S. or worldwide. Our goal is to get your items from point A to point B safely, with the least amount of stress. Most individuals looking for our services are flying from out-of-state for a family member relocation or an estate pack out. We will set up an appointment to pick up your breakable items at your location. Next we will prep pack on site and take everything in transport bins back to our warehouse. Once this is done, we place all of the items in inner cartons set with Styrofoam packing. The inner carton is then placed in the outer carton for the maximum safety to protect each and every piece within the master carton. This process is called double boxing.","Mon - Fri: 8:30 am - 5:00 pm Sat: 9:00 am - 2:00 pm",,,"amex, discover, visa, mastercard",,"Us Pak and Ship Us Pak And Ship",http://www.uspakandship.com,,,,,,,,,
341733,112647,"2020-09-27 02:41:05","International Paper Company",http://internationalpaper.com,,"(803) 481-6700","1145 Union Camp Blvd",Sumter,SC,29154,"1145 Union Camp Blvd,Sumter,SC 29154","Paper Converting, Packaging Service, Paper Manufacturers, Paper Products-Wholesale & Manufacturers",,,,33.86885,-80.37934,,,"International Paper Company, which spans more than 40 countries and employs approximately 83,000 people worldwide, has the capabilities to export products to more than 120 nations. International Paper Company is a worldwide leader in the paper, packaging and wood products industry. It does significant business in paper and paper distribution, packaging and forest products, which include building materials. With nearly 8.5 million acres of land managed in the United States, the company is one of the world's largest private landowners. It distributes printing, packaging, graphic arts, maintenance and industrial products principally through more than 270 distribution branches located primarily in the United States. In addition, International Paper Company owns more than half of Carter Holt Harvey, a New Zealand paper and forest products company with operations in New Zealand and Australia. International Paper Company has its headquarters in Memphis, Tenn., with a location in Sumter, S.C.",,"Fax Number: (803) 481-6729 Fax: (803) 481-6729",,"master card, visa",,,http://internationalpaper.com,,,,,,,,,
341846,112672,"2020-09-27 02:41:05","Campbell Paper Co",http://campbellpaper.com,mjohnson@campbellpaper.com,"(817) 738-2194","2117 Franklin Dr","Fort Worth",TX,76106,"2117 Franklin Dr,Fort Worth,TX 76106","Paper Products, Cleaning Compounds, Janitors Equipment & Supplies-Wholesale & Manufacturers, Packaging Materials, Packaging Materials-Wholesale & Manufacturers, Packaging Service, Paper Manufacturers, Paper Products-Wholesale & Manufacturers",,,A+,32.82648,-97.32401,https://i4.ypcdn.com/blob/df364dcf8167f0e9e7c0a7dc2137997d9e6305d1_100x100_crop.jpg?63f80dd,,,"Mon - Fri: 8:00 am - 5:00 pm",,,,,,"http://campbellpaper.com https://campbellpaper.com",,,,,,,,,
341915,112690,"2020-09-27 02:41:05","Packaging Corp Of America",http://packagingcorp.com,,"(251) 246-4461","4585 Industrial Rd",Jackson,AL,36545,"4585 Industrial Rd,Jackson,AL 36545","Paper-Wholesale & Manufacturers, Office Equipment & Supplies, Packaging Materials, Packaging Service, Paper Manufacturers",,,,31.4959,-87.89949,,,,,"Phone: (251) 246-9907",,,,"Packaging Corporation of America",http://packagingcorp.com,,,,,,,,,
341935,112694,"2020-09-27 02:41:05","International Paper",https://www.internationalpaper.com,,"(651) 645-4683","700 Emerald St","Saint Paul",MN,55114,"700 Emerald St,Saint Paul,MN 55114","Paper Products, Packaging Service, Paper Manufacturers, Paper Products-Wholesale & Manufacturers, Stationery Stores",,,,44.96365,-93.20675,,,,,"Primary Phone: (651) 633-6892",,"visa, master card",,"International Paper Co International Paper Company","https://www.internationalpaper.com http://weyerhaeuser.com http://internationalpaper.com",,,,,,,,,
341940,112695,"2020-09-27 02:41:05","Denver Boxes, Inc",http://www.denversmovingboxes.com,info@DenverBoxes.com,"(303) 453-1549","10888 Leroy Dr",Northglenn,CO,80233,"10888 Leroy Dr,Northglenn,CO 80233","Packaging Materials, Packaging Service, Paper Products",,,A+,39.89427,-104.96318,,,,"Mon - Fri: 8:00 am - 4:00 pm","Phone: (303) 223-2435",,"all major credit cards",,"Denver's Moving Boxes","http://www.denversmovingboxes.com http://denverboxes.com",,,,,,,,,
342069,112730,"2020-09-27 02:41:05","Surface Guard Inc",http://www.surfaceguard.com,mkeaney@pregis.com,"(630) 236-8250","515 Enterprise St",Aurora,IL,60504,"515 Enterprise St,Aurora,IL 60504","Packaging Materials-Wholesale & Manufacturers, Packaging Service, Packing & Crating Service, Paper Manufacturers",,,,41.76625,-88.22489,,,,,"Phone: (630) 898-8400 Phone: (630) 236-8251",,,,,http://www.surfaceguard.com,,,,,,,,,
342122,112745,"2020-09-27 02:41:05","International Paper",http://www.internationalpaper.com,webfeedback@ipaper.com,"(606) 564-6298","1241 W 2nd St",Maysville,KY,41056,"1241 W 2nd St,Maysville,KY 41056","Paper-Wholesale & Manufacturers, Packaging Service, Paper Brokers & Mill Representatives, Paper Manufacturers, Paper Products, Paper Products-Wholesale & Manufacturers, Stationery Stores",,,,38.6953,-83.80199,,,,,"Phone: (606) 564-6919 Phone: (606) 564-0063",,"master card, visa",,"International Paper-Temple Inland International Paper Company",http://www.internationalpaper.com,,,,,,,,,
342268,112793,"2020-09-27 02:41:05",Xpedx,http://www.xpedx.com,eBusiness@veritivcorp.com,"(205) 798-8380","541 Republic Cir",Birmingham,AL,35214,"541 Republic Cir,Birmingham,AL 35214","Packaging Service, Janitors Equipment & Supplies, Paper Products, Paper Products-Wholesale & Manufacturers",,,,33.52747,-86.87149,,,,"Mon - Fri: 9:00 am - 5:00 pm",,,"master card, visa",,,"http://www.xpedx.com http://ipaper.com",,,,,,,,,
342332,112809,"2020-09-27 02:41:05","Millcraft Paper Store",http://www.millcraft.com,morgans@millcraft.com,"(586) 939-7770","35655 Beattie Dr","Sterling Heights",MI,48312,"35655 Beattie Dr,Sterling Heights,MI 48312","Paper Products, Packaging Service, Paper Manufacturers, Paper Products-Wholesale & Manufacturers",,,,42.55523,-83.04078,,,,"Mon - Fri: 8:00 am - 5:00 pm","Phone: (586) 939-8264 Fax: (586) 939-8264",,"amex, master card, visa",,"Millcraft Paper Co",http://www.millcraft.com,,,,,,,,,
342348,112814,"2020-09-27 02:41:05","International Paper",http://internationalpaper.com,,"(985) 732-8000","401 Avenue U",Bogalusa,LA,70427,"401 Avenue U,Bogalusa,LA 70427","Paper-Wholesale & Manufacturers, Packaging Service, Paper Brokers & Mill Representatives, Paper Manufacturers, Paper Products, Paper Products-Wholesale & Manufacturers, Stationery Stores",,,,30.77724,-89.85652,,,"The primary product produced by Temple-Inland s corrugated packaging division is containerboard, which is the largest segment of the United States paper market. Containerboard is made using softwood fiber and is used to create corrugated packaging. The company s 2 million acres of forestland provide the majority of its fiber requirements. Formerly known as Inland Paperboard & Packaging, Temple-Inland s corrugated packaging business includes five containerboard mills, one corrugating medium mill and more than 70 converting operations. These locations are dispersed throughout the continental United States, including Bogalusa, La. Temple-Inland has additional locations in Mexico and Puerto Rico. The corrugated packaging business segment, which began in 1918, accounted for approximately 60 percent of Temple-Inland s revenue in 2003. Headquartered in Austin, Texas, Temple-Inland also has forest products, financial services and real estate divisions.",,"Phone: (985) 732-8495 Phone: (985) 732-3167 Primary Phone: (985) 732-3167 Fax: (985) 732-8495 Fax: (985) 732-8000",,"cash only",,"International Paper Co International Paper Company",http://internationalpaper.com,,,,,,,,,
342425,112840,"2020-09-27 02:41:05","International Paper Company",http://www.internationalpaper.com,webfeedback@ipaper.com,"(219) 844-0215","2501 165th St",Hammond,IN,46320,"2501 165th St,Hammond,IN 46320","Paper Manufacturers, Lumber-Wholesale, Office Equipment & Supplies, Packaging Service, Paper Brokers & Mill Representatives, Paper Products-Wholesale & Manufacturers, Stationery Stores",,,,41.59785,-87.46917,,,,,"Phone: (219) 844-0171 Phone: (219) 972-6560 Phone: (219) 844-6509 Primary Phone: (219) 972-6560",,"master card, visa",,,http://www.internationalpaper.com,,,,,,,,,
342493,112860,"2020-09-27 02:41:05",Xpedx,http://xpedx.com,,"(714) 739-4251","15300 Desman Rd","La Mirada",CA,90638,"15300 Desman Rd,La Mirada,CA 90638","Paper Products, Packaging Materials-Wholesale & Manufacturers, Packaging Service, Paper Manufacturers, Paper Products-Wholesale & Manufacturers",,,,33.88157,-118.00599,,,,,"Primary Phone: (714) 994-1189 Phone: (714) 944-5093 Phone: (714) 994-5093 Phone: (714) 994-1189",,"master card, visa",,,http://xpedx.com,,,,,,,,,
342512,112867,"2020-09-27 02:41:05","Ws Packaging",,,"(906) 864-9877","1201 38th Ave",Menominee,MI,49858,"1201 38th Ave,Menominee,MI 49858","Packaging Materials-Wholesale & Manufacturers, Packaging Service, Packing & Crating Service, Paper Manufacturers",,,,45.1332,-87.61558,,,,,,,,,,,,,,,,,,,
342557,112874,"2020-09-27 02:41:05","Jefferson Smurfit Corporation",http://snapps.com,,"(408) 946-3600","201 S Hillview Dr",Milpitas,CA,95035,"201 S Hillview Dr,Milpitas,CA 95035","Boxes-Corrugated & Fiber, Boxes-Corrugated & Fiber-Wholesale & Manufacturers, Mail & Shipping Services, Packaging Service, Paper Manufacturers",,,,37.43105,-121.89376,,,,"Mon - Sun: 12:00 am - 11:59 pm","Phone: (408) 942-7635",,,,,http://snapps.com,,,,,,,,,
342644,112902,"2020-09-27 02:41:05","International Paper",http://www.internationalpaper.com,webfeedback@ipaper.com,"(423) 318-2896","5032 S Davy Crockett Pkwy",Morristown,TN,37813,"5032 S Davy Crockett Pkwy,Morristown,TN 37813","Paper Products, Packaging Service",,,,36.14875,-83.27958,,,"International Paper Company is a global paper and packaging business with manufacturing operations in North America, Europe, Latin America, Russia, Asia and North Africa. It has a work force of more than 51,000 employees with over 33,000 located in the United States. With annual sales of nearly $20 billion, the company distributes printing, graphic arts, maintenance and industrial products through approximately 250 branches in the U.S. International Paper Company operates more than 15 pulp and paper mills, over 80 converting and packaging plants and nearly four wood product facilities. Its North American distribution company, xpedx, specializes in uncoated paper products and industrial and consumer packaging. The company additionally manages more than 300,000 acres of forestland. International Paper Company serves the agriculture, food service, cosmetics, pharmaceutical, automotive, beverage and hospitality industries. It markets a selection of land available for investment, forest management and recreation.",,"Primary Phone: (423) 318-1200 Phone: (423) 318-1200 Fax: (423) 318-1230 Fax: (423) 587-9364 TollFree: (800) 264-8650",,"master card, visa",,"International Paper Co International Paper Company",http://www.internationalpaper.com,,,,,,,,,
342818,112953,"2020-09-27 02:41:06","Arem Container & Supply Co",http://aremcontainer.com,info@aremcontainer.com,"(847) 673-6184","6153 W Mulford St Ste D",Niles,IL,60714,"6153 W Mulford St Ste D,Niles,IL 60714","Paper Products, Boxes-Corrugated & Fiber, Janitors Equipment & Supplies, Packaging Materials-Wholesale & Manufacturers, Packaging Service, Paper Manufacturers, Paper Products-Wholesale & Manufacturers",,,A+,42.02189,-87.78123,,,,"Mon - Fri: 8:30 am - 4:30 pm Sat - Sun Closed","Phone: (847) 673-6185 Fax: (847) 673-6185 TollFree: (888) 673-2736",,"master card, visa, cash, check",,,http://aremcontainer.com,,,,,,,,,
343160,113051,"2020-09-27 02:41:10","Victory Box Corp",http://www.victoryboxcorp.com,info@victoryboxcorp.com,"(908) 245-5100","645 W 1st Ave",Roselle,NJ,07203,"645 W 1st Ave,Roselle,NJ 07203","Boxes-Corrugated & Fiber, Boxes-Corrugated & Fiber-Wholesale & Manufacturers, Packaging Materials, Packaging Service, Paper Manufacturers",,,,40.65769,-74.2811,,,"With over 70 years of experience, Victory Box Corp offers custom corrugated packaging solutions, including corrugated boxes and design services, in NY, NJ, and PA.","Mon - Fri: 8:00 am - 5:00 pm","Phone: (908) 245-5670 Fax: (908) 245-5670",,"check, invoicing available",,,"http://www.victoryboxcorp.com https://victoryboxcorp.com",,,,,,,,,