business_x_category.id,business.id,business.ts,business.business_name,business.home_page,business.email_address,business.phone,business.street,business.city,business.state,business.zip_code,business.full_address,business.category,business.rating,business.number_of_reviews,business.bbb_rating_or_license,business.latitude,business.longitude,business.cover_image,business.slogan,business.general_info,business.regular_hours,business.extra_phones,business.services_products,business.payment,business.price_range,business.aka,business.other_links,business.other_information,business.review_1_name,business.review_1_date,business.review_1_rating,business.review_1_text,business.review_2_name,business.review_2_date,business.review_2_rating,business.review_2_text
3819512,1241171,"2020-09-27 04:30:54","Elizabethtown Veterinary Hospital",http://www.elizabethtownveterinaryhospital.com,vegasdvm@hotmail.com,"(910) 862-3000","4629 Us 701 Hwy S",Clarkton,NC,28433,"4629 Us 701 Hwy S,Clarkton,NC 28433","Pet Stores, Cemeteries, Fence Materials, Funeral Supplies & Services, Pet Cemeteries & Crematories, Pet Grooming, Pet Services, Pet Sitting & Exercising Services, Veterinarian Emergency Services, Veterinarians, Veterinary Labs",4,"1 Review",A+,34.50301,-78.63127,https://i1.ypcdn.com/blob/8045821c1a21dd022340d6f0dd2e4e61952aa7f9_100x100_crop.jpg?f832250,"Enhancing The Quality Of Life For Your Pets.","The Elizabethtown Veterinary Hospital is located in Clarkton, NC. Our patients include dogs, cats, birds, and rabbits. We are committed to providing quality, friendly care to the pets of Bladen and Columbus counties. Dr. Douglas Gensel and team members are deeply committed to the health and well-being of your pet. He specializes in surgery, geriatrics, dentistry, and preventive care for all pets. Stop in today or call for an appointment.","Mon - Fri: 8:00 am - 7:00 pm Sat: 8:00 am - 12:00 am Sun Closed",,,"amex, mastercard, all major credit cards, discover, visa",,,http://www.elizabethtownveterinaryhospital.com,"Parking: Lot",elizabethtownveterinaryhospital,09/19/2012,four,"I would not take my pets anywhere else. The veterinarians are compassionate and knowledgable. The hospital looks wonderful with the new technology and exam rooms. I feel welcomed by the personal there too. Thanks for being part of Bladen County, we definitely need you in our town. Thanks.",,,,
3820612,1241404,"2020-09-27 04:30:54","Zimmer's Grooming Salon",http://www.zimmersdoggroomingportland.com,dawgonit@hotmail.com,"(503) 285-4264","7437 N Leavitt Ave",Portland,OR,97203,"7437 N Leavitt Ave,Portland,OR 97203","Pet Stores, Fence Materials, Pet Grooming, Pet Services",3,"10 Reviews",,45.59043,-122.75383,https://i1.ypcdn.com/blob/7e0433e57e6bf78971f432776fbe7272fef026d9_100x100_crop.jpg?f832250,"If Your Dog Is Unbecoming To You, You Should Be Coming To Us.","Zimmer's Grooming Salon is located in St. Johns neighborhood in Portland, OR, a full service dog grooming salon, providing the absolute finest care and quality for your canine companion, we treat each dog as if they were part of our own family. With over 36 years professional grooming experience, our knowledgeable groomers knows just how to making each visit enjoyable for your pet. Our services include bathing, trimming, drying, brushing, styling, flea & Tick dips, ear cleaning, and nail clipping. Call us today to make an appointment or stop by and speak to our groomers. We look forward to seeing you and your pet.","Mon Closed Tue - Sat: 7:00 am - 4:00 pm Sun Closed",,,"cash, check",,,http://www.zimmersdoggroomingportland.com,,tbushard,12/10/2010,five,"Kelly and her staff are awesome. Before finding Zimmers I tried several other groomers and wasn't pleased. Finally I found Kelly and I have been with her for the past 15 years. The whole staff is excellent. I have two standard poodles and they love to get groomed. They come home happy puppies and I love the work they do. Excellent!",pishposhapplesauce,05/01/2010,one,"I waited to write this review until my puppy could have another grooming experience at a different establishment in order to be as objective as possible. Four months ago, I took my then 5-month old puppy in to have his first groom. I emphasized how much I hoped that his first experience would be a positive one, and the puppy I dropped off was confident, happy, and used to being brushed every day, and nails clipped once a week. I was told when I picked him up that he had been very well behaved, and that it was obvious he had been groomed frequently at home. However, the dog I picked up was a nervous wreck: he hid under the dining table for the next two days, he would not allow any of the family to approach him, pet him, nor play with him. We were devastated, and could not understand what had happened during his grooming that would have elicited such a dramatic, negative response. It was as though we had brought home a completely different dog. I even took him to the vet to have him looked at, so complete and distressing was this total change in personality. The vet found him to be in good health. Over the next weeks he gradually came around to his old self, but it took much patience and gentle handling. Today I took him to another local groomer, explained what had happened at Zimmer's, and stayed with my dog while he was groomed. He enjoyed his grooming experience, was tolerant of the clippers, the scissors, the dryer, et al, and left the shop with his head held high and wagging his tail. While I won't ever know exactly what happened when I dropped off my dog at Zimmer's, I am left to conclude that, at best, the staff there treated my dog very roughly indeed."
3822418,1241752,"2020-09-27 04:30:54","Pet Stop",http://www.petstopfl.com,petstopcallahan@yahoo.com,"(904) 879-1171","541763 Us Highway 1",Callahan,FL,32011,"541763 Us Highway 1,Callahan,FL 32011","Pet Stores, Fence-Sales, Service & Contractors, Pet Food, Pet Grooming, Pet Supplies & Foods-Wholesale & Manufacturers",,,,30.54941,-81.82039,,,,"Mon: 9:00 am - 10:00 pm Tue - Sat: 9:00 am - 7:00 pm Sun Closed",,,"check, amex, discover, all major credit cards, mastercard, visa",,"Pet Stop Callahan LLC Pet Stop Callahan Pet Stop & SWR","http://www.petstopfl.com http://petstop.com http://www.petstopfl.com/location","Parking: Lot, Free Wheelchair Accessible: Yes Specialties: Fish, Birds, Amphibians & Reptiles",,,,,,,,
3827185,1242682,"2020-09-27 04:30:57","Bushnell Animal Clinic",http://www.bushnellanimalclinic.com,bushnellanimalclinic@yahoo.com,"(352) 504-0942","5899 SW 18th Ter",Bushnell,FL,33513,"5899 SW 18th Ter,Bushnell,FL 33513","Veterinary Clinics & Hospitals, Fence Materials, Pet Grooming, Pet Services, Pet Sitting & Exercising Services, Pet Stores, Veterinarians",,,,28.67731,-82.13524,,"We speak animal.","We speak animal at Bushnell Animal Clinic in Bushnell, FL. When your friend is feeling under the weather, bring him or her to us. We take care of animals large and small. Conveniently located across from Walmart, our office is staffed by courteous animal-lovers like yourself. You can trust your pet to our experienced care. We are a full-service veterinary office, offering services such as: В• Boarding В• Grooming В• Surgery and Medicine We'll talk to your dog or cat and diagnose the problem in no time. Please call or stop by today! Please note that emergency-service is based on Doctor availability.","Mon - Fri: 8:00 am - 5:00 pm",,,"visa, cash, debit",,,http://www.bushnellanimalclinic.com,,,,,,,,,
3832124,1243644,"2020-09-27 04:30:59","Pet Paradise",http://petparadisepueblo.com,,"(719) 242-9569","1115 Pueblo Boulevard Way",Pueblo,CO,81005,"1115 Pueblo Boulevard Way,Pueblo,CO 81005","Pet Food, Dog Day Care, Fence Materials, Kennels, Pet Boarding & Kennels, Pet Grooming, Pet Services, Pet Sitting & Exercising Services, Pet Stores, Pet Training",3,"4 Reviews",,38.24583,-104.66358,https://i1.ypcdn.com/blob/7777362c9c4cc3d0ce984aec4d0af6cbc29d953e_100x100_crop.jpg?f832250,"Huge, Unique Full-Service Paradise","Pet Paradise is a full-service pet shop in Pueblo, CO. We have proudly been serving the Pueblo area since 1974. Our staff offers years of experience, so you can be confident that your questions and concerns will be answered accurately. Pet Paradise stocks a wide selection of freshwater and saltwater fish, aquatic plants, and invertebrates. Many of these fish are hard to find, exotic specimens that will not be seen at any other store in Colorado! If you are interested in starting a Koi pond of your own, stop in and talk to our staff about getting started. We offer a full line of pet and aquarium supplies. We stock the major dog and pet food brands. Pet Paradise is your one stop shop for all your pet supply and grooming needs. Come and see our unique living atrium.","Mon - Fri: 9:00 am - 7:00 pm Sat: 9:00 am - 5:00 pm Sun: 11:00 am - 5:00 pm","Phone: (719) 564-6291",,"discover, master card",,,http://petparadisepueblo.com,"Specialties: Dogs & Puppies, Fresh Water Fish, Exotic Pets, Salt Water Fish, Domestic, Birds, Fish & Invertebrates, Amphibians & Reptiles, Tropical Fish, Gold Fish, Koi, Cats & Kittens Services: Pond Installation, Pond Construction","Sarah K.","Edited: 10/15/2016",one,"Took my dog in for a bath and haircut. When we picked him up, staff was very sketchy about bringing my dog, Arnie out. When he came out, his eye was bloody and his left side of his face was swollen. They said it was from him straining on his collar while taking a bath. We didn't buy it. They said if it didn't look better in 48 hours, to call them and they would take them to their vet. We weren't comfortable with that. our dog looked miserable. So we took him to our vet in Colorado Springs whom we have gone to for a while now, and we trust. They took a look at Arnie. Realized he had bruising throughout his eye, his ear, and his mouth. Determined there was no way that was from ""straining"" on his collar. Livid, realizing someone had HIT my dog, I called pet paradise and talked to grooming manager. She said ""it happened while they were blow drying him"". Story had changed. And so basically, she allowed us to believe someone hit him with the blow dryer. LONG STORY SHORT-- We urge you to NOT GO TO PET PARADISE. We are pressing charges, and we were told they got accused of this not too long ago. Awful.","Kim L.",11/10/2014,five,"What a wonderful place to shop!! Very friendly and knowledgeable!! Everything I was looking for and more... will be doing all my pet shopping needs here!"
3833196,1243855,"2020-09-27 04:31:00","Pet Stop",http://petstop.com,bohlmanj@petstop1.com,"(909) 987-7809","9128 Foothill Blvd","Rancho Cucamonga",CA,91730,"9128 Foothill Blvd,Rancho Cucamonga,CA 91730","Pet Stores, Fence-Sales, Service & Contractors, Pet Boarding & Kennels, Pet Food, Pet Grooming, Pet Services, Pet Sitting & Exercising Services, Pet Supplies & Foods-Wholesale & Manufacturers, Tropical Fish",4,"1 Review",A,34.10675,-117.60609,https://i1.ypcdn.com/blob/d5b5733436016ba63abaddcf35ef0739db2c9be9_100x100_crop.jpg?f832250,,,"Mon - Sat: 11:00 am - 6:00 pm Sun: 1:00 pm - 4:00 pm",,,"mastercard, all major credit cards, visa, discover, amex",,"The Pet Stop The Pet Shop",http://petstop.com,"Parking: On Site","Robin S.",03/30/2018,four,"We were very blessed & got very lucky to add this adorable baby to our family. We have named him, В“Lucky?В”. Because, we are lucky to have him.",,,,
3838510,1244897,"2020-09-27 04:31:06","Pet Food Shoppe",http://www.petfoodshoppe.com,petfoodshoppe@verizon.net,"(774) 419-1353","6 Harding St",Lakeville,MA,02347,"6 Harding St,Lakeville,MA 02347","Bird Feeders & Houses, Dog & Cat Grooming & Supplies, Feed Dealers, Fence Materials, Pet Food, Pet Grooming, Pet Services, Pet Stores",,,,41.90206,-70.98494,https://i1.ypcdn.com/blob/d2ab88d77ce5374038176ce431c0691c8d0b96be_100x100_crop.jpg?f832250,"""Where your pet eats better than you do!""","In 1980, the retail store that is now known as the Pet Food Shoppe made its big debut. Since then, weve expanded three times and have added thousands of products. You will find many other products and treats for your small animals, farm animals, fish, reptiles, and even your wild or domestic feathered friends at the Pet Food Shoppe. Call today for more information.","Mon - Fri: 7:30 am - 6:30 pm Sat: 8:00 am - 5:00 pm Sun: 9:00 am - 4:00 pm",,,"amex, check, discover, visa, debit, master card",,,http://www.petfoodshoppe.com,"Parking: Lot",,,,,,,,
3842713,1245694,"2020-09-27 04:31:11","Feed Depot Heiskell's",http://www.heiskellsfeeddepot.com,heiskells@yahoo.com,"(559) 627-3333","2703 E Noble Ave",Visalia,CA,93292,"2703 E Noble Ave,Visalia,CA 93292","Pet Stores, Feed Dealers, Fence Materials, Pet Grooming, Pet Services",5,"1 Review",A+,36.32691,-119.26279,,,"Heiskell's Feed Depot has proudly served the residents of Visalia, California with all their Pet and Livestock needs for the past 20 years. We are privately held and professionally managed by J.D. Heiskell & Co. Our focus is to provide customers with excellent service, brand products at the best price, and to maintain a strong partnership with our local community.","Mon - Fri: 9:00 am - 7:00 pm Sat: 9:00 am - 5:00 pm Sun: 11:00 am - 5:00 pm",,,"all major credit cards, amex, discover, master card, visa",,,"http://www.heiskellsfeeddepot.com http://www.heiskell.com","Parking: Lot Specialties: Dogs & Puppies, Dog Sales, Puppy Sales, Cats & Kittens","Debbie C.",03/24/2017,five,"I've been shopping at Heiskells Feed Depot for the last 15 years for everything canine, feline, and finch! They are so knowledgeable and courteous in every way!!!",,,,
3853649,1247759,"2020-09-27 04:31:24","Mudpuppy Grooming",http://www.mudpuppygrooming.com,celiasteves@gmail.com,"(719) 544-9034","440 Santa Fe Dr",Pueblo,CO,81006,"440 Santa Fe Dr,Pueblo,CO 81006","Pet Services, Fence Materials, Pet Boarding & Kennels, Pet Grooming, Pet Stores",5,"3 Reviews",A+,38.2499,-104.60175,,"You might find cheaper, but you won't find better!!","Mudpuppy Grooming offers family love and care for your pets in Pueblo and surrounding areas with free pick up and delivery. We do not use tranquilizers or sedatives on your pet. All breeds welcome large or small. We are a member of the Professional Grooming Association and have been serving the community for over 24 years. *Our credentials are exemplary as proven by our professional services for each pet we groom. *If you need your pet groomed or you want to buy or sell a puppy, we're here to help. All you need to do is give us a call and we'll take care of the rest. In the mean time, feel free to take a look around our site to learn more about our services. If you have any questions or concerns, please contact us at any time. We also buy and sell puppies. Visa, MasterCard and Discover accepted.","Mon - Sat: 9:00 am - 5:00 pm Sun Closed",,,"master card, discover, visa",,,http://www.mudpuppygrooming.com,"Parking: Lot Specialties: Dogs & Puppies, Dog Sales, Puppy Sales","Desiree S.",05/30/2017,five,"Mudpuppy did an excellent job on my 3 rat terriers. My girls even got their nails painted. Thank you mudpuppy grooming. I will continue to take my dogs here.","Kelly A.",10/05/2016,five,"I LOVE Mudpuppy! The ONLY groomer for my LilBits! Just wish I could show you how she looks after her cut!"
3857630,1248555,"2020-09-27 04:31:33","Mesa Veterinary Clinic",http://www.mesavetclinic.com,vetmesa@aol.com,"(719) 542-6075","1124 20th Ln",Pueblo,CO,81006,"1124 20th Ln,Pueblo,CO 81006","Pet Stores, Fence Materials, Pet Grooming, Pet Services, Pet Specialty Services, Veterinarian Emergency Services, Veterinarians, Veterinary Clinics & Hospitals, Veterinary Specialty Services",5,"1 Review",A+,38.2446,-104.5653,https://i1.ypcdn.com/blob/37757460a20316a252949e151f7ab86bda1627c5_100x100_crop.jpg?f832250,"Compassion, respect, integrity and high quality veterinary services","Mesa Veterinary Clinic is a full-service large and small veterinary facility, located in Pueblo, CO. The professional and courteous staff at Mesa Veterinary Clinic seeks to provide the best possible medical, surgical, and dental care for their highly-valued patients and have served the community since 1975. We are committed to promoting responsible pet ownership, preventative health care and health- related education opportunities for our clients and our community. Mesa Veterinary Clinic strives to offer excellence in veterinary care to Pueblo, CO and surrounding areas. Please take a moment to contact us today to learn more about our veterinary practice and to find out more information about how Mesa Veterinary Clinic can serve the needs of you and your animals.","Mon - Fri: 7:30 am - 5:30 pm Sat: 7:30 am - 12:00 pm Sun Closed",,,"amex, discover, visa, mastercard",,,http://www.mesavetclinic.com,"Parking: Lot, Free Wheelchair Accessible: Yes Specialties: Farm Animals, Acupuncture, Ranch Animals, Cat Vets.Dog Vets.Exotic Pet Vets.Large Animal Vets.Pot Belly Pigs.Rabbit Vets.Reptile Vets, Pocket Pets, Dentistry, Livestock, Small Animals, Large Animals","Kathy W.",03/05/2015,five,"Very profesional, friendly, and concerned to meet my dog's needs. Great experience. Affordable.",,,,
3863852,1249764,"2020-09-27 04:31:34","Healthy Hounds & Fat Cats",http://healthyhoundsandfatcats.com,lacraig@hotmail.com,"(970) 335-9510","21738 Highway 160 # Us",Durango,CO,81303,"21738 Highway 160 # Us,Durango,CO 81303","Pet Stores, Fence Materials, Pet Grooming, Pet Services, Pet Sitting & Exercising Services",,,A+,37.26961,-107.88975,,"Your Friendly Pet Store","At Healthy Hounds and Fat Cats, located in Durango, Colorado, we care about your pets. We're a full service pet supply store offering everything from retail supplies to doggie day care, kenneling and pet grooming. In our retail store, we offer a wide range of food with well-known brand names in addition to our natural and raw foods. We also have a wide selection of toys, treats, collars, and other items for dogs & cats. As far as pet grooming, we have a self-serve dog wash as well as our full service salon. We'll also watch your dogs for you while you're out of town, at work, or just out playing for the day. And, don't worry, we take cats, too, in their own kitty condos.","Mon - Fri: 8:00 am - 6:00 pm Sat: 9:00 am - 5:00 pm Sun: 11:00 am - 5:00 pm",,,check,,,http://healthyhoundsandfatcats.com,"Parking: Lot Specialties: Poultry, Chickens",,,,,,,,
3865007,1250008,"2020-09-27 04:31:40","Pet Stop",http://www.petstop.com,,"(360) 794-6888","15206 Woods Creek Rd",Monroe,WA,98272,"15206 Woods Creek Rd,Monroe,WA 98272","Pet Stores, Fence-Sales, Service & Contractors, Pet Food, Pet Grooming, Pet Supplies & Foods-Wholesale & Manufacturers",5,"1 Review",A+,47.85952,-121.96621,,,,"Mon - Sat: 9:00 am - 6:00 pm Sun: 10:00 am - 4:00 pm","Phone: (360) 794-4167",,"check, financing available",,"The Pet Stop Pet Stop, The",http://www.petstop.com,,mom123456789,10/22/2007,five,"it is great but need to put web site on yellowpages",,,,
3872077,1251395,"2020-09-27 04:31:49","A Paw Spa",http://www.apawspalittleton.com,apawspa@apawspalittleton.com,"(720) 588-3150","5950 S Platte Canyon Rd",Littleton,CO,80123,"5950 S Platte Canyon Rd,Littleton,CO 80123","Pet Stores, Dog & Cat Furnishings & Supplies, Dog & Cat Grooming & Supplies, Fence Materials, Pet Grooming, Pet Services, Pet Sitting & Exercising Services","4,5","22 Reviews",A+,39.60857,-105.03687,https://i1.ypcdn.com/blob/bebb0c6c78b5449579ab807abd94eee8507b4e83_100x100_crop.jpg?f832250,"Denver Metro, Littleton, South Jeffco, Ken Caryl","A Paw Spa is the pampering pet care center conveniently located in Littleton, Colo. Are you looking for a place to pamper your pooch? Want to take care of your cat? Are you looking for dog shampoo, dog jewelry or dog treats? You can end your search because we have it all at A Paw Spa.Our services consist of:?В€? Bathing?В€? Boarding?В€? Conditioning?В€? Nail Clipping?В€? Shampooing?В€? WashingAll dogs are welcome here at A Paw Spa. We treat your dog like royalty and our treatments will never include chemicals that will harm your dog. We take great pride in the fact that your dog is safe and we will give your dog the best treatments a dog can get. Our main goals are for your dog to enjoy its stay and to encourage you to come back again.Our prices are affordable. Please visit our web site for more information. Your pet deserves the best, and we only offer the best.Call us A Paw Spa today, and get the quality care your pet deserves.","Mon Closed Sat: 8:00 am - 6:00 pm Sun Closed","Phone: (303) 416-2887",,"debit, check, cash, all major credit cards",,,http://www.apawspalittleton.com,"Parking: Lot","Dj S.",09/22/2015,five,"Grrrr8!!! Rina and her staff do a great job of working with the difficult dogs that we own. One is an older Cocker Spaniel who is very set in HIS ways. The other is a very spoiled Shih-Tzu who thinks HE has to have his way all the time. Neither like having their nails trimmed. But most of all our Shih-Tzu does not like having his face washed, combed or groomed. With all this in mind, they both look amazing when they get picked up. I have never felf uncomfortable leaving my ""BABIES"" with Rina and her staff.","Dawn A.",12/01/2014,five,"I'm writing this review today to explain how impressive Rina's grooming business is. Herself & her staff are so patient with our pets! Her salon is always sparking & she always goes the extra mile, fashioning bandanas for all pets groomed in her salon. I always refer friends or family when I see a four legged friend who would benefit from a trip to A Paw Spa :) Our pets & all of her clients fully & completely trust Rina & her crew with our precious little fur babies. That's very hard to come by!"
3872762,1251521,"2020-09-27 04:31:49","Animal Connection, LLC",https://api.superpages.com/xml/search?SRC=ypintfeed&subaffiliate=DXC&PGID=e02.7182.8182845904523&SPGID=1580167429722.36d740c3&ADID=11636477&DEST=http%3A%2F%2Fanimalconnectionva.mydex.com%2FBldqkZLgv14&C=fence&T=Charlottesville&S=VA&PH=(434)%20202-5308&FL=url&TL=off&position=7&PS=30&PI=1&Results=FEED_CLCK&uid=36d740c3-593b-4d2a-aeb0-b7f3c398ab9b&REF=&IP=186.236.3.139&UserAgent=Mozilla%2F5.0%20(Macintosh%3B%20Intel%20Mac%20OS%20X%2010_10_5)%20AppleWebKit%2F603.3.8%20(KHTML%2C%20like%20Gecko)%20Version%2F10.1.2%20Safari%2F603.3.8,TalkToUs@AnimalConnectionVA.com,"(434) 202-5308","1701 Allied St",Charlottesville,VA,22903,"1701 Allied St,Charlottesville,VA 22903","Pet Stores, Fence Materials, Pet Grooming, Pet Services",5,"1 Review",,38.04107,-78.47811,,"Natural Pet Food and Supplies","Animal Connection is the only natural pet store in Charlottesville, VA. We have over 500 varieties of all natural, organic pet foods and treats, supplements, holistic remedies and eco-friendly accessories, and green pet gear. Our products and services include: В• Relief from fleas, flies, ticks, and skeeters without harmful chemicals В• Solutions for skin problems and seasonal allergies В• Dental care without anesthesia В• Expert advice, nutritional/behavioral consulting В• Stress-free, gentle grooming for all breeds including hand stripping В• Wonderful dog wear, tough USA made toys, gifts, and apparel Animal Connection will help you find the right nutritional program for your dog or cat, with products for any age, breed, lifestyle and budget. Call Animal Connection today for more information.","Mon - Fri: 10:00 am - 5:30 pm Sat: 9:00 am - 3:30 pm",,,"master card, visa, check, debit",,,"http://AnimalConnectionVA.com http://www.animalconnectionva.com","Specialties: Dogs & Puppies, Puppy Sales, Dog Sales, Allergies",kmonson01,10/05/2005,five,"Patty is so helpful! I was never using homeopathic options for my two dogs until I stubled into this store one day. She is a wealth of information for issues that you may be having with your dog and has a wonderful selection of toys and accessories for the four legged members of your family!",,,,