business_x_category.id,business.id,business.ts,business.business_name,business.home_page,business.email_address,business.phone,business.street,business.city,business.state,business.zip_code,business.full_address,business.category,business.rating,business.number_of_reviews,business.bbb_rating_or_license,business.latitude,business.longitude,business.cover_image,business.slogan,business.general_info,business.regular_hours,business.extra_phones,business.services_products,business.payment,business.price_range,business.aka,business.other_links,business.other_information,business.review_1_name,business.review_1_date,business.review_1_rating,business.review_1_text,business.review_2_name,business.review_2_date,business.review_2_rating,business.review_2_text
17106235,2404527,"2020-09-27 06:24:08","Suburban Propane",http://www.suburbanpropane.com/location/pasorobles-ca/?utm_source=yp&utm_medium=iyp&utm_campaign=yp_csc&utm_term=406,csc1647@suburbanpropane.com,"(805) 257-0015","3455 Theatre Dr","Paso Robles",CA,93446,"3455 Theatre Dr,Paso Robles,CA 93446","Propane & Natural Gas-Equipment & Supplies, Fuel Oils, Gas Companies, Gas Lines-Installation & Repairing, Gas-Liquefied Petroleum-Bottled & Bulk, Internet Products & Services, Oil Refiners, Oils-Fuel-Wholesale & Manufacturers, Petroleum Oils, Petroleum Products-Wholesale & Manufacturers, Propane & Natural Gas, Public Utility Consultants, Transportation Services, Utility Contractors",,,,35.57232,-120.70014,,"Our Business Is Customer Satisfaction","Suburban Propane is a nationwide distributor of propane, fuel oil and related products and services, serving the energy needs of residential, commercial, and agricultural customers in 41 states.","Mon - Fri: 8:00 am - 5:00 pm Sat - Sun Closed","Fax: (805) 238-3011 Toll Free - 24/7: (800) 776-7263",,"amex, discover, master card, visa, check",,,http://www.suburbanpropane.com/location/pasorobles-ca/,,,,,,,,,
17106482,2404627,"2020-09-27 06:24:08","Suburban Propane",http://www.suburbanpropane.com/location/lakestevens-wa/?utm_source=yp&utm_medium=iyp&utm_campaign=yp_csc&utm_term=1024,,"(425) 595-2254","2317 N Machias Rd","Lake Stevens",WA,98258,"2317 N Machias Rd,Lake Stevens,WA 98258","Petroleum Oils, Fuel Oils, Gas Companies, Gas-Liquefied Petroleum-Bottled & Bulk, Industrial Equipment & Supplies-Wholesale, Internet Products & Services, Propane & Natural Gas, Propane & Natural Gas-Equipment & Supplies, Transportation Services",,,,48.01836,-122.052,,"Our Business Is Customer Satisfaction","Suburban Propane is a nationwide distributor of propane, fuel oil and related products and services, serving the energy needs of residential, commercial, and agricultural customers in 41 states.","Mon - Fri: 8:00 am - 5:00 pm Sat - Sun Closed","Fax: (425) 334-9018 Toll Free - 24/7: (800) 776-7263",,"amex, discover, master card, visa, check",,,http://www.suburbanpropane.com/location/lakestevens-wa/,,,,,,,,,
17106793,2404758,"2020-09-27 06:24:08","Suburban Propane",http://www.suburbanpropane.com/location/pocatello-id/?utm_source=yp&utm_medium=iyp&utm_campaign=yp_csc&utm_term=335,csc1366@suburbanpropane.com,"(208) 904-0602","2868 Garrett Way",Pocatello,ID,83201,"2868 Garrett Way,Pocatello,ID 83201","Gas-Liquefied Petroleum-Bottled & Bulk, Fuel Oils, Gas Companies, Gas Lines-Installation & Repairing, Internet Products & Services, Oils-Fuel-Wholesale & Manufacturers, Petroleum Oils, Petroleum Products-Wholesale & Manufacturers, Propane & Natural Gas, Propane & Natural Gas-Equipment & Supplies, Transportation Services, Utility Contractors, Water Heaters",,,,42.8876,-112.47175,,"Our Business Is Customer Satisfaction","Suburban Propane is a nationwide distributor of propane, fuel oil and related products and services, serving the energy needs of residential, commercial, and agricultural customers in 41 states.","Mon - Fri: 8:00 am - 5:00 pm Sat - Sun Closed","Fax: (208) 232-0668 Toll Free - 24/7: (800) 776-7263",,"check, amex, discover, master card, visa",,,http://www.suburbanpropane.com/location/pocatello-id/,,,,,,,,,
17106931,2404827,"2020-09-27 06:24:08","Suburban Propane",http://www.suburbanpropane.com/location/senatobia-ms/?utm_source=yp&utm_medium=iyp&utm_campaign=yp_csc&utm_term=887,contactus@suburbanpropane.com,"(662) 612-0116","5468 Highway 51 N",Senatobia,MS,38668,"5468 Highway 51 N,Senatobia,MS 38668","Petroleum Oils, Fuel Oils, Gas Companies, Gas-Liquefied Petroleum-Bottled & Bulk, Internet Products & Services, Major Appliances, Oils-Fuel-Wholesale & Manufacturers, Petroleum Products-Wholesale & Manufacturers, Propane & Natural Gas, Propane & Natural Gas-Equipment & Supplies, Small Appliances, Transportation Services",,,,34.63335,-89.96819,,"Our Business Is Customer Satisfaction","Suburban Propane is a nationwide distributor of propane, fuel oil and related products and services, serving the energy needs of residential, commercial, and agricultural customers in 41 states.","Mon - Fri: 8:00 am - 5:00 pm Sat - Sun Closed","Fax: (662) 562-7218 Toll Free - 24/7: (800) 776-7263",,"check, amex, discover, master card, visa",,,http://www.suburbanpropane.com/location/senatobia-ms/,,,,,,,,,
17107705,2405144,"2020-09-27 06:24:11","Suburban Propane",http://www.suburbanpropane.com/location/portland-me/?utm_source=yp&utm_medium=iyp&utm_campaign=yp_csc&utm_term=246,ContactUs@suburbanpropane.com,"(207) 358-3743","3a Thompsons Pt",Portland,ME,04102,"3a Thompsons Pt,Portland,ME 04102","Propane & Natural Gas-Equipment & Supplies, Fuel Oils, Gas Companies, Gas-Liquefied Petroleum-Bottled & Bulk, Internet Products & Services, Major Appliances, Oils-Fuel-Wholesale & Manufacturers, Petroleum Oils, Petroleum Products-Wholesale & Manufacturers, Propane & Natural Gas, Small Appliances, Transportation Services",,,,43.65355,-70.29192,,"Our Business Is Customer Satisfaction","Suburban Propane is a nationwide distributor of propane, fuel oil and related products and services, serving the energy needs of residential, commercial, and agricultural customers in 41 states.","Mon - Fri: 8:00 am - 5:00 pm Sat - Sun Closed","Fax: (207) 775-6292 Toll Free - 24/7: (800) 776-7263",,"amex, discover, visa, check, master card",,,http://www.suburbanpropane.com/location/portland-me/,,,,,,,,,
17108729,2405599,"2020-09-27 06:24:11","Suburban Propane",http://www.suburbanpropane.com/location/somerset-pa/?utm_source=yp&utm_medium=iyp&utm_campaign=yp_csc&utm_term=156,ContactUs@suburbanpropane.com,"(814) 701-3698","10777 Somerset Pike",Somerset,PA,15501,"10777 Somerset Pike,Somerset,PA 15501","Propane & Natural Gas-Equipment & Supplies, Fuel Oils, Gas Companies, Gas-Liquefied Petroleum-Bottled & Bulk, Internet Products & Services, Oils-Fuel-Wholesale & Manufacturers, Petroleum Oils, Petroleum Products-Wholesale & Manufacturers, Propane & Natural Gas, Transportation Services",,,,40.06695,-79.07691,,"Our Business Is Customer Satisfaction","Suburban Propane is a nationwide distributor of propane, fuel oil and related products and services, serving the energy needs of residential, commercial, and agricultural customers in 41 states.","Mon - Fri: 8:00 am - 5:00 pm Sat - Sun Closed","Fax: (814) 443-4784 Toll Free - 24/7: (800) 776-7263",,"amex, discover, master card, visa, check",,,http://www.suburbanpropane.com/location/somerset-pa/,,,,,,,,,
17110090,2406209,"2020-09-27 06:24:20","Suburban Propane",http://www.suburbanpropane.com/location/asheville-nc/?utm_source=yp&utm_medium=iyp&utm_campaign=yp_csc&utm_term=55,ContactUs@suburbanpropane.com,"(828) 484-1844","12 Mulvaney St",Asheville,NC,28803,"12 Mulvaney St,Asheville,NC 28803","Petroleum Oils, Fuel Oils, Gas Companies, Gas-Liquefied Petroleum-Bottled & Bulk, Internet Products & Services, Oil Refiners, Oils-Fuel-Wholesale & Manufacturers, Petroleum Products-Wholesale & Manufacturers, Propane & Natural Gas, Propane & Natural Gas-Equipment & Supplies, Transportation Services",,,,35.57386,-82.52575,,"Our Business Is Customer Satisfaction","Suburban Propane is a nationwide distributor of propane, fuel oil and related products and services, serving the energy needs of residential, commercial, and agricultural customers in 41 states.","Mon - Fri: 8:00 am - 5:00 pm Sat - Sun Closed","Fax: (828) 255-8834 Toll Free - 24/7: (800) 776-7263",,"visa, discover, amex, check, master card",,,http://www.suburbanpropane.com/location/asheville-nc/,,,,,,,,,
17110828,2406531,"2020-09-27 06:24:20","Suburban Propane",http://www.suburbanpropane.com/location/linwood-mi/?utm_source=yp&utm_medium=iyp&utm_campaign=yp_csc&utm_term=994,,"(989) 308-2069","7489 E Monroe Rd",Breckenridge,MI,48615,"7489 E Monroe Rd,Breckenridge,MI 48615","Petroleum Oils, Fertilizers, Fuel Oils, Gas Companies, Gas Lines-Installation & Repairing, Gas-Liquefied Petroleum-Bottled & Bulk, Internet Products & Services, Landscaping & Lawn Services, Oils-Fuel-Wholesale & Manufacturers, Petroleum Products-Wholesale & Manufacturers, Propane & Natural Gas, Propane & Natural Gas-Equipment & Supplies, Transportation Services, Utility Contractors",,,,43.40875,-84.46046,,"Our Business Is Customer Satisfaction","Suburban Propane is a nationwide distributor of propane, fuel oil and related products and services, serving the energy needs of residential, commercial, and agricultural customers in 41 states.","Mon - Fri: 8:00 am - 5:00 pm Sat - Sun Closed","Fax: (989) 842-3078 Toll Free - 24/7: (800) 776-7263",,"amex, discover, master card, visa, check",,,http://www.suburbanpropane.com/location/linwood-mi/,,,,,,,,,
17111239,2406712,"2020-09-27 06:24:20","Suburban Propane",http://www.suburbanpropane.com/location/pensacola-fl/?utm_source=yp&utm_medium=iyp&utm_campaign=yp_csc&utm_term=846,hsasser@suburbanpropane.com,"(850) 777-3591","9550 Pensacola Blvd",Pensacola,FL,32534,"9550 Pensacola Blvd,Pensacola,FL 32534","Propane & Natural Gas-Equipment & Supplies, Electric Companies, Fireplaces, Fuel Oils, Gas Companies, Gas Lines-Installation & Repairing, Gas-Liquefied Petroleum-Bottled & Bulk, Internet Products & Services, Oils-Fuel-Wholesale & Manufacturers, Petroleum Oils, Petroleum Products-Wholesale & Manufacturers, Propane & Natural Gas, Transportation Services, Utility Contractors",,,,30.53671,-87.27778,,"Our Business Is Customer Satisfaction","Suburban Propane is a nationwide distributor of propane, fuel oil and related products and services, serving the energy needs of residential, commercial, and agricultural customers in 41 states.","Mon - Fri: 8:00 am - 5:00 pm Sat - Sun Closed","Fax: (850) 477-8310 Toll Free - 24/7: (800) 776-7263",,"amex, check, discover, master card, visa",,,http://www.suburbanpropane.com/location/pensacola-fl/,,,,,,,,,
17111430,2406800,"2020-09-27 06:24:20","Suburban Propane",http://www.suburbanpropane.com/location/reisterstown-md/?utm_source=yp&utm_medium=iyp&utm_campaign=yp_csc&utm_term=152,,"(443) 650-3041","13944 Old Hanover Rd",Reisterstown,MD,21136,"13944 Old Hanover Rd,Reisterstown,MD 21136","Propane & Natural Gas-Equipment & Supplies, Fuel Oils, Gas Companies, Gas-Liquefied Petroleum-Bottled & Bulk, Industrial Oils, Internet Products & Services, Oils-Fuel-Wholesale & Manufacturers, Petroleum Oils, Petroleum Products-Wholesale & Manufacturers, Propane & Natural Gas, Transportation Services",,,,39.50755,-76.82964,,"Our Business Is Customer Satisfaction","Suburban Propane is a nationwide distributor of propane, fuel oil and related products and services, serving the energy needs of residential, commercial, and agricultural customers in 41 states.","Mon - Fri: 8:00 am - 5:00 pm Sat - Sun Closed","Fax: (410) 861-8435 Toll Free - 24/7: (800) 776-7263",,"amex, check, discover, master card, visa",,,http://www.suburbanpropane.com/location/reisterstown-md/,,,,,,,,,
17112619,2407331,"2020-09-27 06:24:26","Suburban Propane",http://www.suburbanpropane.com/location/homer-ak/?utm_source=yp&utm_medium=iyp&utm_campaign=yp_csc&utm_term=503,ContactUs@suburbanpropane.com,"(866) 203-8413","60970 E End Rd",Homer,AK,99603,"60970 E End Rd,Homer,AK 99603","Propane & Natural Gas-Equipment & Supplies, Fuel Oils, Gas Companies, Gas-Liquefied Petroleum-Bottled & Bulk, Internet Products & Services, Oils-Fuel-Wholesale & Manufacturers, Petroleum Oils, Petroleum Products-Wholesale & Manufacturers, Propane & Natural Gas, Transportation Services",,,,59.66558,-151.46193,,"Our Business Is Customer Satisfaction","Suburban Propane is a nationwide distributor of propane, fuel oil and related products and services, serving the energy needs of residential, commercial, and agricultural customers in 41 states.","Mon - Fri: 8:00 am - 5:00 pm Sat - Sun Closed","Fax: (907) 235-6422 Toll Free - 24/7: (800) 776-7263",,"check, amex, discover, master card, visa",,,http://www.suburbanpropane.com/location/homer-ak/,,,,,,,,,
17113291,2407629,"2020-09-27 06:24:27","Suburban Propane",http://www.suburbanpropane.com/location/goshen-oh/?utm_source=yp&utm_medium=iyp&utm_campaign=yp_csc&utm_term=61,,"(513) 297-6195","1980 State Route 28",Goshen,OH,45122,"1980 State Route 28,Goshen,OH 45122","Propane & Natural Gas-Equipment & Supplies, Fuel Oils, Gas Companies, Gas-Liquefied Petroleum-Bottled & Bulk, Internet Products & Services, Oils-Fuel-Wholesale & Manufacturers, Petroleum Oils, Propane & Natural Gas, Transportation Services, Water Softening & Conditioning Equipment & Service",,,,39.24019,-84.15161,,"Our Business Is Customer Satisfaction","Suburban Propane is a nationwide distributor of propane, fuel oil and related products and services, serving the energy needs of residential, commercial, and agricultural customers in 41 states.","Mon - Fri: 8:00 am - 5:00 pm Sat - Sun Closed","Fax: (513) 722-7342 Toll Free - 24/7: (800) 776-7263",,"amex, discover, master card, visa, check",,,http://www.suburbanpropane.com/location/goshen-oh/,,,,,,,,,
17113713,2407800,"2020-09-27 06:24:27","Suburban Propane",http://www.suburbanpropane.com/location/oneonta-ny/?utm_source=yp&utm_medium=iyp&utm_campaign=yp_csc&utm_term=271,ContactUs@suburbanpropane.com,"(607) 353-8103","6178 State Highway 7",Oneonta,NY,13820,"6178 State Highway 7,Oneonta,NY 13820","Fuel Oils, Gas Companies, Gas-Liquefied Petroleum-Bottled & Bulk, Internet Products & Services, Oils-Fuel-Wholesale & Manufacturers, Petroleum Oils, Petroleum Products-Wholesale & Manufacturers, Propane & Natural Gas, Propane & Natural Gas-Equipment & Supplies, Transportation Services",,,,42.49048,-74.98248,,"Our Business Is Customer Satisfaction","Suburban Propane is a nationwide distributor of propane, fuel oil and related products and services, serving the energy needs of residential, commercial, and agricultural customers in 41 states.","Mon - Fri: 7:00 am - 4:00 pm Sat - Sun Closed","Fax: (607) 432-4440 Toll Free - 24/7: (800) 776-7263",,"amex, discover, master card, visa, check",,,http://www.suburbanpropane.com/location/oneonta-ny/,,,,,,,,,
17114363,2408096,"2020-09-27 06:24:36","Suburban Propane",http://www.suburbanpropane.com/location/montgomery-al/?utm_source=yp&utm_medium=iyp&utm_campaign=yp_csc&utm_term=865,contactus@suburbanpropane.com,"(334) 557-8020","8475 Selma Hwy",Montgomery,AL,36108,"8475 Selma Hwy,Montgomery,AL 36108","Propane & Natural Gas-Equipment & Supplies, Building Materials, Fuel Oils, Gas Companies, Gas Lines-Installation & Repairing, Gas-Liquefied Petroleum-Bottled & Bulk, Heating Equipment & Systems-Wholesale, Internet Products & Services, Oils-Fuel-Wholesale & Manufacturers, Petroleum Oils, Petroleum Products-Wholesale & Manufacturers, Plumbing Fixtures, Parts & Supplies, Propane & Natural Gas, Transportation Services, Utility Contractors",,,,32.29726,-86.44902,,"Our Business Is Customer Satisfaction","Suburban Propane is a nationwide distributor of propane, fuel oil and related products and services, serving the energy needs of residential, commercial, and agricultural customers in 41 states.","Mon - Fri: 8:00 am - 5:00 pm Sat - Sun Closed","Fax: (334) 281-2780 Toll Free - 24/7: (800) 776-7263",,"check, amex, discover, master card, visa",,,http://www.suburbanpropane.com/location/montgomery-al/,,,,,,,,,
17115255,2408445,"2020-09-27 06:24:36","Suburban Propane",http://www.suburbanpropane.com/location/sanjose-ca/?utm_source=yp&utm_medium=iyp&utm_campaign=yp_csc&utm_term=404,,"(408) 426-8870","3105 Monterey Hwy","San Jose",CA,95111,"3105 Monterey Hwy,San Jose,CA 95111","Gas-Liquefied Petroleum-Bottled & Bulk, Fuel Oils, Gas Companies, Internet Products & Services, Major Appliances, Oil Field Service, Oils-Fuel-Wholesale & Manufacturers, Petroleum Oils, Petroleum Products-Wholesale & Manufacturers, Propane & Natural Gas, Propane & Natural Gas-Equipment & Supplies, Transportation Services",,,,37.28668,-121.84459,https://i1.ypcdn.com/blob/d6fbd6688eceb790c76f40134e9f23a442c112ba_100x100_crop.jpg?adceb05,"Our Business Is Customer Satisfaction","Suburban Propane is a nationwide distributor of propane, fuel oil and related products and services, serving the energy needs of residential, commercial, and agricultural customers in 41 states.","Mon - Fri: 8:00 am - 4:00 pm Sat - Sun Closed","Fax: (408) 694-0237 Toll Free - 24/7: (800) 776-7263",,"master card, discover, amex, visa, check",,,http://www.suburbanpropane.com/location/sanjose-ca/,,,,,,,,,
17115801,2408672,"2020-09-27 06:24:36","Suburban Propane",http://www.suburbanpropane.com/location/wapakoneta-oh/?utm_source=yp&utm_medium=iyp&utm_campaign=yp_csc&utm_term=966,contactus@suburbanpropane.com,"(419) 738-8016","07985 County Road 33A",Wapakoneta,OH,45895,"07985 County Road 33A,Wapakoneta,OH 45895","Propane & Natural Gas, Fuel Oils, Gas Companies, Gas Lines-Installation & Repairing, Gas-Liquefied Petroleum-Bottled & Bulk, Internet Products & Services, Oils-Fuel-Wholesale & Manufacturers, Petroleum Oils, Petroleum Products-Wholesale & Manufacturers, Pipe Line Contractors, Propane & Natural Gas-Equipment & Supplies, Transportation Services, Trucking-Liquid Or Dry Bulk, Utility Contractors, Water Heaters, Water Softening & Conditioning Equipment & Service",,,,40.55591,-84.2998,,"Our Business Is Customer Satisfaction","Suburban Propane is a nationwide distributor of propane, fuel oil and related products and services, serving the energy needs of residential, commercial, and agricultural customers in 41 states.","Mon - Fri: 8:00 am - 5:00 pm Sat - Sun Closed","Fax: (419) 657-2271 Toll Free - 24/7: (800) 776-7263",,"check, amex, discover, master card, visa",,,www.suburbanpropane.com,,,,,,,,,
17116790,2409066,"2020-09-27 06:24:41","Suburban Propane",http://www.suburbanpropane.com/location/tampa-fl/?utm_source=yp&utm_medium=iyp&utm_campaign=yp_csc&utm_term=25,csc1158@suburbanpropane.com,"(813) 607-5392","5618 E Powhatan Ave",Tampa,FL,33610,"5618 E Powhatan Ave,Tampa,FL 33610","Propane & Natural Gas-Equipment & Supplies, Fuel Oils, Gas Companies, Gas-Liquefied Petroleum-Bottled & Bulk, Internet Products & Services, Oils-Fuel-Wholesale & Manufacturers, Petroleum Oils, Petroleum Products-Wholesale & Manufacturers, Propane & Natural Gas, Transportation Services, Utility Contractors",,,,27.99965,-82.39102,https://i1.ypcdn.com/blob/dc1a544754d54a353c6807a14c0ea9935c3e562b_100x100_crop.jpg?adceb05,"Our Business Is Customer Satisfaction","Suburban Propane is a nationwide distributor of propane, fuel oil and related products and services, serving the energy needs of residential, commercial, and agricultural customers in 41 states.","Mon - Fri: 8:00 am - 5:00 pm Sat - Sun Closed","Fax: (813) 626-7432 Toll Free - 24/7: (800) 776-7263",,"amex, discover, visa, check, master card",,,http://www.suburbanpropane.com/location/tampa-fl/,,,,,,,,,
17117321,2409298,"2020-09-27 06:24:41","Suburban Propane",http://www.suburbanpropane.com/location/jamestown-ca/?utm_source=yp&utm_medium=iyp&utm_campaign=yp_csc&utm_term=369,ContactUs@suburbanpropane.com,"(209) 782-4088","18535 5th Ave N",Jamestown,CA,95327,"18535 5th Ave N,Jamestown,CA 95327","Gas-Liquefied Petroleum-Bottled & Bulk, Barbecue Equipment & Supplies-Wholesale & Manufacturers, Barbecue Grills & Supplies, Fuel Oils, Gas Companies, Internet Products & Services, Oils-Fuel-Wholesale & Manufacturers, Petroleum Oils, Petroleum Products-Wholesale & Manufacturers, Propane & Natural Gas, Propane & Natural Gas-Equipment & Supplies, Transportation Services",,,,37.95896,-120.41804,,"Our Business Is Customer Satisfaction","Suburban Propane is a nationwide distributor of propane, fuel oil and related products and services, serving the energy needs of residential, commercial, and agricultural customers in 41 states.","Mon - Fri: 8:00 am - 5:00 pm Sat - Sun Closed","Fax: (209) 984-0745 Toll Free - 24/7: (800) 776-7263",,"discover, master card, amex, visa, check",,,http://www.suburbanpropane.com/location/jamestown-ca/,,,,,,,,,
17118568,2409866,"2020-09-27 06:24:41","Suburban Propane",http://www.suburbanpropane.com/location/battleground-wa/?utm_source=yp&utm_medium=iyp&utm_campaign=yp_csc&utm_term=1025,contactus@suburbanpropane.com,"(360) 719-1696","620 SE Eaton Blvd","Battle Ground",WA,98604,"620 SE Eaton Blvd,Battle Ground,WA 98604","Fuel Oils, Building Specialties, Gas Companies, Gas-Liquefied Petroleum-Bottled & Bulk, General Contractors, Internet Products & Services, Oil Refiners, Oils-Fuel-Wholesale & Manufacturers, Petroleum Oils, Petroleum Products-Wholesale & Manufacturers, Propane & Natural Gas, Propane & Natural Gas-Equipment & Supplies, Transportation Services",,,,45.76697,-122.53032,,"Our Business Is Customer Satisfaction","Suburban Propane is a nationwide distributor of propane, fuel oil and related products and services, serving the energy needs of residential, commercial, and agricultural customers in 41 states.","Mon - Fri: 8:00 am - 5:00 pm Sat - Sun Closed","Fax: (360) 666-4743 Toll Free - 24/7: (800) 776-7263",,"amex, discover, master card, visa, check",,,http://www.suburbanpropane.com/location/battleground-wa/,,,,,,,,,
17120256,2410564,"2020-09-27 06:24:48","Suburban Propane",http://www.suburbanpropane.com/location/fairfield-me/?utm_source=yp&utm_medium=iyp&utm_campaign=yp_csc&utm_term=715,,"(844) 681-0862","368 Upper Main St",Fairfield,ME,04937,"368 Upper Main St,Fairfield,ME 04937","Fuel Oils, Gas Companies, Gas-Liquefied Petroleum-Bottled & Bulk, Internet Products & Services, Oils-Fuel-Wholesale & Manufacturers, Petroleum Oils, Petroleum Products-Wholesale & Manufacturers, Propane & Natural Gas, Propane & Natural Gas-Equipment & Supplies, Transportation Services",,,,44.59981,-69.59524,,"Our Business Is Customer Satisfaction","Suburban Propane is a nationwide distributor of propane, fuel oil and related products and services, serving the energy needs of residential, commercial, and agricultural customers in 41 states.","Mon - Fri: 8:00 am - 5:00 pm Sat - Sun Closed","Fax: (207) 453-4994 Toll Free - 24/7: (800) 776-7263",,"amex, check, discover, master card, visa",,,http://www.suburbanpropane.com/location/fairfield-me/,,,,,,,,,
17121308,2411045,"2020-09-27 06:24:49","Suburban Propane",http://www.suburbanpropane.com/location/cortland-ny/?utm_source=yp&utm_medium=iyp&utm_campaign=yp_csc&utm_term=266,,"(607) 662-7522",,Cortland,NY,13045,"Cortland,NY 13045","Gas-Liquefied Petroleum-Bottled & Bulk, Fuel Oils, Gas Companies, Internet Products & Services, Oil Refiners, Oils-Fuel-Wholesale & Manufacturers, Petroleum Oils, Petroleum Products-Wholesale & Manufacturers, Propane & Natural Gas, Propane & Natural Gas-Equipment & Supplies, Transportation Services",,,,,,https://i1.ypcdn.com/blob/f8baaad388f307018752fbb9cd273ef76fbf5933_100x100_crop.jpg?adceb05,"Our Business Is Customer Satisfaction","Suburban Propane is a nationwide distributor of propane, fuel oil and related products and services, serving the energy needs of residential, commercial, and agricultural customers in 41 states.","Mon - Fri: 8:00 am - 5:00 pm Sat - Sun Closed","Fax: (828) 452-3525 Toll Free - 24/7: (800) 776-7263",,"amex, check, discover, master card, visa",,,"http://www.suburbanpropane.com/location/cortland-ny/ www.suburbanpropane.com",,,,,,,,,