business_x_category.id,business.id,business.ts,business.business_name,business.home_page,business.email_address,business.phone,business.street,business.city,business.state,business.zip_code,business.full_address,business.category,business.rating,business.number_of_reviews,business.bbb_rating_or_license,business.latitude,business.longitude,business.cover_image,business.slogan,business.general_info,business.regular_hours,business.extra_phones,business.services_products,business.payment,business.price_range,business.aka,business.other_links,business.other_information,business.review_1_name,business.review_1_date,business.review_1_rating,business.review_1_text,business.review_2_name,business.review_2_date,business.review_2_rating,business.review_2_text
1006358,324443,"2020-09-27 03:02:20","River Valley Horticulture Products",http://www.rivervalleyhp.com,ssmith@rivervalleyhp.com,"(501) 482-5249","21701 Lawson Rd","Little Rock",AR,72210,"21701 Lawson Rd,Little Rock,AR 72210","Horticulture Products & Services, Ceramics-Equipment & Supplies, Decorative Ceramic Products, Fountains Garden, Display, Etc, Garden Centers, Garden Ornaments, Landscaping & Lawn Services, Landscaping Equipment & Supplies, Lawn & Garden Equipment & Supplies, Lawn & Garden Furnishings, Mulches, Nurseries-Plants & Trees, Nursery & Growers Equipment & Supplies, Pottery, Sprinklers-Garden & Lawn, Stone Natural, Stone Natural-Wholesale & Manufacturers",,,A+,34.71588,-92.51727,https://i1.ypcdn.com/blob/567c16de2fc25ab2e410da82e2246c0b6eef1a7d_100x100_crop.jpg?f9d23e1,"Landscaping Products for every Imagination!","*Largest Selection of Japanese Maples in the State *Over 30,000 Perennials to Choose From *Statewide Delivery *Retail & Wholesale *20 Acre Inventory Please Visit Our Website for More Information","Mon - Sat: 8:00 am - 5:00 pm",,,"amex, check, debit, discover, visa, mastercard",,"River Valley Horticultural Products, Inc. River Valley Horticultural Products Inc",http://www.rivervalleyhp.com,"Parking: Lot Specialties: Decks & Patios Services: Waterfall Installation, Lawn Maintenance",,,,,,,,
1011052,325636,"2020-09-27 03:02:21","Realrock Inc",http://www.realrockinc.com/www.realrockinc.com/Contact_Us.html,,"(205) 274-9821","405 County Highway 33",Oneonta,AL,35121,"405 County Highway 33,Oneonta,AL 35121","Landscaping Equipment & Supplies, Garden Centers, Masonry Equipment & Supplies, Nurseries-Plants & Trees, Stone Natural",,,,33.9489,-86.57775,,,,"Fri: 8:00 am - 5:00 pm Sat: 8:00 am - 12:00 pm",,,,,,http://www.realrockinc.com/www.realrockinc.com/Contact_Us.html,,,,,,,,,
1012586,326011,"2020-09-27 03:02:28","Splawn Sales",https://www.splawnsales.com,lsplawn@gmail.com,"(903) 469-4959","6360 State Highway 31 E",Murchison,TX,75778,"6360 State Highway 31 E,Murchison,TX 75778","Landscaping Equipment & Supplies, Contractors Equipment & Supplies, Farm Equipment, Garden Centers, Landscape Contractors, Landscape Designers & Consultants, Landscaping & Lawn Services, Lawn & Garden Equipment & Supplies, Lawn Maintenance, Masonry Equipment & Supplies, Mulches, Nurseries-Plants & Trees, Sand & Gravel, Sod & Sodding Service, Stone Natural",,,A+,32.27691,-95.75223,,,,"Mon - Fri: 8:00 am - 5:00 pm Sat: 8:00 am - 12:00 pm","Phone: (903) 469-4565 Primary Phone: (903) 469-4565 Fax: (903) 469-4565",,"amex, discover, master card, visa",,"Splawn Sales, LLC","https://www.splawnsales.com http://splawnfans.proboards.com http://splawnsales.com",,,,,,,,,
1012944,326092,"2020-09-27 03:02:28","Pitchfork Landscape Material Co",http://www.pitchforkmaterial.com,pitchforkmaterial@gmail.com,"(417) 880-5549","3152 W Jackson Rd",Nixa,MO,65714,"3152 W Jackson Rd,Nixa,MO 65714","Deck Builders, Building Contractors, Building Materials, Garden Centers, Landscape Contractors, Landscaping & Lawn Services, Landscaping Equipment & Supplies, Lawn & Garden Equipment & Supplies, Mulches, Nurseries-Plants & Trees, Sand & Gravel, Snow Removal Service, Stone Natural, Stone Products, Topsoil",,,,37.051155,-93.29717,,"BEST Quality at the BEST Price.","Mark Pitchford - Owner, Deliveries and Installation Available. We Carry a Clean Premium Mulch. WE ARE ONLY 5 MILES SOUTH OF SPRINGFIELD, MO ON HWY 14, 1 MILE WEST OF 65 ON HWY 14 located at 3152 W. Jackson St. Nixa, MO","Mon - Sat: 7:30 am - 6:00 pm Sun: 7:30 am - 4:00 pm",,,"check, discover, master card, visa",,,http://www.pitchforkmaterial.com,,,,,,,,,
1013778,326284,"2020-09-27 03:02:28","Great Outdoors Nursery",http://www.greatoutdoorsabq.com,info@greatoutdoors.com,"(505) 890-5311","10408 2nd St NW",Albuquerque,NM,87114,"10408 2nd St NW,Albuquerque,NM 87114","Nurseries-Plants & Trees, Garden Ornaments, Landscaping Equipment & Supplies, Stone Natural",5,"1 Review",,35.203312,-106.61003,,,,"Mon - Sat: 9:00 am - 4:30 pm Sun: 12:00 pm - 4:00 pm",,,"all major credit cards, amex, carte blanche, company card, diners club, discover, jcb, mastercard, visa",,,http://www.greatoutdoorsabq.com,,kaleidoglass,05/17/2012,five,"This is a wonderful place. The owner is very friendly and know everything about the plants. She has a great assortment of native plants. I love going there because its so beautifully landscaped and serene.",,,,
1015025,326576,"2020-09-27 03:02:28","Parris-Wilkey Trucking Inc",http://www.parriswilkeytrucking.com,,"(269) 963-5017","1349 River Rd W","Battle Creek",MI,49037,"1349 River Rd W,Battle Creek,MI 49037","Stone Natural, Building Materials, Crushed Stone, Garden Centers, Landscaping & Lawn Services, Landscaping Equipment & Supplies, Lawn & Garden Equipment & Supplies, Lawn Maintenance, Local Trucking Service, Masonry Equipment & Supplies, Nurseries-Plants & Trees, Sand & Gravel, Snow Removal Service, Topsoil, Trucking",5,"1 Review",,42.34041,-85.25172,,,,,,,,,,http://www.parriswilkeytrucking.com,"Specialties: Pools & Spas, Driveways, Hot Tubs","Danielle P.",01/08/2014,five,"Just had him finish our driveway after the snowmageddon of January 2014. Our driveway is a huge u-shaped drive that is quite narrow. Pair that with a barn, trees, and barriers covered under the snow that prevent vehicles from driving on our drainage field, he mastered the drive like a pro! He even cleared a place for us to park and carefully took snow away from my car that was buried. I would have never been able to get to work tomorrow had it not been for this company. Very reasonable, friendly and professional. Will use them again! Great Job Parris-Wilkey Trucking!",,,,
1015070,326582,"2020-09-27 03:02:28","VanBuren Landscape",http://www.vanburenlandscape.com,greg@vanburenlandscape.com,"(952) 292-7453","Po Box 366",Loretto,MN,55357,"Po Box 366,Loretto,MN 55357","Stone Natural, Landscape Contractors, Masonry Contractors, Nurseries-Plants & Trees, Stone Products",,,A+,45.1061,-93.66917,,,,,,,,,"VanBuren Landscape, LLC",http://www.vanburenlandscape.com,,,,,,,,,
1015179,326610,"2020-09-27 03:02:28","The Greenery",http://www.thegreenerytx.com,greenery@aircanopy.net,"(972) 617-5459","3671 N Highway 77",Waxahachie,TX,75165,"3671 N Highway 77,Waxahachie,TX 75165","Stone Natural, Building Materials, Landscape Contractors, Masonry Equipment & Supplies, Nurseries-Plants & Trees, Sod & Sodding Service, Stone Natural-Wholesale & Manufacturers, Stone Products",5,"1 Review",,32.477,-96.83073,,,,,"Phone: (972) 217-9427 Phone: (972) 617-8945 Fax: (469) 218-0354",,"amex, master card, visa, all major credit cards, discover",,,http://www.thegreenerytx.com,,"Ms D.",07/27/2015,five,"Had 3 trees including a large tree, pindo palm, and a crepe myrtle put in. They did an amazing job! I wasn't home when they did it, we left small flags where to put each item. They planted it with the best side forward etc everything I would of asked when I was there. Got a great deal from the auction. We have also had dirt delivered and always great people to work with there!",,,,
1015682,326739,"2020-09-27 03:02:29","Jeny Sod Services & Nursery",http://jenysod.com,,"(305) 916-6339","29101 SW 177th Ave",Homestead,FL,33030,"29101 SW 177th Ave,Homestead,FL 33030","Stone Natural, Ceramics-Equipment & Supplies, Decorative Ceramic Products, Fountains Garden, Display, Etc, Landscaping Equipment & Supplies, Lawn & Garden Equipment & Supplies, Nurseries-Plants & Trees, Sand & Gravel, Sod & Sodding Service, Topsoil",2,"3 Reviews",,25.49635,-80.47655,https://sapi.everyscape.com/XmlApi/Image.svc/Images/VSTHUMB/VS19104260_W287_H93,,"Jeny Sod Services is located in Miami, Fla. We specialize in the delivery and installation of sod. Our complete garden center and nursery has a large selection of landscaping products. From fountains and pots to sod and gravel, everything that you need is here. Residential and commercial customers choose us for our top-notch sod services and garden center. Delivery Services: SodGravelSoilMulchSand We Proudly Serve The Following Areas: Florida KeysHomesteadDade CountyBrowardMiami BeachCoral Gables","Mon - Sat: 7:00 am - 5:00 pm Sun Closed","1-866--JenySod: (866) 536-9763",,"discover, visa, mastercard",,,http://jenysod.com,,"Doug M.",03/15/2017,four,"bought pallet of sod 4 mos ago an brought to Islamorada....doing very well! We are also pleased with variety of landscaping plants we purchased! Thanks! Doug","Mike T.",07/28/2015,one,"yep mee too and they don't do a thing about it I am disputing it on my credit card they tried to tell me it was shade but yet a piece right next to the dead one in shade was thriving customer service NONE!!!"
1015858,326782,"2020-09-27 03:02:29","Ohio Mulch",http://www.ohiomulch.com,info@ohiomulch.com,"(614) 445-4455","1600 Universal Rd",Columbus,OH,43207,"1600 Universal Rd,Columbus,OH 43207","Mulches, Garden Centers, Landscaping & Lawn Services, Nurseries-Plants & Trees, Sand & Gravel, Stone Natural, Topsoil",,,A+,39.92474,-82.95,,,"Ohio Mulch is a landscape supply company proudly serving Ohio residents with quality mulch, stone and topsoil products for over 34 years. Visit our site for current specials. We have locations in In Columbus, Cincinnati, Dayton, Delaware, and many other cities throughout central Ohio. We deliver bulk stone, sand, gravel, and mulch to thousands of customers.","Mon - Fri: 8:00 am - 5:00 pm Sat: 8:00 am - 3:00 pm Sun Closed",,,"all major credit cards",,,website,"Parking: Lot, Free Wheelchair Accessible: Yes",,,,,,,,
1015902,326791,"2020-09-27 03:02:29","Hilltop Service",http://hilltopsservices.com,hilltop2@ptd.net,"(570) 387-1772","105 Cross Rd",Bloomsburg,PA,17815,"105 Cross Rd,Bloomsburg,PA 17815","Stone Natural, Building Contractors, Crushed Stone, Excavation Contractors, Garden Centers, General Contractors, Greenhouses, Masonry Contractors, Mulches, Nurseries-Plants & Trees, Nursery & Growers Equipment & Supplies, Sand & Gravel, Stone Products, Stone-Retail, Topsoil",,,,40.98602,-76.47964,,,,"Mon - Fri: 8:00 am - 5:00 pm Sat: 8:00 am - 3:00 pm",,,"discover, check, cash, visa, mastercard",,"Hilltop Services",http://hilltopsservices.com,,,,,,,,,
1015965,326809,"2020-09-27 03:02:29","Ainsworth Rock Sales",http://www.ainsworthrocksales.com,denisecbennett@gmail.com,"(720) 773-8110","5600 Washington St",Denver,CO,80216,"5600 Washington St,Denver,CO 80216","Stone Natural, Landscaping Equipment & Supplies, Lawn & Garden Equipment & Supplies, Nurseries-Plants & Trees, Sand & Gravel, Stone Products, Stone-Retail",,,A+,39.79855,-104.97789,https://i1.ypcdn.com/blob/53506c6502bec1da4d4877e86ea6cf8b27e96a3a_100x100_crop.jpg?f9d23e1,"Open M-F 8-5 Sat 8-4 / Call for winter hours November-April","Ainsworth Rock Sales, Inc., is a family-owned business that was started in the early 70's. We provide quality landscape materials at an affordable price. We offer a full range of decorative rock, mulch, sand, gravel, and topsoil, and we also have a knowledgeable sales staff. Call us today for more information!","Mon - Fri: 8:00 am - 5:00 pm Sat: 8:00 am - 4:00 pm Sun Closed","Fax: (303) 295-2990",,"all major credit cards, discover",,,http://www.ainsworthrocksales.com,"Wheelchair Accessible: Yes Parking: Lot, Free",,,,,,,,
1016504,326938,"2020-09-27 03:02:29","Bedford Glens Garden Center",http://bedfordglens.com,,"(440) 232-1248","43 Bedford Glen Rd",Bedford,OH,44146,"43 Bedford Glen Rd,Bedford,OH 44146","Landscaping Equipment & Supplies, Garden Centers, Lake & Pond Construction, Landscape Designers & Consultants, Landscaping & Lawn Services, Nurseries-Plants & Trees, Ponds, Lakes & Water Gardens Construction, Stone Natural",,,,41.39036,-81.53676,,,,"Mon - Fri: 8:00 am - 5:30 pm Sat: 8:00 am - 3:00 pm","Phone: (440) 232-8410 Fax Number: (440) 232-8410",,,,"Bedford Glens Garden Ctr",http://bedfordglens.com,,,,,,,,,
1016582,326953,"2020-09-27 03:02:29","Tholens' Landscape & Garden Center",,Tholensa@mindspring.com,"(815) 939-6445","1401 N Convent St",Bourbonnais,IL,60914,"1401 N Convent St,Bourbonnais,IL 60914","Landscaping Equipment & Supplies, Brick-Clay-Common & Face, Building Materials, Garden Centers, Hardware Stores, Landscape Contractors, Landscape Designers & Consultants, Landscaping & Lawn Services, Masonry Equipment & Supplies, Mulches, Nurseries-Plants & Trees, Retaining Walls, Sand & Gravel, Stone Natural, Topsoil",,,A+,41.1778,-87.87625,,,"OVER 40 YEARS OF SERVICE AND CARE This year, we are celebrating over 40 years of business. Here's to many more years of ""When you think of trees...think of Tholens'!""","Mon - Sat: 8:00 am - 5:30 pm Sun: 11:00 am - 4:00 pm","Phone: (815) 662-5709 Phone: (815) 936-6445 Phone: (815) 662-5708 Primary Phone: (815) 401-1390 Phone: (815) 939-6446 Fax: (815) 939-6447 TollFree: (888) 844-0740",,,,,,,,,,,,,,
1017615,327192,"2020-09-27 03:02:37","Mid South Mulch & Outdoor Services",https://www.midsouthmulch.net,midsouthmulch@yahoo.com,"(615) 599-7550","430 Lewisburg Ave",Franklin,TN,37064,"430 Lewisburg Ave,Franklin,TN 37064","Mulches, Crushed Stone, Garden Centers, Landscape Contractors, Landscape Designers & Consultants, Landscaping & Lawn Services, Lawn Maintenance, Nurseries-Plants & Trees, Sand & Gravel, Snow Removal Service, Sod & Sodding Service, Stone Natural, Topsoil, Tree Service",1,"1 Review",A+,35.91331,-86.86444,,,,"Mon - Thu: 8:00 am - 4:00 pm Fri - Sat: 8:00 am - 12:00 pm","Phone: (615) 212-5557 Phone: (615) 599-2169 Phone: (615) 682-1162 Fax: (615) 599-2169",,"cash, check, debit, discover, master card, visa",,"MIDSOUTH MULCH NRSY OUTLET Midsouth Mulch & Nursery Outlt Midsouth Mulch & Nursery Outlet Midsouth Mulch & Nursery Outlet, LLC Midsouth Mulch & Outdoor Services LLC MID SOUTH MULCH OUTDOOR SVC","https://www.midsouthmulch.net http://midsouthmulch.com http://2midsouthmulch.com",,massab,12/06/2009,one,"Uniquely trashed my lawn",,,,
1019191,327586,"2020-09-27 03:02:37","Ohio Mulch",http://www.ohiomulch.com,info@ohiomulch.com,"(614) 891-3242","4665 Westerville Rd",Columbus,OH,43231,"4665 Westerville Rd,Columbus,OH 43231","Mulches, Garden Centers, Landscaping & Lawn Services, Masonry Equipment & Supplies, Nurseries-Plants & Trees, Sand & Gravel, Stone Natural, Topsoil",,,,40.067,-82.9315,,,"Ohio Mulch is a landscape supply company proudly serving Ohio residents with quality mulch, stone and topsoil products for over 34 years. Visit our site for current specials. We have locations in In Columbus, Cincinnati, Dayton, Delaware, and many other cities throughout central Ohio. We deliver bulk stone, sand, gravel, and mulch to thousands of customers.","Mon - Sat: 7:00 am - 7:00 pm Sun: 10:00 am - 5:00 pm",,,"mastercard, amex, discover, visa",,,website,,,,,,,,,
1019746,327722,"2020-09-27 03:02:37","Edgewater Yard Shop",http://www.edgewateryardshop.com,theyardshop@cfl.rr.com,"(386) 427-7383","401 N Ridgewood Ave",Edgewater,FL,32132,"401 N Ridgewood Ave,Edgewater,FL 32132","Stone Natural, Garden Centers, Landscaping Equipment & Supplies, Lawn & Garden Equipment & Supplies, Masonry Equipment & Supplies, Mulches, Nurseries-Plants & Trees, Sand & Gravel",,,A+,28.99973,-80.91138,,,,"Mon - Fri: 8:00 am - 5:00 pm Sat: 8:00 am - 2:00 pm Sun Closed",,,"master card, amex, discover, visa",,,http://www.edgewateryardshop.com,"Services: Sand Delivery",,,,,,,,
1020383,327857,"2020-09-27 03:02:37","Cedotal's Landscaping Stonwork",http://www.cedotals.com,cedotals@bellsouth.net,"(985) 868-0195","5548 W Main St",Houma,LA,70360,"5548 W Main St,Houma,LA 70360","Landscape Designers & Consultants, Irrigation Systems & Equipment, Nurseries-Plants & Trees, Stone Natural, Stone Products",,,,29.64383,-90.76262,,,,"Mon - Fri: 9:00 am - 5:00 pm Sat: 9:00 am - 3:00 pm Sun Closed","Retail store: (985) 868-0197",,"check, cash, all major credit cards",,,"Cedotal's, LLC",,,,,,,,,
1020928,327993,"2020-09-27 03:02:37","Earth Source",http://www.earthsourcejax.com,,"(904) 757-8618","11761 N Main St",Jacksonville,FL,32218,"11761 N Main St,Jacksonville,FL 32218","Mulches, Garden Centers, Landscaping & Lawn Services, Nurseries-Plants & Trees, Stone Natural",,,,30.45055,-81.63727,,,,"Mon - Fri: 8:00 am - 5:00 pm",,,,,,"http://www.earthsourcejax.com https://earthsourcejax.com",,,,,,,,,
1021404,328120,"2020-09-27 03:02:38","Pinelands Nursery Company",http://www.pinelandsfl.com,pinelandsnursery@bellsouth.net,"(850) 623-0602","8365 Highway 90",Milton,FL,32583,"8365 Highway 90,Milton,FL 32583","Landscaping & Lawn Services, Building Materials, Landscape Contractors, Nurseries-Plants & Trees, Nursery-Wholesale & Growers, Stone Natural, Stone Products",,,,30.63372,-86.97518,https://i2.ypcdn.com/blob/3f756156741bb230cae2504bfb62ce4f7933fe78_100x100_crop.jpg?f9d23e1,"A locally Owned and Operated full service nursery and landscape company","Here at Pinelands Nursery we offer quality labor, plant materials, and a one year warranty on select products. We have great retail and wholesale pricing. We offer delivery services. We are located in Milton on Hwy 90 just before Hwy 87. We are minutes from Pensacola, Pace, Navarre and Gulf Breeze Florida!","Mon - Sat: 8:00 am - 5:00 pm Sun Closed",,,"check, amex, discover, visa, cash, mastercard",,,http://www.pinelandsfl.com,"Parking: Lot",,,,,,,,
1022037,328276,"2020-09-27 03:02:38","The Bushel Stop",http://thebushelstops.com,,"(954) 434-1729","20700 Griffin Rd","Southwest Ranches",FL,33332,"20700 Griffin Rd,Southwest Ranches,FL 33332","Mulches, Garden Centers, Landscaping & Lawn Services, Landscaping Equipment & Supplies, Masonry Equipment & Supplies, Nurseries-Plants & Trees, Sod & Sodding Service, Stone Natural",,,,26.0611,-80.4261,,,,"Mon - Fri: 7:30 am - 5:00 pm Sat: 7:30 am - 4:00 pm Sun Closed","Pompano Beach: (954) 975-4660",,"check, debit, amex, discover, mastercard, visa",,,http://thebushelstops.com,,,,,,,,,
1025104,328991,"2020-09-27 03:02:38","Ohio Mulch",http://www.ohiomulch.com,info@ohiomulch.com,"(740) 689-1120","840 S Columbus St",Lancaster,OH,43130,"840 S Columbus St,Lancaster,OH 43130","Mulches, Garden Centers, Masonry Equipment & Supplies, Nurseries-Plants & Trees, Stone Natural, Topsoil",,,,39.70318,-82.59625,,,"Ohio Mulch is a landscape supply company proudly serving Ohio residents with quality mulch, stone and topsoil products for over 34 years. Visit our site for current specials. We have locations in In Columbus, Cincinnati, Dayton, Delaware, and many other cities throughout central Ohio. We deliver bulk stone, sand, gravel, and mulch to thousands of customers.","Mon - Sat: 7:00 am - 4:00 pm Sun Closed",,,"mastercard, amex, discover, visa",,,website,,,,,,,,,
1025311,329045,"2020-09-27 03:02:46","Twin Oaks Landscape Supply",,,"(352) 568-1464","956 S US 301",Sumterville,FL,33585,"956 S US 301,Sumterville,FL 33585","Topsoil, Garden Centers, Landscape Contractors, Landscaping Equipment & Supplies, Lawn & Garden Equipment & Supplies, Masonry Equipment & Supplies, Mulches, Nurseries-Plants & Trees, Stone Natural",,,,28.741852,-82.06523,,,,,"Phone: (352) 569-1464",,,,"Twin Oaks Landscape Supply LLC",,,,,,,,,,
1026762,329405,"2020-09-27 03:02:46","Hill Country Soil and Stone",http://www.texassoilandstone.com,Lackeygolf04@yahoo.com,"(210) 497-1777","26807 Us Highway 281 N","San Antonio",TX,78260,"26807 Us Highway 281 N,San Antonio,TX 78260","Topsoil, Fertilizers, Landscaping & Lawn Services, Landscaping Equipment & Supplies, Lawn & Garden Equipment & Supplies, Nurseries-Plants & Trees, Stone Natural",,,,29.69723,-98.45185,,,,"Mon - Fri: 9:00 am - 5:00 pm","Phone: (830) 980-7645 Primary Phone: (830) 980-7645 Phone: (830) 438-7649 Fax: (830) 438-7649",,"amex, master card, visa",,"Texas Soil & Stone Outfitter Texas Soil & Stone Outfitters LLC Texas Soil & Stone",http://www.texassoilandstone.com,,,,,,,,,
1027093,329475,"2020-09-27 03:02:46","Wayne's Landscape Supply",http://www.wayneslandscape.com/#cid=glbc,,"(281) 484-2275","1202 Dixie Farm Rd",Houston,TX,77089,"1202 Dixie Farm Rd,Houston,TX 77089","Garden Centers, Landscaping & Lawn Services, Landscaping Equipment & Supplies, Lawn & Garden Equipment & Supplies, Masonry Equipment & Supplies, Mulches, Nurseries-Plants & Trees, Stone Natural",,,,29.58511,-95.18715,,,,"Mon - Fri: 7:30 am - 5:30 pm Sat: 7:30 am - 5:00 pm",,,"cash, check, amex, debit, master card, visa",,,"http://www.wayneslandscape.com/#cid=glbc http://wayneslandscape.com","Services: Mulches",,,,,,,,
1027476,329581,"2020-09-27 03:02:46","Quality Tree Care & Landscaping",http://www.qualitytreecareil.com,,"(815) 422-9077","3800 S 1000w Rd",Kankakee,IL,60901,"3800 S 1000w Rd,Kankakee,IL 60901","Stone Natural, Firewood, Garden Centers, Greenhouses, Landscape Contractors, Landscaping & Lawn Services, Nurseries-Plants & Trees, Nursery & Growers Equipment & Supplies, Stump Removal & Grinding, Tree Service",,,,41.06459,-87.8867,,"Specializing In Fine Pruning & Tree Removal.","Quality Tree Care & Landscaping has been providing tree service in the Kankakee, IL area for over 30 years. Whether you need tree trimming or tree and stump removal, we will get the job done right. Our services include residential and commercial land clearing, stump removal, cable bracing, trimming, firewood, tree fertilizing, storm service, insurance work, and bucket trucks for big jobs. We are fully insured and offer free estimates so call us today.","Mon - Sun: Open 24 Hours",,,"cash only",,,website,,,,,,,,,
1028016,329734,"2020-09-27 03:02:46","Seaside Mulch",http://www.seasidemulch.com,hackney@seasidemulch.com,"(843) 358-9888","1240 Dog Bluff Rd","Galivants Ferry",SC,29544,"1240 Dog Bluff Rd,Galivants Ferry,SC 29544","Mulches, Composting Service & Equipment, Garden Centers, Lawn & Garden Equipment & Supplies, Nurseries-Plants & Trees, Rock Shops, Stone Natural, Stone Natural-Wholesale & Manufacturers, Stone Products, Stone-Retail, Topsoil",,,,33.93627,-79.18209,,,"Seaside Mulch Inc. is the premier supplier of mulches for our region. We produce the highest quality products and set the standard for others in the mulch industry. We aim to satisfy our customers with our prompt and professional delivery service.","Mon - Fri: 8:00 am - 5:00 pm Sat: 8:00 am - 4:00 pm","Phone: (843) 358-2439 Phone: (843) 358-2704 Primary Phone: (843) 358-2704 Fax: (843) 358-2439 TollFree: (800) 641-0881",,"amex, visa, discover, debit, mastercard, all major credit cards",,"Seaside Mulch Inc","http://www.seasidemulch.com https://www.seasidemulch.com","Parking: Lot, Self, On Site, Free Wheelchair Accessible: Yes",,,,,,,,
1028424,329829,"2020-09-27 03:02:46","Krukowski Stone Co",http://www.krukowskistone.com,joaniew@krukowskistone.com,"(715) 693-6300","3781 County Road C",Mosinee,WI,54455,"3781 County Road C,Mosinee,WI 54455","Masonry Equipment & Supplies, Counter Tops, Landscaping Equipment & Supplies, Masonry Contractors, Nurseries-Plants & Trees, Stone Natural",,,A+,44.713,-89.52273,https://i1.ypcdn.com/blob/d05c61a78e2937a6b42715eb00e1f69565f19c53_100x100_crop.jpg?f9d23e1,,,"Mon - Fri: 7:30 am - 5:00 pm","Phone: (715) 693-0901 Phone: (715) 693-7285 TollFree: (800) 628-0314",,,,,http://www.krukowskistone.com,"Parking: Lot, On Site Wheelchair Accessible: Yes",,,,,,,,