business_x_category.id,business.id,business.ts,business.business_name,business.home_page,business.email_address,business.phone,business.street,business.city,business.state,business.zip_code,business.full_address,business.category,business.rating,business.number_of_reviews,business.bbb_rating_or_license,business.latitude,business.longitude,business.cover_image,business.slogan,business.general_info,business.regular_hours,business.extra_phones,business.services_products,business.payment,business.price_range,business.aka,business.other_links,business.other_information,business.review_1_name,business.review_1_date,business.review_1_rating,business.review_1_text,business.review_2_name,business.review_2_date,business.review_2_rating,business.review_2_text
2384226,756077,"2020-09-27 03:44:33","Direct Services Plumbing & Drain",https://www.directservices.biz,directservices.pd@gmail.com,"(706) 755-7242","306 Russell St",Wrens,GA,30833,"306 Russell St,Wrens,GA 30833","Plumbing-Drain & Sewer Cleaning, Bathroom Remodeling, Bathtubs & Sinks-Repair & Refinish, Drainage Contractors, Kitchen Planning & Remodeling Service, Leak Detecting Service, Plumbers, Water Heater Repair, Water Heaters",,,,33.21473,-82.38846,https://i2.ypcdn.com/blob/3c0cdbae37d3d1c1581b2c3a80b4ff6bf686823a_100x100_crop.jpg?8ad0f92,"Plumbing Problems Solved... Directly!",,"Mon - Fri: 7:30 am - 7:30 pm Sat: 9:00 am - 12:00 pm Sun Closed",,,"all major credit cards, visa, mastercard, amex, discover, cash, check, apple pay",,,https://www.directservices.biz,,,,,,,,,
2385391,756231,"2020-09-27 03:44:34","Kaptains Plumbing",http://www.kaptainsplumbing.com,kaptainsplumbing@gmail.com,"(812) 416-0216","5622 E Stucker Rd",lexington,IN,47138,"5622 E Stucker Rd,lexington,IN 47138","Kitchen Planning & Remodeling Service, Bathroom Remodeling, Plumbers, Plumbing Contractors-Commercial & Industrial, Plumbing-Drain & Sewer Cleaning",,,A+,38.60796,-85.66861,,,,"Mon - Sat: Open 24 Hours Sun Closed","Call anytime we here to attend to your needs.: (812) 416-0216",,"check, cash",,,"plumbing services offered by Kaptains Plumbing",,,,,,,,,
2385927,756313,"2020-09-27 03:44:34","Sheehan Connection",http://www.sheehanconnection.com,scplumb@comcast.net,"(856) 627-4495","20 Aristone Dr",Berlin,NJ,08009,"20 Aristone Dr,Berlin,NJ 08009","Kitchen Planning & Remodeling Service, Bathroom Remodeling, Gas Lines-Installation & Repairing, Plumbers, Plumbing-Drain & Sewer Cleaning",,,,39.78455,-74.93413,,,,"Mon - Sun: 6:00 am - 5:30 am",,,,,,http://www.sheehanconnection.com,,,,,,,,,
2386874,756458,"2020-09-27 03:44:34","Jack Stephan Plumbing & Htg",http://www.jackstephan.com,,"(310) 679-2255",,Hawthorne,CA,90250,"Hawthorne,CA 90250","Heating Contractors & Specialties, Air Conditioning Contractors & Systems, Kitchen Planning & Remodeling Service, Plumbers, Plumbing-Drain & Sewer Cleaning, Sewer Cleaners & Repairers, Sewer Contractors",,,,,,,,,"Mon - Sun: Open 24 Hours","TollFree: (800) 464-7586",,,,"Stephan Plumbing & Heating Inc Jack Stephan Plumbing & Heating",http://www.jackstephan.com,,,,,,,,,
2391014,757043,"2020-09-27 03:44:35","Action Plumbing & Heating Inc",https://www.actionplumbingandheating-ny.com,action.plumbing@live.com,"(845) 753-6604","103 Sterling Mine Rd",Sloatsburg,NY,10974,"103 Sterling Mine Rd,Sloatsburg,NY 10974","Heating Contractors & Specialties, Boiler Repair & Cleaning, Geothermal Heating & Cooling Contractors, Kitchen Planning & Remodeling Service, Plumbers, Plumbing-Drain & Sewer Cleaning, Water Heaters",,,A+,41.15564,-74.20589,,,"Our local, family owned and operated business provides superior plumbing and construction services to the community. Turn to us for plumbing repair, remodeling, and water heater and boiler installation work. Licensed in NY #680","M-F 7am-7pm, Sa-Su Closed (24/7 emergency services available.)","Phone: (201) 753-6156 Fax: (845) 753-6601",,"amex, discover, master card, visa, cash, check",,,website,,,,,,,,,
2391351,757091,"2020-09-27 03:44:35","John Piccirilli, Inc",https://jpplumbingheating.com,jpiccplumbing@stny.rr.com,"(607) 775-1316","1019 Conklin Rd",Conklin,NY,13748,"1019 Conklin Rd,Conklin,NY 13748","Heating Equipment & Systems-Repairing, Air Conditioning Contractors & Systems, Air Conditioning Service & Repair, Air Duct Cleaning, Duct Cleaning, General Contractors, Geothermal Heating & Cooling Contractors, Heat Pumps, Heating Contractors & Specialties, Kitchen Planning & Remodeling Service, Piping Contractors, Plumbers, Plumbing-Drain & Sewer Cleaning, Pumps, Sewer Cleaners & Repairers, Sewer Contractors, Ventilating Contractors, Water Heaters","3,5","3 Reviews",A+,42.07946,-75.82395,,"One Company Serving All Your Heating and Cooling, Plumbing and Well Pump needs!",https://www.facebook.com/JohnPiccirilliInc/,"Mon - Fri: 7:00 am - 5:00 pm Sat - Sun Closed Emergency Hours Mon - Sun Open 24 Hours",,,"amex, cash, check, discover, master card, debit, visa, all major credit cards",,"John Piccirilli Plumbing JP Plumbing One Hour Heating & Air Conditioning Binghamton One Hour Heating & Air Conditioning Conklin One Hour Heating & Air Conditioning Broome County Piccirilli's Ohe Hour Heating & Air Conditioning Cline's Universal Well Pumps","Primary Website Specials Financing Reviews & Testimonial",,"Kathi J.",02/18/2017,five,"They showed up on time and did the job with great expertise. Very courteous and knowledgeable. Will definitely call again.","Mauri T.",02/22/2016,five,"Called because our furnace stopped working. preformed in a timely manner. They cleaned up and thought that they did an outstanding job!"
2391438,757102,"2020-09-27 03:44:35","James Onze Plumbing & Heating",https://www.southernctplumbingheating.com,,"(203) 366-0205","30 Pine Knob Ter",Milford,CT,06461,"30 Pine Knob Ter,Milford,CT 06461","Heating Contractors & Specialties, Air Conditioning Contractors & Systems, Kitchen Planning & Remodeling Service, Plumbers, Plumbing-Drain & Sewer Cleaning, Sewer Cleaners & Repairers, Water Heaters",,,,41.25554,-73.07607,,,,"Mon - Fri: 7:00 am - 3:30 pm",,,,,,"https://www.southernctplumbingheating.com http://jamesonzeplumbing.net",,,,,,,,,
2391457,757105,"2020-09-27 03:44:35","G's R Plumbing & Heating Inc",http://www.gsrplumbing.com,,"(815) 758-5228","1831 E Lincoln Hwy",Dekalb,IL,60115,"1831 E Lincoln Hwy,Dekalb,IL 60115","Heating Contractors & Specialties, Air Conditioning Contractors & Systems, Air Conditioning Equipment & Systems, Air Conditioning Service & Repair, Furnaces-Heating, Kitchen Planning & Remodeling Service, Plumbers, Plumbing-Drain & Sewer Cleaning, Refrigeration Equipment-Commercial & Industrial, Sewer Cleaners & Repairers, Sewer Contractors",3,"2 Reviews",A+,41.92387,-88.7298,,,,"Mon - Fri: 7:30 am - 4:30 pm Sat - Sun Closed","Phone: (815) 758-1610 Fax: (815) 758-1610",,"mastercard, amex, discover, visa",,"GSR Plumbing & Heating","http://www.gsrplumbing.com https://www.gsrplumbing.com","Services: Boiler Repair","Susan P.",02/16/2018,five,"I had an after hours sump pump problem. A technician was here within 20 min. Ryan was so professional and friendly. I will always be a customer of GВ’s R Plumbing and will highly recommend them to friends.","Linda M.",05/28/2013,one,"I'll never use them again. Unreliable and didn't do the work correctly."
2392205,757215,"2020-09-27 03:44:35","Morey Plumbing Heating",https://www.moreyphc.com,marianne@moreyphc.com,"(858) 505-4500","8170 Ronson Rd Ste S","San Diego",CA,92111,"8170 Ronson Rd Ste S,San Diego,CA 92111","Air Conditioning Contractors & Systems, Air Balancing, Air Conditioning Equipment & Systems, Air Conditioning Service & Repair, Air Quality-Indoor, Backflow Prevention Devices & Services, Bath Equipment & Supplies, Bathroom Remodeling, Boiler Repair & Cleaning, Boilers Equipment, Parts & Supplies, Building Construction Consultants, Building Contractors, Building Contractors-Commercial & Industrial, Construction Consultants, Drainage Contractors, Duct & Duct Fittings, Fan Repair, Filter Cleaning, Fireplace Equipment, Fireplaces, Furnace Repair & Cleaning, Furnaces Parts & Supplies, Furnaces-Heating, Garbage Disposal Repair, Garbage Disposals, Grease Traps, Heating Contractors & Specialties, Heating Equipment & Systems, Heating Equipment & Systems-Repairing, Home Improvements, Home Repair & Maintenance, Kitchen Planning & Remodeling Service, Leak Detecting Service, Pipe, Plumbers, Plumbing Contractors-Commercial & Industrial, Plumbing Fixtures, Parts & Supplies, Plumbing Fixtures, Parts & Supplies-Used, Plumbing, Drains & Sewer Consultants, Plumbing-Drain & Sewer Cleaning, Pumps, Radiators-Heating Sales, Service & Supplies, Sewer Cleaners & Repairers, Sewer Contractors, Sewer Pipe, Small Appliance Repair, Sump Pumps, Thermocouples, Thermostats, Water Damage Emergency Service, Water Filtration & Purification Equipment, Water Heater Repair, Water Heaters, Water Softening & Conditioning Equipment & Service",5,"52 Reviews",A+,32.82957,-117.147,https://i2.ypcdn.com/blob/117472d5acffc1d5478bfa2ea1d1569a26162090_100x100_crop.jpg?8ad0f92,"""You Get More With Morey""",,"Mon - Fri: 8:00 am - 5:00 pm",,,"check, cash, all major credit cards",,,"https://www.moreyphc.com http://www.moreyphc.com","Parking: Lot, Free Wheelchair Accessible: Yes Services: We are a full service heating, cooling and plumbing company","Aaron K.",03/09/2017,five,"So glad I found Morey. Had a different company come out to check on air conditioning unit. The guy got lost on his way here, and of course was late. He looked at it for 10 minutes and just said buy a new one, we can install it tomorrow for $5K, then wanted to come to my house to ""fix"" anything else he could think of. Tech from Morey got here on time, no dumb questions, thoroughly inspected and even cleaned up the unit, fixed some of the insulation that had come loose, cleaned and inspected the ducts inside and out. Then gave me several options and suggestions. Did the repairs on time without interrupting my business and even came in a little under the estimate. I now have a three year service contract with Morey and feel relieved.","Sylvester M.",03/01/2017,five,"Customer service is superb. Ken, the estimator, listened to our concerns and found a solution that no other company thought of. The installer, John, was neat, organized and professional. I recommend them without hesitation."
2392894,757319,"2020-09-27 03:44:35","Dirk Plumbing & Heating Inc",http://dirkplumbingandheating.net,,"(701) 663-3671","Po Box 127",Mandan,ND,58554,"Po Box 127,Mandan,ND 58554","Heating Contractors & Specialties, Air Conditioning Contractors & Systems, Air Conditioning Service & Repair, Geothermal Heating & Cooling Contractors, Kitchen Planning & Remodeling Service, Plumbers, Plumbing-Drain & Sewer Cleaning, Water Heaters",,,,46.83065,-100.90917,,,,,"Fax Number: (701) 663-3556",,"amex, discover, master card, visa",,,"http://dirkplumbingandheating.net http://kohler.com",,,,,,,,,
2394453,757530,"2020-09-27 03:44:35","La Mattina's Plumbing & Heating",http://www.lamattinasplumbing.com,lamattina.plumbing@gmail.com,"(781) 321-7973","130 Mills St",Malden,MA,02148,"130 Mills St,Malden,MA 02148","Heating Contractors & Specialties, Air Conditioning Contractors & Systems, Kitchen Planning & Remodeling Service, Plumbers, Plumbing-Drain & Sewer Cleaning",4,"5 Reviews",A+,42.42238,-71.05286,,,"Family owned and operated, LaMattina's Plumbing & Heating was formed in 1984. Quality and service is our top priority to our customers, whether commercial or residential. Through years of painstaking dedication to detail, we strive to bring you, our customer, the most effective product we offer service. If it can be done, we will make it happen. Continuing education on new and current technologies is a top priority. This includes receiving proper certifications from manufacturer's products to ensure the proper installation, maintenance and warranty of the products. As a member of the Plumbing-Heating-Cooling Contractors Association (PHCC), all work performed will meet or exceed local and state Plumbing Code standards. No job is too big or small, We do it ALL!","Mon - Sun: Open 24 Hours",,,,,"Robert Lamattina La Mattina's Plumbing & Htg LaMattinaВ’s Plumbing and Heating LaMattina's Plumbing & Heating Corporation",http://www.lamattinasplumbing.com,,sdiben43,04/03/2010,five,"I was in need or replacing my water heater due to rust coming out when I ran hot water. I called around via to some plumbers and all of them basically just gave me a price on replacing the water heater. Short and sweet, they didn't ask any questions about anything. I went on the web, found La Mattina Plumbing and decided to call them. Bob, the owner apparently, asked how big the water heater was, how many people in the household using it, if I had a dishwasher, etc. He told me he could easily replace the water heater but if I don.t want to change it out ever again, that I may want to consider a ""Superstor"" stainless steel water heater. He said because of the efficiency of the water heater, the savings it heating the water will pay for itself just in a few years. Intrigued, he sent me a link on it and I agreed to have him do an estimate. He was timely and honest with other alternatives I could do. Between him taking the time to explain things and the fact he was better highly rated at the Business Bureau, I decided to go with him. I'm so glad I did. I got the stainless steel water heater and it was installed shortly after. They were neat, professional and best of all...he was there on the job with one or 2 other workers. I then got a follow up call as to how it was working out. You need a plumber? You need to consider these guys...you will not be disappointed on any level.",SDiBen,04/03/2010,five,"I recently had a problem with my heating system. It was making a noise like it was trying to turn on, but never did. With 3 kids in the house, I needed to get this fixed ASAP. Some of the other local plumbing companies I found through the internet said they """"Would have to see, but given the age of the unit I should consider replacing it"""". After talking to Bob, owner of La Mattina Plumbing, he told me what he thought it was and can come down and take a look as soon as he was able to. Where he knew the urgency of the situation, he promptly came down within a few hours and realized it was an ignitor that had to be replaced. Best thing is that he had the part in his truck. he says """" I try to keep the most common Manufacturer stock items available."""" After he replaced the ignitor. I was back in the heat within 30 minutes and didn't need to replace the whole heating system. Now I understand why he has a Better Business Bureau high rating."
2395603,757717,"2020-09-27 03:44:36","Dabronzo Plumbing & Heating",https://www.abaileyplumbing.com,,"(609) 291-1400","Po Box 445",Bordentown,NJ,08505,"Po Box 445,Bordentown,NJ 08505","Heating Contractors & Specialties, Air Conditioning Contractors & Systems, Boiler Repair & Cleaning, Geothermal Heating & Cooling Contractors, Kitchen Planning & Remodeling Service, Plumbers, Plumbing-Drain & Sewer Cleaning, Sewer Cleaners & Repairers, Sewer Contractors, Water Heaters",,,,40.143143,-74.70325,,,,"Mon - Sun: Open 24 Hours","Primary Phone: (609) 298-7582 Phone: (609) 298-7582 Fax: (609) 587-0646 TollFree: (800) 392-3981",,"amex, discover, financing available, master card, visa",,"A Bailey Plumbing & Heating Dabronzo Plumbing & Heating LLC A Bailey's Plumbing","https://www.abaileyplumbing.com http://abaileyplumbing.com",,,,,,,,,
2398206,758097,"2020-09-27 03:44:38","Bob Kerby Plumbing & Heating",http://www.bobkerbyplumbing.com,r.kerby@comcast.net,"(217) 429-1842","3615 Circle Ln",Decatur,IL,62521,"3615 Circle Ln,Decatur,IL 62521","Heating Contractors & Specialties, Air Conditioning Contractors & Systems, Kitchen Planning & Remodeling Service, Plumbers, Plumbing-Drain & Sewer Cleaning, Sewer Cleaners & Repairers, Sewer Contractors, Water Heaters",,,,39.83046,-88.89698,,,,"Mon - Fri: 8:00 am - 4:30 pm","Phone: (217) 619-0155",,,,"Kerby Heating And Cooling","http://www.bobkerbyplumbing.com http://kerbyplumbing.com",,,,,,,,,
2398687,758163,"2020-09-27 03:44:38","Woodfin Kitchen & Bath",,woodfinservices@gmail.com,"(817) 692-6300","5701 Piedra Dr","Fort Worth",TX,76179,"5701 Piedra Dr,Fort Worth,TX 76179","Plumbing-Drain & Sewer Cleaning, Bathroom Remodeling, Kitchen Cabinets & Equipment-Household, Shower Doors & Enclosures, Tile-Contractors & Dealers",,,,32.83641,-97.41143,https://i1.ypcdn.com/blob/1815706245753e79f8b97ad30b1096ece1f2a66d_100x100_crop.jpg?8ad0f92,,"We are a small family owned Christian based company geared to please each and every customer that we are blessed to come in contact with. Our goal is to bring your ideas to life and or solve existing problems that you may have.","Mon - Sun: Open 24 Hours",,,"visa, master card, discover, check, paypal, cash, insurance",,,,,,,,,,,,
2399008,758204,"2020-09-27 03:44:38","Rich Plumbing",https://www.richplumbinghvac.com,troy@richplumbinghvac.com,"(217) 935-3092","702 N Walnut",Wapella,IL,61777,"702 N Walnut,Wapella,IL 61777","Radiators-Heating Sales, Service & Supplies, Air Conditioning Contractors & Systems, Heating Contractors & Specialties, Kitchen Planning & Remodeling Service, Plumbers, Plumbing Contractors-Commercial & Industrial, Plumbing-Drain & Sewer Cleaning, Sewer Cleaners & Repairers",3,"2 Reviews",A+,40.232304,-88.96726,,,,"Mon - Fri: 9:00 am - 5:00 pm","Phone: (217) 935-9707 Fax: (217) 935-9707",,"cash, amex, check, discover, invoicing available, master card, visa",,"Rich Heating & Cooling, Inc. Rich Plumbing, Inc.","https://www.richplumbinghvac.com http://www.richplumbinghvac.com",,"Ryan J.",07/10/2015,one,"Beware of using this company. They promise you one thing but don't deliver on that promise. Had them bid some work for our organization and their bid was much longer. When I continued to ask if certain items were included, I was told they were. When work was completed, certain features were not added and was then told they were extra. Person who provided bid then made up story about conversation we had which never took place. Then person accuses me of wanting something for free. I only asked for what was promised. Recommend you find a company that can be trusted!","Bill A.",07/09/2013,five,"The real good in fact they have a guy named Bill who is probably the best plumber in central Illinois"
2399170,758226,"2020-09-27 03:44:38","Techniques Plumbing & Remodeling",,,"(940) 600-9760","2320 Vanderbilt Ct",Denton,TX,76201,"2320 Vanderbilt Ct,Denton,TX 76201","Kitchen Planning & Remodeling Service, Bathroom Remodeling, General Contractors, Plumbers, Plumbing-Drain & Sewer Cleaning",,,,33.23903,-97.15005,,,,"Mon - Fri: 8:00 am - 5:00 pm Sat - Sun Closed","free phone estimates: (940) 600-9760",,"visa, master card, amex, discover, debit, check, cash",,,,,,,,,,,,
2399429,758266,"2020-09-27 03:44:38","Davis & Sons Plumbing",http://rondavisplumbing.com,patti@bergware.net,"(850) 373-4391","2271 Highway 2",Bonifay,FL,32425,"2271 Highway 2,Bonifay,FL 32425","Septic Tanks & Systems, Bathroom Remodeling, Bathtubs & Sinks-Repair & Refinish, Building Construction Consultants, Building Contractors, Building Contractors-Commercial & Industrial, Construction Consultants, Home Improvements, Home Repair & Maintenance, Kitchen Planning & Remodeling Service, Leak Detecting Service, Plumbers, Plumbing, Drains & Sewer Consultants, Plumbing-Drain & Sewer Cleaning, Septic Tank & System Cleaning, Sewer Cleaners & Repairers, Sewer Contractors, Water Damage Emergency Service",5,"1 Review",A+,30.94641,-85.82457,,"Davis and Sons Plumbing.","Davis and Sons Plumbing a locally, family owned and operated business, proudly serving the community since 1997! Davis and Sons offers residential and commercial services, new construction, remodeling and repair, re-piping of sewer and water lines, video camera drain inspections, and drain cleaning. We are fully licensed and insured. Call today for exceptional service and value!","Mon - Fri: 8:00 am - 5:00 pm",,,"cash, check, money order",,,http://rondavisplumbing.com,"Services: Sewer Main Clearing, Drain Cleaning",f1501999,09/21/2010,five,"You want a really good plumber Mr. Davis is the best. He will work with you and help you any time day or night. He already came to my house on a sunday and no extra charge. We glad we found him",,,,
2400201,758376,"2020-09-27 03:44:38","Jerry's Plumbing & Heating",https://www.jerrysplumbing.com,,"(207) 985-6203","23 Enterprise Dr",Arundel,ME,04046,"23 Enterprise Dr,Arundel,ME 04046","Heating Contractors & Specialties, Geothermal Heating & Cooling Contractors, Kitchen Planning & Remodeling Service, Plumbers, Plumbing-Drain & Sewer Cleaning, Sewer Cleaners & Repairers, Sewer Contractors",,,A+,43.44061,-70.50463,,,,,,,,,"Jerry's Plumbing & Heating Inc","https://www.jerrysplumbing.com http://jerrysplumbing.com",,,,,,,,,
2403566,758849,"2020-09-27 03:44:38","Zell Plumbing & Heating",,,"(651) 777-7333","8920 27th St N","Lake Elmo",MN,55042,"8920 27th St N,Lake Elmo,MN 55042","Heating Contractors & Specialties, Air Conditioning Contractors & Systems, Altering & Remodeling Contractors, Building Contractors, General Contractors, Geothermal Heating & Cooling Contractors, Kitchen Planning & Remodeling Service, Plumbers, Plumbing-Drain & Sewer Cleaning, Sewer Cleaners & Repairers, Sewer Contractors, Water Heaters",,,,44.98864,-92.92558,,,,"Mon - Fri: 8:00 am - 5:00 pm",,,"discover, master card, visa",,,,"Specialties: Laundries, Washing Machines, Washers & Dryers, Kitchens",,,,,,,,
2404249,758933,"2020-09-27 03:44:38","Lauder Plumbing & Heating",http://www.lauderplumbing.com,info@lauderplumbing.com,"(845) 786-3035","65 N Central Hwy",Garnerville,NY,10923,"65 N Central Hwy,Garnerville,NY 10923","Heating Contractors & Specialties, Air Conditioning Contractors & Systems, Air Conditioning Service & Repair, Furnaces-Heating, Geothermal Heating & Cooling Contractors, Kitchen Planning & Remodeling Service, Piping Contractors, Plumbers, Plumbing-Drain & Sewer Cleaning, Sewer Cleaners & Repairers",,,,41.21381,-73.99693,,,,"Mon - Fri: 9:00 am - 5:00 pm",,,"cash, all major credit cards, amex, discover, master card, no credit cards, visa",,"Lauder Plumbing & Heating, LLC","http://www.lauderplumbing.com https://www.lauderplumbing.com","Services: Water Purification System Installation, Sump Pump Repair, Sump Pumps, Sump Pump Installation, Boiler Repair",,,,,,,,
2404361,758951,"2020-09-27 03:44:38","Aaron Plumbing & Heating Co",http://aaronplumbing.com,aaronplumbing77@gmail.com,"(781) 641-0784",,Stoneham,MA,02180,"Stoneham,MA 02180","Heating Contractors & Specialties, Home Improvements, Kitchen Planning & Remodeling Service, Plumbers, Plumbing-Drain & Sewer Cleaning, Sewer Cleaners & Repairers, Sewer Contractors",5,"1 Review",A+,,,,,,,"TollFree: (855) 632-2766",,"discover, master card, visa",,"Aaron Plumbing, Heating & Contracting Aaron Plumbing & Heating CO Aaron Plumbing & Heating CO",http://aaronplumbing.com,,minister99,09/27/2009,five,"John the owner and salesman was so detailed it was unreal. The bathroom came out wonderfull. His crew of different trades were all clean and friendly plus there work was impeccable",,,,