business_x_category.id,business.id,business.ts,business.business_name,business.home_page,business.email_address,business.phone,business.street,business.city,business.state,business.zip_code,business.full_address,business.category,business.rating,business.number_of_reviews,business.bbb_rating_or_license,business.latitude,business.longitude,business.cover_image,business.slogan,business.general_info,business.regular_hours,business.extra_phones,business.services_products,business.payment,business.price_range,business.aka,business.other_links,business.other_information,business.review_1_name,business.review_1_date,business.review_1_rating,business.review_1_text,business.review_2_name,business.review_2_date,business.review_2_rating,business.review_2_text
707060,243576,"2020-09-27 02:53:52","Lines and Stripes, LLC",http://www.linesandstripes.vpweb.com,artmarquez@linesandstripes.net,"(225) 228-6811",,,,,,"Parking Lot Maintenance & Marking, Power Washing",5,"2 Reviews",,,,https://i3.ypcdn.com/blob/f69809353105d2646ca096e79c1460569496a313_100x100_crop.jpg?63f80dd,"Veteran Owned and Operated",,"Mon - Sun: Open 24 Hours",,,"check, cash",,,http://www.linesandstripes.vpweb.com,,"Brian W.",09/08/2019,five,"I got several bids to pressure wash and paint the lines of my parking lot. Art with Lines and Stripes was extremely professional and did a fantastic job. It was worth every penny that I paid. My parking lot now looks as good as it did when I built my building back in 2012.","Nick T.",05/11/2016,five,"Lines and Stripes did an excellent job on our grocery parking lot. I was pleasantly surprised when I drove up to work and noticed the detail and professionalism of the job. Art was very thorough and followed through on everything that he said he was going to do."
707810,243832,"2020-09-27 02:53:52","Alamo City Environmental Services",http://alamocityes.com,admin@alamocityes.com,"(210) 695-8121","17503 La Cantera Pkwy Suite 104-512","San Antonio",TX,78257,"17503 La Cantera Pkwy Suite 104-512,San Antonio,TX 78257","Parking Lot Maintenance & Marking, Cleaning Contractors, Landscaping & Lawn Services, Parking Stations & Garages-Construction, Power Washing, Pressure Washing Equipment & Services, Street Cleaning, Sweeping Service-Power, Trash Hauling",5,"3 Reviews",,29.60772,-98.59864,https://i3.ypcdn.com/blob/ca978173e1b914c1e3fd385aed35f4ab1eea19b5_100x100_crop.jpg?63f80dd,"Central Texas Eco-Management",,"Mon - Sun: Open 24 Hours",,,"check, insurance, company card",,ACES,http://alamocityes.com,,"Brian A.",10/05/2018,five,"Wonderful company! We use AlamoES for all of our landscaping. They maintain our property on a weekly basis. IВ’m very satisfied with their service! They are always on time, they are polite and they are thorough! Thanks AlamoES 5 stars!","Dawn M.",10/04/2018,five,"I called this company because we needed our parking garage power washed. Their manager came with in an hour after speaking to her, gave us a price which was a very reasonable price within 24 hours her and her crew we're out here. They were very knowledgeable of the task at hand, they were polite and within a few hours the job was completed and it looked fantastic I just want to say thank you so much for your prompt response in the great job that y'all did"
707852,243842,"2020-09-27 02:53:52","American Pride Services, LLC",http://www.americanpridestl.com,bryan@americanpridestl.com,"(636) 221-6783",,Wentzville,MO,63385,"Wentzville,MO 63385","Janitorial Service, Cleaning Contractors, Parking Lot Maintenance & Marking, Plumbers, Plumbing, Drains & Sewer Consultants, Plumbing-Drain & Sewer Cleaning, Power Washing, Sewer Cleaners & Repairers, Sweeping Service-Power",,,,,,,"We are a local sweeping company dedicated to provided superior service at competitive prices. We perform additional services such as drain cleaning, window cleaning, power washing, and debris removal.",,"Mon - Sun: Open 24 Hours",,,"check, all major credit cards, amex, carte blanche, company card, debit, diners club, discover, jcb, mastercard, visa",,,http://www.americanpridestl.com,,,,,,,,,
707941,243861,"2020-09-27 02:53:52","Kodiak Industries",,,"(410) 805-9857","Veterans Highway",Washington,DC,20001,"Veterans Highway,Washington,DC 20001","Parking Lot Maintenance & Marking, Parking Lots & Garages, Power Washing, Pressure Washing Equipment & Services, Sweeping Service-Power",,,,38.89037,-77.03196,,,,"Mon - Sun: Open 24 Hours",,,"check, paypal, no credit cards",,,,"Parking: Lot, Free",,,,,,,,
708131,243936,"2020-09-27 02:53:52","Total Power Sweeping Services, Inc.",http://www.totalsweep.com,info@totalsweep.com,"(540) 370-0315","75 Capital Ave Ste 101",Fredericksburg,VA,22406,"75 Capital Ave Ste 101,Fredericksburg,VA 22406","Parking Lot Maintenance & Marking, Power Washing, Street Cleaning, Sweepers-Power, Sweeping Service-Power",,,,38.34757,-77.50747,,,,"Mon - Fri: 8:30 am - 5:00 pm","Phone: (703) 551-1005",,"check, discover, master card, visa",,,http://www.totalsweep.com,,,,,,,,,
708372,244024,"2020-09-27 02:54:01","Outdoor Innovations",http://www.omahacommercialservices.com,omahalandscapedesign@gmail.com,"(402) 290-2181","909 S 68th St",Omaha,NE,68106,"909 S 68th St,Omaha,NE 68106","Landscape Designers & Consultants, Graffiti Removal & Protection, Parking Lot Maintenance & Marking, Power Washing, Snow Removal Service",5,"1 Review",,41.25099,-96.01762,,,"We offer commercial services which include grease removal, line striping, parking lot sweeping, snow removal, graffiti removal, ice dam removal, lanscaping. We focus on quality work and eco friendly solutions for Omaha and the surrounding area.","Mon - Fri: 8:00 am - 6:00 pm","MobilePhone: (402) 957-2181",,"debit, check, paypal, cash, all major credit cards",,,"Commercial Services Landscaping",,nancy.cote.144,10/05/2012,five,"Outdoor Innovations recently completed a retaining wall and rebuilding the steps and cap on our front porch. My husband and I could not be happier with the results. Joe and his team were very professional, friendly and courteous. When we had questions or concerns they were addressed in a timely and complete manner. Joe always took to the time to make sure that all of our worries were laid to rest. I have already referred a friend that was equally happy with her results and would not hesitate to recommend Outdoor Innovations to friends and family. I will call Outdoor Innovations in the future for all my landscaping needs.",,,,
708645,244107,"2020-09-27 02:54:01","Yosco Joseph Painting",,,"(831) 622-7339","PO Box 4691","Carmel By The Sea",CA,93921,"PO Box 4691,Carmel By The Sea,CA 93921","Power Washing, Building Contractors-Commercial & Industrial, Cleaning Contractors, Deck Cleaning & Treatment, Faux Painting & Finishing, Painting Contractors, Painting Contractors-Commercial & Industrial, Parking Lot Maintenance & Marking, Parking Stations & Garages-Construction",5,"3 Reviews",,36.5546,-121.9203,,,,,,,,,,,,"P R.",04/26/2014,five,"Professional, knowledgeable, polite, punctual, and skilled describe Joseph Yosco and his exceptional crew. Recently, they painted the exterior of my home. During that time, they went beyond prepping and painting, finding areas of dry rot and repairing them thoroughly and expertly. While working, they also took great care with all of the landscaping. After a full day's work, they left a very tidy worksite as well. Throughout the project, I was consulted and updated. As soon as I am ready to paint the interior of my home, I will be calling Joseph Yosco again and no one else. I am only sorry the highest rating is five stars.",aherman1383,07/29/2013,five,"I wouldn't have any other painters work on my home or business! Joseph and his crew are the most honest and conscientious people you will ever meet. Their standards are the highest and they are not satisfied until you have the best possible results! They truly care about their workmanship. Additionally, they are able to take care of many handyman type jobs as well as their excellent painting. Prices are competitive. Important for me: they are very comfortable and expert in using eco-friendly paint products,, which I require, both indoors and out."
708662,244111,"2020-09-27 02:54:01","American Property Maintenance - Nashville Parking Lot Sweeping",http://www.tnapm.net,,"(615) 406-9748","5075 Main St","Spring Hill",TN,37174,"5075 Main St,Spring Hill,TN 37174","Landscaping & Lawn Services, Parking Lot Maintenance & Marking, Power Washing, Property Maintenance, Snow Removal Service",,,,35.76634,-86.91944,,"Professional Property Maintenance Services.",,"Mon - Sun: 8:00 am - 6:00 pm",,,"all major credit cards",,,"Nashville Parking Lot Sweeping",,,,,,,,,
709064,244227,"2020-09-27 02:54:01","Jordan Enterprise Striping And Power Washing",,jordanentstripe@yahoo.com,"(903) 575-7168","50 County Road 3314",Omaha,TX,75571,"50 County Road 3314,Omaha,TX 75571","Parking Lot Maintenance & Marking, Painting Contractors-Commercial & Industrial, Power Washing, Pressure Washing Equipment & Services, Sealers Asphalt, Concrete, Etc.",,,,33.18691,-94.75239,https://i3.ypcdn.com/blob/146d67b195ef6828ef7ae487127da0b1e5806380_100x100_crop.jpg?63f80dd,"We Do The Dirty Work S You Don't Have Too...",,"Mon - Fri: 9:00 am - 5:30 pm Sat: 10:00 am - 5:00 pm Sun: 1:00 pm - 5:00 pm","MobilePhone: (903) 575-7168",,"check, paypal, cash, financing available, insurance",,,,,,,,,,,,
709186,244255,"2020-09-27 02:54:01",Stripe-It-Up,http://www.stripe-it-up.com,tyler@stripe-it-up.com,"(512) 966-2511","11675 Jollyville Rd",Austin,TX,78759,"11675 Jollyville Rd,Austin,TX 78759","Parking Lots & Garages, Asphalt Paving & Sealcoating, Pavement & Floor Marking Services, Power Washing, Sealers Asphalt, Concrete, Etc., Signs",,,A+,30.41843,-97.75119,https://i4.ypcdn.com/blob/46aa829a54165d8094015c71cab3212fa4fba181_100x100_crop.jpg?63f80dd,,,"Mon - Fri: 8:00 am - 5:00 pm",,,"visa, discover, mastercard, all major credit cards, amex, check, debit",,,http://www.stripe-it-up.com,,,,,,,,,
710213,244595,"2020-09-27 02:54:01","NICKCHAN CONCRETE STRIPING LLC",,,"(469) 237-0506","4606 Forest Park Rd",Plano,TX,75024,"4606 Forest Park Rd,Plano,TX 75024","Parking Lot Maintenance & Marking, Power Washing",,,,33.08562,-96.7878,,"BEST SELECTION BEST PRICE","Product and Service COMMERCIAL REMODING,POWER WASHING ,LOT STRIPING,and LANDSCAPING",,,,check,,,,,,,,,,,,
710302,244617,"2020-09-27 02:54:01","orange county power washing",,service@orangecountypowerwashing.com,"(949) 266-4141",,Irvine,CA,92604,"Irvine,CA 92604","Parking Lot Maintenance & Marking, Building Maintenance, Graffiti Removal & Protection, Power Washing, Roof Cleaning",5,"1 Review",,,,,,"Window CleaningPressure WashingRain Gutter CleaningCommercial Hot Power WashingCommercial Window CleaningTile Roof CleaningRoof Repair & ResealingAwning Cleaning and Awning InstallationYard Clean Up, Landscaping, Tree TrimmingGraffiti removalPainting Commercial-ResidentialGas Station WashingThe Cities and Areas which we service:Orange County, California: Aliso Viejo, Anaheim, Anaheim Hills, Atwood, Brea , Buena Park, Capistrano Beach, Corona Del Mar, Costa Mesa, Coto de Caza, Cypress, Dana Point, Dove Canyon, El Toro, Foothill Ranch, Fountain Valley, Fullerton, Garden Grove, Huntington Beach, Huntington Harbor, Irvine, La Habra, La Palma, Ladera Ranch, Laguna Beach, Laguna Hills, Laguna Niguel, Laguna Woods, Lake Forest, Lemon Heights, Los Alamitos, Midway City, Mission Viejo, Monarch Beach, Newport Beach, Newport Coast, Orange, Peralta Hills, Placentia, Rancho Santa Margarita, San Clemente, San Juan Capistrano, Santa Ana, Santa Ana Heights, Seal Beach, Silverado, South Laguna, Stanton, Sunset Beach, Surfside, Trabuco Canyon, Tustin, Villa Park, Westminster, Yorba Linda.",,,,,,,,,fred_pour,04/30/2011,five,"В“I got an appointment very easily. The guy arrived on time and was very polite. He cleaned the roof thoroughly and carefully and treated the roof with chemicals. It was a good job. What's worth mentioning is that we've put on some gutter covers and he removed them, cleaned them and put them back without charging us extra. They are right. Now my roof looks like new. I highly recommend them.В”",,,,
710389,244640,"2020-09-27 02:54:01","Titan Pressure Washing",http://www.titanwashing.com,,"(817) 789-1881",,"Fort Worth",TX,76148,"Fort Worth,TX 76148","Parking Lot Maintenance & Marking, Graffiti Removal & Protection, Power Washing, Pressure Washing Equipment & Services, Truck Washing & Cleaning",5,"1 Review",,,,https://i4.ypcdn.com/blob/987863d1d4696d470ce4a3eff66bbe24ea503405_100x100_crop.jpg?63f80dd,,"Pressure washing, power washing",,,,"amex, mastercard, discover",,,http://www.titanwashing.com,,"Joshua T.",12/01/2014,five,"Quality service with competent employees. The work turned out better than I had expected. These guys know their stuff and go the extra mile. Highly recommended!",,,,
710655,244733,"2020-09-27 02:54:01","Smith Elite Striping",http://www.sestriping.com,,"(706) 992-1713","1721 Old Epps Bridge Rd",Athens,GA,30606,"1721 Old Epps Bridge Rd,Athens,GA 30606","Parking Lot Maintenance & Marking, Asphalt Paving & Sealcoating, Pavement & Floor Marking Services, Power Washing, Street Cleaning",,,,33.91872,-83.42686,,,,"Mon - Fri: 9:00 am - 5:00 pm",,,,,,http://www.sestriping.com,,,,,,,,,
710951,244840,"2020-09-27 02:54:01","AVereran Striping",http://www.aveteranstriping.wix.com/Aveteranstriping,,"(832) 312-0737","21500 Park Row Dr Apt 503",Katy,TX,77449,"21500 Park Row Dr Apt 503,Katy,TX 77449","Parking Lot Maintenance & Marking, Asphalt Paving & Sealcoating, Painting-Production, Parking Lots & Garages, Power Washing",,,,29.79447,-95.74792,,,"AVETERAN STRIPING provides parking lot striping and painting for East Texas. I take pride in my work and will work around any of your schedule needs. Call or email for an appointment for free estimate.",,,,check,,,http://www.aveteranstriping.wix.com/Aveteranstriping,,,,,,,,,
710974,244850,"2020-09-27 02:54:01","MB3 Services, Inc.",,mark@mb3services.com,"(330) 432-0976","7197 State Route 516 NW",Dundee,OH,44624,"7197 State Route 516 NW,Dundee,OH 44624","Janitorial Service, Concrete Restoration, Sealing & Cleaning, Parking Lot Maintenance & Marking, Power Washing, Pressure Washing Equipment & Services",,,,40.56999,-81.59492,,,,,"Phone: (330) 852-7046",,"check, cash",,,,,,,,,,,,
711062,244886,"2020-09-27 02:54:01","The Thesing Companies",http://www.thesingcompanies.com,,"(888) 896-1616",,,,,,"Power Washing, Construction Site-Clean-Up, Parking Lot Maintenance & Marking, Street Cleaning, Sweeping Service-Power",,,,,,https://i3.ypcdn.com/blob/dd3c4b6933f62578475d0e652ca4b95ef5366394_100x100_crop.jpg?63f80dd,,"Thesing Power Sweeping, Inc. was established in 1988 and provides street sweeping services for new home construction, heavy highway construction, parking lots, special events and municipalities in New Jersey (NJ), Pennsylvania (PA), Delaware (DE) and Maryland (MD). We are a fully Department of Transportation compliant company that has received accolades for our standard safety and operating procedures.","Mon - Sun: Open 24 Hours",,,"visa, mastercard",,,http://www.thesingcompanies.com,,,,,,,,,
711141,244907,"2020-09-27 02:54:01","Reliable Moving & Services Unlimited",,k76_ad@hotmail.co,"(504) 253-0659",,Jonesboro,GA,30236,"Jonesboro,GA 30236","Building Restoration & Preservation, Movers, Parking Attendant Service, Power Washing, Wallpapers & Wallcoverings-Installation",,,,,,,,,"Mon - Sun: 8:00 am - 5:00 pm",,,,,,,,,,,,,,,
711776,245094,"2020-09-27 02:54:09","PERFORMANCE SWEEPING & MAINTENANCE, INC",http://www.psmioregon.com,,"(541) 844-5100","PO Box 2306",Eugene,OR,97402,"PO Box 2306,Eugene,OR 97402","Parking Lot Maintenance & Marking, Power Washing, Pressure Washing Equipment & Services, Street Cleaning, Sweeping Service-Power",,,,44.06124,-123.155525,,"Personal Service, Quality Work, and Affordable Pricing is what keeps our customers coming back, and referring us to their neighbors, family, and friends.","STREET SWEEPING & PARKING LOT CLEANING IN THE CITY OF EUGENE, OREGON & SURROUNDING COMMUNITIES OF LANE COUNTY, DOUGLAS COUNTY, LINN COUNTY & BENTON COUNTY, OREGON. Let us help you keep your investment clean and invitingВ… Free of dirt, debris, and unsightly garbage. Parking Lot & Street Sweeping Services HomeownersВ’ Associations Streets or Highways Private Driveways Retail Malls Mills Construction Sites (Track-Out) Apartment Complexes Shopping Centers Commercial and Industrial Our equipment includes mid-size industrial sweepers with a modified water systems to assist with dust reduction. Our equipment operates well in small and large areas. Our goal is to be your local all-in-one exterior company. Along with our Sweeping & Power Washing services we also offer: Exterior Maintenance Services Lawn Maintenance Shrub Trimming Weed Eating Debris Removal Application of Bark, Rock, Etc. Gutter Cleaning De-Icing (Winter Months) Power Washing Services: Driveways Sidewalks Walkways Drive-thrus Store fronts Pavers Buildings (Most surfaces) It is likely that if your surface areas are not maintained, they will reflect stains, unwanted build-up of dirt, grime, gum, oil, leakage from garbage cans and unsightly moss or mold. These bacteriaВ’s will likely be tracked into your business or home over time. It is also likely that if your surface areas are not maintained, they can deteriorate and will result in costly replacements. We have mobile water, great industrial equipment, and we are conscious of our environment! CHANCES ARE WE CAN BEAT YOUR CURRENT QUOTED PRICE!","Mon - Fri: 8:00 am - 5:00 pm",,,check,,,"Eugene-Springfield Oregon, Lane County Sweeping, and Parking Lot Maintenance Company-Services",,,,,,,,,
712499,245333,"2020-09-27 02:54:10","Clean It Right",http://www.cleanitright.com,steve@CleanItRight.com,"(801) 288-8899","2844 W Leisure Cir","West Jordan",UT,84084,"2844 W Leisure Cir,West Jordan,UT 84084","Power Washing, Cleaning Contractors, Parking Lot Maintenance & Marking, Parking Stations & Garages-Construction",5,"2 Reviews",A+,40.61754,-111.96132,https://i3.ypcdn.com/blob/e444d49c930c63a313283e715c56d899ef641290_100x100_crop.jpg?63f80dd,"CLEAN It RIGHT Offers Professional Pressure Washing Services For Concrete Cleaning, Driveways, Strip Malls, Parking Garages and Parking Lots.","Welcome to Clean It Right, Inc. We are a family owned and operated business. CLEAN IT RIGHT: has been pressure washing Salt Lake City, Utah and surrounding cities since 1989. We offer pressure washing services to large and small commercial, industrial, and residential customers. We can clean just about any exterior and some interior surfaces. if it can be seen, it can be cleaned. CLEAN IT RIGHT: offers professional pressure washing services for concrete cleaning, driveways, strip malls, parking garages, parking lots. we also specialize in graffiti removal, brick cleaning, Parking Garages & Lots, Line Striping and wood cleaning and restoration. CLEAN IT RIGHT: is the right company to help with your pressure washing needs. Please don't hesitate to pick up the phone and let us know how we can help. We offer free estimates and on site evaluations to help you understand the best way to maintain and protect your property. CLEAN IT RIGHT: is a Green Cleaning Company. We follow the BMP/EPA/CWA guidelines. We are certified in Wash Water Recovery.","Mon - Sat: 8:00 am - 5:00 pm Sun Closed",,,"amex, check, debit, discover, visa, mastercard",,,http://www.cleanitright.com,,"Kara L.",05/14/2016,five,"I am remodeling a1962 farm house and needed the brick and foundation cleaned. Steve and his team got the job done. They were friendly and professional. I never thought 50 years of dirt, grime and water stains could be removed but they did it. Amazing really.",goverby,02/04/2013,five,
712641,245374,"2020-09-27 02:54:10","Total Access Commercial Window Cleaning Solutions",http://totalaccesswindows.com,laurie@firstchoicestaffingllc.com,"(303) 477-9202","4301 Gaylord St",Denver,CO,80216,"4301 Gaylord St,Denver,CO 80216","Building Cleaning-Exterior, Building Cleaners-Interior, Building Maintenance, Cleaning Contractors, Construction Site-Clean-Up, Janitorial Service, Parking Lot Maintenance & Marking, Power Washing, Pressure Washing Equipment & Services, Snow Removal Service, Water Pressure Cleaning, Window Cleaning",5,"1 Review",,39.77677,-104.96167,https://i3.ypcdn.com/blob/deafb68db36e0fbec742b7b46d03a79793f6a160_100x100_crop.jpg?63f80dd,"Specializing in all your commercial building needs","At Total Access Solutions, we specialize in interior and exterior window washing for commercial buildings, but our services go above and beyond that. Beyond window washing, we want to make sure your buildingВ’s interior and exterior fa?ade is clean and maintained, giving your building a clean professional appearance. After all, your customerВ’s first impression of your building is important!","Hours Appointment Only Hours Sat 9:00 am - 7:00 pm Regular Hours Mon - Fri: 9:00 am - 7:00 pm Sun Closed",,,"mastercard, amex, check, debit, discover, visa",,,http://totalaccesswindows.com,,"Sarah C.",12/19/2016,five,"Very professional...these guys know exactly what they're doing. Glad we didn't call just anyone. Superior job!",,,,
712925,245466,"2020-09-27 02:54:10","All Aspects Pressure Washing",,mkaanderson@yahoo.com,"(678) 702-7546","6000 Avonlea Pl Apt 304",Woodstock,GA,30189,"6000 Avonlea Pl Apt 304,Woodstock,GA 30189","Parking Lot Maintenance & Marking, Building Cleaning-Exterior, Power Washing",,,,34.09991,-84.53449,,"Expert Pressure Washing Services. Specializing in cleaning windows, siding, driveways/sidewalks, gutters and roofs. We truly cover ALL ASPECTS of your pressure washing needs at discount prices. Call today for a free estimate!","We provide superior pressure washing services at discount prices throughout the Metro Atlanta area. Call for a free estimate today!","Mon - Sun: Open 24 Hours",,,check,,,,,,,,,,,,
713177,245547,"2020-09-27 02:54:10","One Source Facility Solutions Inc.",,,"(714) 630-6333","3160 E La Palma Ave Ste D",Anaheim,CA,92806,"3160 E La Palma Ave Ste D,Anaheim,CA 92806","Janitorial Service, Building Maintenance, Cleaning Contractors, Janitors Equipment & Supplies, Parking Lot Maintenance & Marking, Power Washing, Sweeping Service-Power",,,A+,33.85162,-117.85496,,"We are dicated in servicing local business's with Janitorial and Building Maintenance. We Now offer Janitorial and Paper Supplies.","We have been providing Janitorial and Building Maintenance Services to Business's LA, Orange and San Bernardino Counties since 1985.","Mon - Sun: Open 24 Hours","Phone: (714) 630-6322 Fax: (714) 808-1407",,"master card, amex, visa",,,,,,,,,,,,
713520,245664,"2020-09-27 02:54:10","Flyer Striping Inc",http://www.flyerstripinginc.com,,"(636) 464-7900","4190 Jeffco Blvd",Arnold,MO,63010,"4190 Jeffco Blvd,Arnold,MO 63010","Parking Lot Maintenance & Marking, Asphalt Paving & Sealcoating, Building Contractors, Cleaning Contractors, Municipal Supplies, Parking Lots & Garages, Parking Stations & Garages-Construction, Pavement & Floor Marking Services, Paving Contractors, Paving Materials, Power Washing, Sealers Asphalt, Concrete, Etc., Signs, Snow Removal Service, Traffic Signs & Signals, Water Pressure Cleaning",,,A+,38.39833,-90.37459,https://i3.ypcdn.com/blob/bf1acb6b3a048e72b930c6cb6596a5c460aa9c32_100x100_crop.jpg?63f80dd,"50 Million Feet of Paint since 1978","Please Visit Our Web Site for Additional Information",,,,,,,"http://www.flyerstripinginc.com http://www.flyerstriping.com","Specialties: Pavement, Signs Services: Wet Blasting",,,,,,,,