business_x_category.id,business.id,business.ts,business.business_name,business.home_page,business.email_address,business.phone,business.street,business.city,business.state,business.zip_code,business.full_address,business.category,business.rating,business.number_of_reviews,business.bbb_rating_or_license,business.latitude,business.longitude,business.cover_image,business.slogan,business.general_info,business.regular_hours,business.extra_phones,business.services_products,business.payment,business.price_range,business.aka,business.other_links,business.other_information,business.review_1_name,business.review_1_date,business.review_1_rating,business.review_1_text,business.review_2_name,business.review_2_date,business.review_2_rating,business.review_2_text
17499846,2553424,"2020-09-27 06:38:02","Citizens Bank",https://locations.citizensbank.com/ma/groton/163-main-st.html,,"(617) 551-6205","163 W Main St",Groton,MA,01450,"163 W Main St,Groton,MA 01450","Banks, ATM Locations, Commercial & Savings Banks, Financial Planning Consultants, Investments, Mortgages, Real Estate Loans",,,,42.60398,-71.61814,,,"At Citizens Bank, we are here to help you bank better. So, if you have a question about buying a house, paying for college, saving for retirement, taking on debt in a smart way or any other question about money, donВ’t keep it to yourself. Ask a Citizen. We have approximately 1,150 Citizens Bank branches in 11 states and approximately 3,300 ATMs. In addition, our customers stay connected with us 24/7 online, through our award-winning mobile app and via our round-the-clock customer contact center. Member FDIC. Equal Housing Lender.","Mon - Wed: 9:00 am - 4:00 pm Thu - Fri: 9:00 am - 5:00 pm Sat: 9:00 am - 1:00 pm Sun Closed",,,"amex, discover, visa",,,https://locations.citizensbank.com/ma/groton/163-main-st.html,"Specialties: Mutual Funds, Stocks",,,,,,,,
17499878,2553435,"2020-09-27 06:38:02","Merchants Bank",https://www.merchantsbank.com,jmstruckmann@merchantsbank.com,"(952) 841-4260","18550 Joplin Ave",Lakeville,MN,55044,"18550 Joplin Ave,Lakeville,MN 55044","Banks, ATM Locations, Commercial & Savings Banks, Financial Planning Consultants, Financial Services, Loans, Mortgages, Real Estate Loans",,,A+,44.68074,-93.28044,,"Local Community Decisions. Regional Strength.","Merchants Bank offers a complete line of commercial, personal and mortgage banking solutions to fit your personalized needs.","Mon - Fri: 9:00 am - 5:00 pm","Phone: (952) 837-4063 Toll Free: (800) 944-6285 TollFree: (800) 944-6285 TollFree: (800) 765-2194",,"visa, debit",,"Merchants Bank National Assoc","https://www.merchantsbank.com http://merchantsbank.com http://blog.merchantsbank.com",,,,,,,,,
17499951,2553457,"2020-09-27 06:38:02","Sandy Spring Bank",http://www.sandyspringbank.com/locations,,"(301) 774-6400","9822 Falls Rd",Potomac,MD,20854,"9822 Falls Rd,Potomac,MD 20854","Commercial & Savings Banks, ATM Locations, Banks, Financing Services, Insurance, Mortgages, Real Estate Loans",,,,39.01684,-77.21059,,,,"Mon - Thu: 9:00 am - 3:00 pm Fri: 9:00 am - 5:00 pm Sat: 9:00 am - 12:00 pm",,,,,"Sandy Spring Bank ATM",http://www.sandyspringbank.com/locations,,,,,,,,,
17500032,2553486,"2020-09-27 06:38:02","Bellco Credit Union",http://www.bellco.org,,"(720) 479-5275","2478 Highway 6 And 50 Unit A","Grand Junction",CO,81505,"2478 Highway 6 And 50 Unit A,Grand Junction,CO 81505","Credit Unions, ATM Locations, Alternative Loans, Banks, Financial Planning Consultants, Financial Services, Loans, Mortgages, Real Estate Loans, Savings & Loans",,,,39.08549,-108.59187,,,"The smartest place to bank isn't a bank. It's Bellco. Bellco is a progressive, member-owned credit union with a full range of financial services. Welcome to the Grand Junction Bellco Credit Union branch, where you'll find world-class customer service and the full range of financial services you need - from checking and savings accounts to credit cards and car loans. Stop by your convenient Grand Junction location today to see what makes Bellco so different. Bellco is different. While banks focus on their shareholders and their stock value, Bellco exists to serve our members, not ourselves. Which means we charge you less and give you more. Unlike a for-profit bank, we return our profits to our members in the form of lower rates on loans, higher interest on deposits, and better services. And you'll like knowing you re doing business with one of the largest credit unions in Colorado. Founded in 1936, Bellco has over 194,000 members and over $2 billion in assets. We actively support the community, donating funds and employee volunteer hours to many health and family-related causes.","Drive-Thru Hours Mon 9:00 am - 6:00 pm Tue - Thu 9:00 am - 5:00 pm Fri 9:00 am - 6:00 pm Sat 9:00 am - 2:00 pm",,,"debit, check, visa",,"Bellco Credit Union, Grand Junction Branch","http://www.bellco.org https://www.bellco.org/bellco-branches-and-atms/grand-junction-branch.aspx",,,,,,,,,
17500169,2553536,"2020-09-27 06:38:02",BankCherokee,https://www.bankcherokee.com,info@bankcherokee.com,"(651) 483-3559","999 Village Center Dr","Saint Paul",MN,55127,"999 Village Center Dr,Saint Paul,MN 55127","Commercial & Savings Banks, ATM Locations, Banks, Investments, Loans, Mortgages, Real Estate Loans",,,,45.08138,-93.11731,https://i2.ypcdn.com/blob/1a19404349e9280432108c969d5b28c9be69f6a3_100x100_crop.jpg?f9d23e1,"BankLocal. BankBetter. BankCherokee.",,"Mon - Fri: 9:00 am - 5:00 pm Sat: 9:00 am - 12:00 pm","Phone: (651) 483-6691 Fax: (651) 483-6691 TollFree: (877) 243-7533",,debit,,,"https://www.bankcherokee.com http://bankcherokee.com",,,,,,,,,
17500293,2553577,"2020-09-27 06:38:02","Chemical Bank",http://www.chemicalbank.com,matashk@alpenacounty.org,"(231) 832-3211","840 S Chestnut St","Reed City",MI,49677,"840 S Chestnut St,Reed City,MI 49677","Banks, ATM Locations, Commercial & Savings Banks, Financial Planning Consultants, Financial Services, Financing Services, Loans, Mortgages, Real Estate Loans",,,,43.86428,-85.50936,,,"For over 95 years, Chemical Bank's hometown approach to banking has been focused on community banking, highlighted by local leadership, a devotion to community and personalized service. Member FDIC","Mon - Fri: 7:00 am - 9:00 pm Sat: 8:00 am - 2:00 pm","Fax: (231) 832-9608 Fax Number: (231) 832-9608 TollFree: (866) 800-2627",,"mastercard, all major credit cards, amex, visa, discover",,"Chemical Bank Downtown Branch 24 Hour ATM","http://www.chemicalbank.com https://www.chemicalbank.com http://chemicalbankmi.com",,,,,,,,,
17500654,2553727,"2020-09-27 06:38:02","Citizens Bank",https://locations.citizensbank.com/pa/dallas/15-main-st.html,gisprod@citizensbank.com,"(570) 675-1177","15 Main St",Dallas,PA,18612,"15 Main St,Dallas,PA 18612","Commercial & Savings Banks, ATM Locations, Banks, Financing Services, Investments, Mortgages, Real Estate Loans",,,,41.33583,-75.96308,,,"At Citizens Bank, we are here to help you bank better. So, if you have a question about buying a house, paying for college, saving for retirement, taking on debt in a smart way or any other question about money, donВ’t keep it to yourself. Ask a Citizen. We have approximately 1,150 Citizens Bank branches in 11 states and approximately 3,300 ATMs. In addition, our customers stay connected with us 24/7 online, through our award-winning mobile app and via our round-the-clock customer contact center. Member FDIC. Equal Housing Lender.","Mon - Thu: 9:00 am - 5:00 pm Fri: 9:00 am - 6:00 pm Sat: 9:00 am - 12:00 pm Sun Closed",,,"master card, visa, debit, all major credit cards",,,https://locations.citizensbank.com/pa/dallas/15-main-st.html,,,,,,,,,
17500721,2553752,"2020-09-27 06:38:02",BankFive,https://www.bankfive.com/Locations/Swansea-Office,lisa.celio@bankfive.com,"(774) 888-6100","497 Milford Rd",Swansea,MA,02777,"497 Milford Rd,Swansea,MA 02777","Banks, ATM Locations, Commercial & Savings Banks, Financial Services, Financing Services, Loans, Mortgages, Real Estate Loans, Savings & Loans",,,,41.75049,-71.21342,,,,Hours,,,"apple pay, cash, check, debit, visa",,,"Primary Website",,,,,,,,,
17500974,2553874,"2020-09-27 06:38:02","Community Bank Of Bergen County Atm",http://www.cbbcnj.com,CustomerSupport@cbbcnj.com,"(201) 791-0101","12-79 River Rd","Fair Lawn",NJ,07410,"12-79 River Rd,Fair Lawn,NJ 07410","Commercial & Savings Banks, ATM Locations, Banks, Mortgages, Real Estate Loans",,,,40.934296,-74.1166,https://i2.ypcdn.com/blob/07ccc9e95ef512dd1c679403ca174ad5472b8400_100x100_crop.jpg?f9d23e1,,,"Mon - Fri: 7:30 am - 6:00 pm Sat: 9:00 am - 2:00 pm Sun: 10:00 am - 2:00 pm","Phone: (201) 587-1333 Phone: (201) 791-6336",,,,"Community Bank of Bergen County, NJ",http://www.cbbcnj.com,,,,,,,,,
17501180,2553956,"2020-09-27 06:38:02","Security Bank of Kansas City",https://www.securitybankkc.com/about/locations-and-atms,marketing@securitybankkc.com,"(913) 281-3165","2701 Shawnee Mission Pkwy",Fairway,KS,66205,"2701 Shawnee Mission Pkwy,Fairway,KS 66205","Commercial & Savings Banks, ATM Locations, Banks, Real Estate Loans",,,,39.03308,-94.61687,https://i2.ypcdn.com/blob/d13a9b4484709c15ffe7fac27f768806a3410dbe_100x100_crop.jpg?f9d23e1,"More ways to bank. Look for the leaf!",,"Mon - Thu: 7:00 am - 4:00 pm Fri: 7:00 am - 5:00 pm Sat: 9:00 am - 12:00 pm","Primary Phone: (913) 384-3300 Phone: (913) 384-3300",,debit,,,"https://www.securitybankkc.com/about/locations-and-atms http://securitybankkc.com/about/locations-and-atms",,,,,,,,,
17501320,2554012,"2020-09-27 06:38:12","Jackson County Bank",http://www.jcbank.com,,"(812) 275-1120","2635 16th St",Bedford,IN,47421,"2635 16th St,Bedford,IN 47421","Commercial & Savings Banks, ATM Locations, Banks, Financial Services, Financing Services, Loans, Mortgages, Real Estate Loans",,,,38.86141,-86.50915,,,,"Mon - Fri: 9:00 am - 5:00 pm","Phone: (812) 275-1122 Phone: (812) 275-1131 Fax: (812) 275-1131 Fax Number: (812) 275-1131 TollFree: (800) 893-3683",,,,"Jackson County Bank ATM",http://www.jcbank.com,,,,,,,,,
17501781,2554208,"2020-09-27 06:38:12","Farmington Bank",http://www.farmingtonbankct.com/Wethersfield,info@farmingtonbankct.com,"(877) 376-2265","486 Silas Deane Hwy",Wethersfield,CT,06109,"486 Silas Deane Hwy,Wethersfield,CT 06109","ATM Locations, Banks, Loans, Mortgages, Real Estate Loans",,,,41.71276,-72.66351,,"You've Come to the Right Place","Farmington Bank is a full-service community bank with more than $1.7 billion in assets and branch offices throughout Central Connecticut. Established in 1851, Farmington Bank is a diversified consumer and commercial bank with an ongoing commitment to contribute to the betterment of the communities in our region. Farmington Bank is a wholly-owned subsidiary of First Connecticut Bancorp.","Mon - Wed: 8:30 am - 6:00 pm Thu - Fri: 8:30 am - 7:00 pm Sat: 9:00 am - 3:00 pm Sun Closed","TollFree: (877) 376-2265",,,,,http://www.farmingtonbankct.com/Wethersfield,,,,,,,,,
17501791,2554210,"2020-09-27 06:38:12","Five Points Bank",http://www.5pointsbank.com,careers@5pointsbank.com,"(308) 234-6171","1809 W 39th St",Kearney,NE,68845,"1809 W 39th St,Kearney,NE 68845","Investments, ATM Locations, Banks, Loans, Mortgages, Real Estate Loans",,,,40.71439,-99.10472,https://i2.ypcdn.com/blob/9d941b4fec814b9801d38db860d8bacb6a9b2137_100x100_crop.jpg?f9d23e1,"The personalized gateway to your finances...and your world!","Please check out our website for detailed information about personal and business banking. Your Full-Service Bank! Our ATM's are available 24 hours for your convenience!","Mon - Fri: 8:30 am - 4:30 am Sat - Sun Closed",,,debit,,,"http://www.5pointsbank.com http://5pointsbank.com/INDEX.ASPX",,,,,,,,,
17501820,2554223,"2020-09-27 06:38:12","Evergreen Federal Bank",http://evergreenfederal.bank,mvierra@evergreenbanking.com,"(541) 582-0512","101 Pine St","Rogue River",OR,97537,"101 Pine St,Rogue River,OR 97537","Commercial & Savings Banks, ATM Locations, Banks, Financial Services, Financing Services, Loans, Mortgages, Real Estate Loans",,,,42.43454,-123.17042,,,"Evergreen Federal Bank is a mutual institution serving customers locally in Southern Oregon. Evergreen specializes in mortgage, construction, and commercial lending with in-house servicing. We offer a variety of savings and checking products combined with person-to-person service at your local branch.","M Closed, Tu-F 9am-5pm, Sa-Su Closed (Drive Up Hours: Mon-Friday 8:30a-5:30p | Closed Sat/Sun)","TollFree: (800) 275-6148",,,,,http://Evergreenfederal.bank,,,,,,,,,
17501924,2554258,"2020-09-27 06:38:12","Lakeland Bank",http://lakelandbank.com,DLeary@lakelandbank.com,"(973) 300-3300","11 Hampton House Rd",Newton,NJ,07860,"11 Hampton House Rd,Newton,NJ 07860","Commercial & Savings Banks, ATM Locations, Banks, Mortgages, Real Estate Loans",,,,41.06922,-74.74455,,,,"Mon - Fri: 8:30 am - 6:00 pm Sat: 9:00 am - 2:00 pm Sun: 10:00 am - 1:00 pm","Primary Phone: (973) 300-9432",,discover,,"Lakeland Bank Atm",http://lakelandbank.com,,,,,,,,,
17501931,2554259,"2020-09-27 06:38:12","Chemical Bank",http://www.chemicalbank.com,Escalated.Case@ChemicalBankMI.com,"(989) 465-6121","375 E Railway St",Coleman,MI,48618,"375 E Railway St,Coleman,MI 48618","Commercial & Savings Banks, ATM Locations, Banks, Financial Services, Loans, Mortgages, Real Estate Loans",,,,43.75626,-84.58545,,,"For over 95 years, Chemical Bank's hometown approach to banking has been focused on community banking, highlighted by local leadership, a devotion to community and personalized service. Member FDIC","Mon - Thu: 8:30 am - 4:30 pm Fri: 8:30 am - 5:30 pm Sat: 9:00 am - 12:00 pm","Phone: (989) 465-0089 Fax: (989) 465-0089 Fax Number: (989) 465-0089",,"debit, master card, visa",,"Chemical Bank ATM",http://www.chemicalbank.com,,,,,,,,,
17501955,2554269,"2020-09-27 06:38:12","Nevada State Bank",http://www.nsbank.com,,"(702) 383-0009","4970 E Tropicana Ave","Las Vegas",NV,89121,"4970 E Tropicana Ave,Las Vegas,NV 89121","Commercial & Savings Banks, ATM Locations, Banks, Financing Services, Mortgages, Real Estate Loans",,,,36.10039,-115.06436,https://i2.ypcdn.com/blob/a4f60a193d3d5a56d71e3af640fd37dd22a92d64_100x100_crop.jpg?f9d23e1,,,"Mon - Thu: 9:00 am - 5:00 pm Fri: 9:00 am - 6:00 pm Sat - Sun Closed",,,,,"Nevada State Bank Tropicana and Nellis Branch","http://www.nsbank.com https://www.nsbank.com/branch/?branch=tropicana_and_nellis_branch",,,,,,,,,
17502001,2554284,"2020-09-27 06:38:12","Bankfirst Financial Services",http://www.bankfirstfs.com,lmanning@bankfirstfs.com,"(662) 494-1964","7342 Highway 45 Alt N","West Point",MS,39773,"7342 Highway 45 Alt N,West Point,MS 39773","Banks, ATM Locations, Commercial & Savings Banks, Credit Card Companies, Credit Card-Merchant Services, Financial Planners, Financial Planning Consultants, Financial Services, Financing Services, Internet Banking, Loans, Mortgages, Real Estate Loan Processing, Real Estate Loans",,,,33.61283,-88.65885,,,"Founded in 1888, BankFirst is driven by strong values and a long-term, disciplined perspective that emphasizes our commitment to providing high-quality financial products and services as well as delivering exceptional customer service. We are passionate about supporting our communities through socially responsible leadership and cultivating a strong and positive corporate culture. Backed with a long history of strength and security, BankFirst continues to provide innovative products and services designed to meet customersВ’ needs, while helping communities to prosper and grow.","Mon - Thu: 9:00 am - 4:30 pm Fri: 9:00 am - 5:30 pm Sat - Sun Closed","Client Contact Center: (877) 441-2784",,"all major credit cards, visa, mastercard",,"BankFirst ATM BankFirst Equipment Finance BankFirst Financial Services","Primary Website",,,,,,,,,
17502064,2554310,"2020-09-27 06:38:12","Seven Seventeen Credit Union Inc",http://www.sscu.net,,"(330) 492-1106","4450 Belden Village St NW",Canton,OH,44718,"4450 Belden Village St NW,Canton,OH 44718","Banks, ATM Locations, Credit Unions, Financial Services, Loans, Mortgages, Real Estate Loans",,,A+,40.85561,-81.43124,https://i2.ypcdn.com/blob/413eff9b68a540c451765c8a93a321f7e3642dd4_100x100_crop.jpg?f9d23e1,,"Seven Seventeen Credit Union lets its customers see the difference. The Union is in Warren, Ohio and features a host of products and services, including: regular share savings accounts, easy savings accounts, free checking accounts, overdraft protection, business checking, business savings, business loans, home loans, lines of credit, visa cards, traditional IRAs, Roth retirement accounts, cash management accounts, direct deposit and payroll deduction. A person can become a member of Seven Seventeen in three ways: a customer can live, work, worship or attend school in counties in and around Warren. a customer can work for, or belong to, one of the companies or organizations affiliated with Seven Seventeen. or be a relative of a current Seven Seventeen member.",Hours,,,"amex, android pay, apple pay, cash, check, debit, discover, master card, samsung pay, visa",,,"http://www.sscu.net https://www.sscu.net",,,,,,,,,
17502125,2554336,"2020-09-27 06:38:12","Andover State Bank",http://www.goasb.com,,"(316) 733-1375","511 N Andover Rd",Andover,KS,67002,"511 N Andover Rd,Andover,KS 67002","Banks, ATM Locations, Commercial & Savings Banks, Financing Services, Holding Companies, Investments, Loans, Mortgages, Real Estate Loans",,,A+,37.69471,-97.13583,,,"Founded in 1916, Andover State Bank is a financial institution that offers a range of personal and business banking services. The bank provides a variety of checking, individual retirement and savings accounts. It offers depository, online bill payment, cash management, and telephone and Internet banking services. The bank provides debit, credit and ATM cards. It also offers safe-deposit boxes and loan and mortgage calculators. The bank provides home equity, business and personal loans. It additionally offers loans for the purchase of recreational vehicles, boats, and new and pre-owned cars. The bank s investment options include stocks, bonds and mutual funds. Andover State Bank is a member of the Federal Deposit Insurance Corporation.","Mon - Fri: 9:00 am - 5:00 pm","Phone: (316) 733-1355 Phone: (316) 733-0714 Fax: (316) 733-1357",,,,"Andover Financial Corp ATM Andover Financial Corporation Andover State Bank ATM",http://www.goasb.com,,,,,,,,,
17502437,2554457,"2020-09-27 06:38:12","Frost Bank",http://www.frostbank.com,webhelp@frostbank.com,"(512) 473-4343","401 Congress Ave",Austin,TX,78701,"401 Congress Ave,Austin,TX 78701","Banks, ATM Locations, Commercial & Savings Banks, Financial Planners, Financial Services, Internet Banking, Loans, Mortgages, Real Estate Loans",,,,30.26616,-97.74334,,"Banking. Investments. Insurance.","Texas roots. World-class service. From banking and insurance to all your investment needs, Frost is here for you. Literally. If you're in Texas, chances are there's a Frost nearby with folks you can trust to navigate you through any financial decision, no matter how simple or complicated. And because we put people first, you'll get the kind of customer service Frost has been known for since we first started serving this great state six generations ago. You'll also be able to take advantage of our time-tested, disciplined approach to helping you make the right financial decisions for your money.","Mon - Fri: 8:00 am - 5:00 pm",,,"amex, discover, visa, all major credit cards, mastercard",,,http://www.frostbank.com,"Parking: Paid, Garage Wheelchair Accessible: Yes",,,,,,,,
17502518,2554494,"2020-09-27 06:38:12","First Interstate Bank",http://www.firstinterstate.com,Susan.Kalaris-Siess@fib.com,"(406) 255-5000","401 N 31st St",Billings,MT,59101,"401 N 31st St,Billings,MT 59101","Commercial & Savings Banks, ATM Locations, Banks, Financial Services, Loans, Mortgages, Real Estate Loans, Savings & Loan Associations",,,,45.78348,-108.512,,,"Mountain West Bank is a full-service community bank. It is a Montana-owned, independent bank guided by a board of directors that represent a broad spectrum of the business and professional community. The bank offers a variety of personal and business banking services, as well as real estate loans. Personal banking solutions include Internet banking, online bill pay, checking and savings accounts, safety deposit boxes, money orders, notary service and direct deposit. The bank also features commercial, real estate and construction loans. certificates of deposit. individual retirement accounts. and credit card merchant services. Mountain West Bank is committed to serving the credit and full-service banking needs of Helena, Great Falls, Missoula, Bozeman and the surrounding areas of Montana.","Mon - Thu: 9:00 am - 4:00 pm Fri: 9:00 am - 5:00 pm Sat - Sun Closed","Phone: (406) 255-5434 Phone: (406) 255-5290 Phone: (406) 255-5300 Primary Phone: (406) 682-3125 Primary Phone: (406) 255-5300 Phone: (406) 449-2265 Fax: (406) 449-0903 Fax: (406) 255-5000 Fax: (406) 255-5120 TollFree: (888) 752-3336",,"amex, master card, visa",,,"http://www.firstinterstate.com https://www.firstinterstatebank.com http://firstinterstatebank.com https://locations.firstinterstatebank.com",,,,,,,,,
17502574,2554521,"2020-09-27 06:38:12","Mountain Valley Community Bank",http://www.mvcbank.com,customersupport@mvcbank.com,"(706) 387-7416","1420 Winder Hwy",Jefferson,GA,30549,"1420 Winder Hwy,Jefferson,GA 30549","Commercial & Savings Banks, ATM Locations, Banks, Financing Services, Mortgages, Real Estate Loans",,,,34.1063,-83.59254,,,,"Mon - Fri: 9:00 am - 5:00 pm","Phone: (706) 387-7438 Phone: (706) 387-5213 Phone: (706) 387-7537 Fax: (706) 387-7438 TollFree: (855) 835-6822",,"amex, cash, check, discover, master card, visa",,"Mountain Valley Community Bank ATM",http://www.mvcbank.com,,,,,,,,,
17502608,2554533,"2020-09-27 06:38:12","Nevada State Bank | Boulder City Branch",http://www.nsbank.com,abuse@nsbank.com,"(702) 589-2530","1000 Nevada Hwy","Boulder City",NV,89005,"1000 Nevada Hwy,Boulder City,NV 89005","Commercial & Savings Banks, ATM Locations, Banks, Financing Services, Mortgages, Real Estate Loans",,,,35.97476,-114.84395,https://i2.ypcdn.com/blob/9aaf3273eb9709f2610c5207bc3efd69051d680d_100x100_crop.jpg?f9d23e1,,,Hours,"Phone: (702) 383-0009",,"amex, discover",,,http://www.nsbank.com,"Wi-Fi: No",,,,,,,,
17502649,2554553,"2020-09-27 06:38:12","Salisbury Bank & Trust",https://www.salisburybank.com,,"(413) 229-5000","640 N Main St",Sheffield,MA,01257,"640 N Main St,Sheffield,MA 01257","Commercial & Savings Banks, ATM Locations, Banks, Mortgages, Real Estate Loans",5,"1 Review",,42.1237,-73.35637,,,,,"Phone: (413) 229-2388 Fax Number: (413) 229-2388 Fax: (413) 229-2388",,,,"Salisbury Bank and Trust Company ATM Salisbury Bank & Trust Company","https://www.salisburybank.com http://salisburybank.com",,nano51424,03/06/2008,five,"The personnal at this office go above and beyond. Great Hours. A pleasure to do business with.",,,,
17502680,2554563,"2020-09-27 06:38:12","Rollstone Bank & Trust",https://www.rollstonebank.com/?utm_source=local_directory&utm_medium=referral&utm_campaign=directory-listing,,"(978) 315-6929","283 Ayer Rd",Harvard,MA,01451,"283 Ayer Rd,Harvard,MA 01451","Commercial & Savings Banks, ATM Locations, Banks, Mortgages, Real Estate Loans",,,,42.53735,-71.57603,,,"In 1846, we were a pioneer community bank. Today, weВ’re still pioneering here in Central Massachusetts with new banking ideas and good old-fashioned personal service. Our dedication to providing customers with superior personal banking and commercial financial products, and the support they need to prosper at work and at home, has enabled us to build one of the most trusted banks in the region.","Mon - Wed: 9:00 am - 4:00 pm Thu: 9:00 am - 6:00 pm Fri: 9:00 am - 5:00 pm Sat: 9:00 am - 12:00 pm Sun Closed",,,,,,https://www.rollstonebank.com/,,,,,,,,,