business_x_category.id,business.id,business.ts,business.business_name,business.home_page,business.email_address,business.phone,business.street,business.city,business.state,business.zip_code,business.full_address,business.category,business.rating,business.number_of_reviews,business.bbb_rating_or_license,business.latitude,business.longitude,business.cover_image,business.slogan,business.general_info,business.regular_hours,business.extra_phones,business.services_products,business.payment,business.price_range,business.aka,business.other_links,business.other_information,business.review_1_name,business.review_1_date,business.review_1_rating,business.review_1_text,business.review_2_name,business.review_2_date,business.review_2_rating,business.review_2_text
17497240,2552373,"2020-09-27 06:37:59","Northfield Savings Bank",https://www.nsbvt.com?utm_source=extnet&utm_medium=organic&utm_campaign=yext,rogerp@nsbvt.com,"(802) 862-6222","160 College St",Burlington,VT,05401,"160 College St,Burlington,VT 05401","Commercial & Savings Banks, ATM Locations, Banks, Financial Services, Investments, Loans, Mortgages, Mutual Funds, Savings & Loans",,,,44.47723,-73.2134,,,"Northfield Savings Bank is a local, community bank that provides full-service banking to individuals, families and businesses В– from Home Mortgages, Home Equity Loans, Business Loans to Checking Accounts and Online Banking. With 13 branches across Central and Northwest Vermont, we are proud to be the largest bank headquartered in Vermont and one of the few remaining mutual savings banks, owned by our depositors, not shareholders. Additionally Northfield Investment Services offers access to investment services through Infinex Financial Group.","Mon Closed Tue - Thu: 8:30 am - 5:00 pm Fri: 8:30 am - 5:30 pm Sat - Sun Closed","TollFree: (800) 672-2274",,,,,https://www.nsbvt.com,,,,,,,,,
17497300,2552398,"2020-09-27 06:37:59","El Dorado Savings Bank",,jobs@eldoradosavings.com,"(530) 677-1601","4060 Cameron Park Dr","Cameron Park",CA,95682,"4060 Cameron Park Dr,Cameron Park,CA 95682","Commercial & Savings Banks, ATM Locations, Banks, Savings & Loans",5,"1 Review",,38.65784,-120.96935,https://i2.ypcdn.com/blob/507a63a9574d5957700a345305f82fd2d6cd77c8_100x100_crop.jpg?f9d23e1,,,"Mon - Thu: 9:00 am - 5:00 pm Fri: 9:00 am - 6:00 pm Sat: 9:00 am - 1:00 pm Sun Closed","Phone: (530) 677-8152 Fax Number: (530) 677-8152 Fax: (530) 677-8152 TollFree: (800) 874-9779",,"master card, visa",,"El Dorado Savings Bank F.S.B. ATM",,"Parking: Lot, Free Wheelchair Accessible: Yes",onlytwoleft,12/21/2009,five,"nice bank and the people are nice",,,,
17497318,2552402,"2020-09-27 06:37:59",HSBC,http://www.us.hsbc.com,,"(206) 926-1180","2630 77th Ave SE","Mercer Island",WA,98040,"2630 77th Ave SE,Mercer Island,WA 98040","Banks, ATM Locations, Commercial & Savings Banks, Financial Services, Financing Services, Loans, Mortgages, Mutual Funds, Savings & Loans",,,,47.58711,-122.23473,,"THE WORLD'S LOCAL BANK",,"Mon - Fri: 9:00 am - 4:00 pm","TollFree: (800) 975-4722",,"debit, all major credit cards, master card",,"HSBC Bank HSBC BANK USA N.A. HSBC Bank USA",http://www.us.hsbc.com,"Specialties: Vehicles",,,,,,,,
17497467,2552458,"2020-09-27 06:37:59",BankFive,https://www.bankfive.com/Locations/Fairhaven-Office,,"(774) 888-6100","105 Huttleston Ave",Fairhaven,MA,02719,"105 Huttleston Ave,Fairhaven,MA 02719","Banks, ATM Locations, Commercial & Savings Banks, Financing Services, Loans, Mortgages, Real Estate Loans, Savings & Loans",,,,41.64473,-70.89635,,,,Hours,,,,,,"Primary Website",,,,,,,,,
17497478,2552461,"2020-09-27 06:37:59",HSBC,http://www.us.hsbc.com,,"(585) 671-9051","1848 Empire Blvd",Webster,NY,14580,"1848 Empire Blvd,Webster,NY 14580","Banks, ATM Locations, Commercial & Savings Banks, Financial Services, Financing Services, Loans, Mortgages, Mutual Funds, Savings & Loans",,,,43.19057,-77.50335,,,,,,,,,"HSBC Bank",http://www.us.hsbc.com,,,,,,,,,
17497717,2552553,"2020-09-27 06:37:59","Citizens Bank",https://locations.citizensbank.com/ri/east-providence/622-taunton-ave.html,peter.lussier@citizensbank.com,"(401) 438-1368","622 Taunton Ave","East Providence",RI,02914,"622 Taunton Ave,East Providence,RI 02914","Commercial & Savings Banks, ATM Locations, Banks, Investments, Mortgages, Real Estate Loans, Savings & Loans",,,,41.82236,-71.35435,,,"At Citizens Bank, we are here to help you bank better. So, if you have a question about buying a house, paying for college, saving for retirement, taking on debt in a smart way or any other question about money, donВ’t keep it to yourself. Ask a Citizen. We have approximately 1,150 Citizens Bank branches in 11 states and approximately 3,300 ATMs. In addition, our customers stay connected with us 24/7 online, through our award-winning mobile app and via our round-the-clock customer contact center. Member FDIC. Equal Housing Lender.","Mon - Thu: 9:00 am - 5:00 pm Fri: 9:00 am - 6:00 pm Sat: 9:00 am - 1:00 pm",,,"master card, debit, all major credit cards",,,https://locations.citizensbank.com/ri/east-providence/622-taunton-ave.html,,,,,,,,,
17497840,2552596,"2020-09-27 06:37:59",HSBC,http://www.us.hsbc.com,,"(203) 341-0633","19 Post Rd E",Westport,CT,06880,"19 Post Rd E,Westport,CT 06880","Banks, ATM Locations, Commercial & Savings Banks, Financial Services, Financing Services, Loans, Mortgages, Mutual Funds, Savings & Loans",1,"1 Review",,41.14138,-73.3619,,,,"Mon - Wed: 9:00 am - 4:00 pm Thu: 9:00 am - 6:00 pm Fri: 9:00 am - 4:00 pm","TollFree: (800) 975-4722",,debit,,"HSBC Bank HSBC Bank USA",http://www.us.hsbc.com,,"Handyct@yahoo.com A.",04/15/2009,one,"Very nice in person but rude in service and completely unreliable. I am sorry I opened account in this branch.It took me 3 days to open, and still did not finished with what I intended to do.For our business it is just lost money...",,,,
17497862,2552601,"2020-09-27 06:37:59",HSBC,http://www.us.hsbc.com,,"(516) 741-2900","1 Old Country Rd Ste 106","Carle Place",NY,11514,"1 Old Country Rd Ste 106,Carle Place,NY 11514","Banks, ATM Locations, Commercial & Savings Banks, Financial Services, Financing Services, Loans, Mortgages, Mutual Funds, Savings & Loans",,,,40.74367,-73.62173,,"THE WORLD'S LOCAL BANK",,"Mon - Fri: 9:00 am - 4:00 pm","TollFree: (800) 975-4722",,"all major credit cards, master card, debit",,"HSBC Bank HSBC Bank USA N.A. HSBC Bank USA",http://www.us.hsbc.com,"Specialties: Vehicles",,,,,,,,
17497906,2552620,"2020-09-27 06:37:59",HSBC,http://www.us.hsbc.com,,"(800) 975-4722","75 Mamaroneck Ave","White Plains",NY,10601,"75 Mamaroneck Ave,White Plains,NY 10601","Banks, ATM Locations, Commercial & Savings Banks, Financial Services, Financing Services, Loans, Mortgages, Mutual Funds, Savings & Loans",,,,41.03054,-73.76546,,,,,,,,,"Atm Hsbc Bank ATM",http://www.us.hsbc.com,,,,,,,,,
17497931,2552631,"2020-09-27 06:37:59","Citizens Bank",http://www.greenleaf-fg.com,,"(802) 457-3666","431 E Woodstock Rd",Woodstock,VT,05091,"431 E Woodstock Rd,Woodstock,VT 05091","Commercial & Savings Banks, ATM Locations, Banks, Investments, Mortgages, Savings & Loans",,,,43.63354,-72.5034,,,"At Citizens Bank, we are here to help you bank better. So, if you have a question about buying a house, paying for college, saving for retirement, taking on debt in a smart way or any other question about money, donВ’t keep it to yourself. Ask a Citizen. We have approximately 1,150 Citizens Bank branches in 11 states and approximately 3,300 ATMs. In addition, our customers stay connected with us 24/7 online, through our award-winning mobile app and via our round-the-clock customer contact center. Member FDIC. Equal Housing Lender.","Mon - Fri: 9:00 am - 5:00 pm Sat - Sun Closed",,,"all major credit cards, debit",,,http://www.greenleaf-fg.com,,,,,,,,,
17498055,2552687,"2020-09-27 06:37:59",HSBC,http://www.us.hsbc.com,,"(800) 975-4722","400 Madison Ave Rm 16a","New York",NY,10017,"400 Madison Ave Rm 16a,New York,NY 10017","Banks, ATM Locations, Commercial & Savings Banks, Financial Services, Financing Services, Loans, Mortgages, Mutual Funds, Savings & Loans",,,,40.75637,-73.97692,,,,,,,,,"HSBC Bank HSBC Bank USA",http://www.us.hsbc.com,,,,,,,,,
17498094,2552707,"2020-09-27 06:37:59","S Bank",http://s-bank.com,,"(781) 337-1301","195 Washington St",Weymouth,MA,02188,"195 Washington St,Weymouth,MA 02188","Commercial & Savings Banks, ATM Locations, Banks, Loans, Savings & Loans",,,,42.21607,-70.96423,,,,"Mon - Wed: 8:30 am - 4:30 pm Thu - Fri: 8:30 am - 5:00 pm Sat: 8:30 am - 12:00 pm","TollFree: (800) 695-1300",,,,"S Bank Atm Sbank ATM",http://s-bank.com,,,,,,,,,
17498326,2552792,"2020-09-27 06:37:59","Middlesex Savings Bank",https://www.middlesexbank.com,info@middlesexbank.com,"(978) 263-8006","577 Massachusetts Ave",Acton,MA,01720,"577 Massachusetts Ave,Acton,MA 01720","Commercial & Savings Banks, ATM Locations, Banks, Savings & Loans",,,,42.47644,-71.47412,,,,"Mon - Wed: 8:30 am - 5:00 pm Thu: 8:30 am - 6:30 pm Fri: 8:30 am - 5:00 pm Sat: 9:00 am - 1:00 pm","Fax Number: (978) 266-1466 Fax: (978) 266-1466 TollFree: (877) 463-6287",,"master card, visa",,"Middlesex Savings Bank ATM","https://www.middlesexbank.com https://www.middlesexbank.com/locations/acton http://middlesexsavings.com http://middlesexbank.com",,,,,,,,,
17498430,2552837,"2020-09-27 06:37:59","Middlesex Savings Bank",http://www.middlesexbank.com,president@middlesexbank.com,"(508) 655-8274","150 Commonwealth Rd",Wayland,MA,01778,"150 Commonwealth Rd,Wayland,MA 01778","Commercial & Savings Banks, ATM Locations, Banks, Savings & Loans",,,,42.31704,-71.36468,,,,"Mon - Wed: 8:30 am - 4:00 pm Thu - Fri: 8:30 am - 6:00 pm Sat: 8:30 am - 12:30 pm Sun Closed","Fax: (508) 650-0174 TollFree: (800) 424-2424",,"visa, master card",,"Middlesex Savings Bank ATM",http://www.middlesexbank.com,,,,,,,,,
17498556,2552902,"2020-09-27 06:37:59","Wellesley Bank",http://wellesley.com,info@wellesleybank.com,"(781) 489-7630","40 Central St",Wellesley,MA,02482,"40 Central St,Wellesley,MA 02482","Commercial & Savings Banks, ATM Locations, Banks, Savings & Loans",,,,42.29609,-71.29521,,,,"Mon - Wed: 8:00 am - 4:00 pm Thu: 8:00 am - 5:00 pm Fri: 8:00 am - 4:00 pm Sat Closed","Phone: (781) 235-2550 Phone: (781) 489-7600 Primary Phone: (781) 489-4440 Primary Phone: (781) 489-7602",,,,"Wellesley Bank ATM Wellesley Bancorp Inc","http://wellesley.com http://wellesleybank.com",,,,,,,,,
17498580,2552909,"2020-09-27 06:37:59","Timberland Bank",http://www.timberlandbank.com,admin@timberlandbank.com,"(360) 533-4747","624 Simpson Ave",Hoquiam,WA,98550,"624 Simpson Ave,Hoquiam,WA 98550","Banks, ATM Locations, Commercial & Savings Banks, Financing Services, Holding Companies, Investments, Loans, Mortgages, Savings & Loan Associations, Savings & Loans",,,A+,46.97799,-123.88582,,,"Timberland Bank was founded in Hoquiam, Wash., in 1915. It has since grown to a 20-branch network of full-service community banking locations in five counties. As of 2004, Timberland had approximately $436 million in assets. Its products and services include traditional banking products, such as checking and savings accounts, CDs, IRAs and home and consumer loans. In addition, the bank has capitalized on niche lending products, such as land, construction and business loans. The bank is a wholly owned subsidiary of Timberland Bancorp, which also offers financial planning services through another subsidiary, Timberland Financial Services Center.","Mon - Fri: 9:00 am - 5:00 pm Sat: 9:00 am - 12:00 pm","Phone: (360) 537-7578 Phone: (360) 533-4743 Phone: (360) 533-2258 Primary Phone: (360) 537-6905 Fax: (360) 533-4743 Fax Number: (360) 533-4743 TollFree: (877) 805-6705 TollFree: (800) 562-8761 Toll Free: (877) 805-6705",,,,"Timberland Bancorp, Inc Timberland Bank Atm Timberland Bank Timberland Bank",http://www.timberlandbank.com,,,,,,,,,
17498955,2553067,"2020-09-27 06:38:02","Northwest Bank",https://api.superpages.com/xml/search?SRC=ypintfeed&subaffiliate=DXC&PGID=e02.7182.8182845904523&SPGID=1581865543098.618c391b&ADID=11087055&DEST=http%3A%2F%2Fwww.northwest.com&C=ATM%20Locations&T=Mayville&S=NY&PH=(716)%20753-2250&FL=url&TL=off&position=6&PS=30&PI=1&Results=FEED_CLCK&uid=618c391b-164e-41ec-8d4a-5e691d5f4182&REF=&IP=163.172.180.18&UserAgent=Mozilla%2F5.0%20(Macintosh%3B%20Intel%20Mac%20OS%20X%2010_13_6)%20AppleWebKit%2F605.1.15%20(KHTML%2C%20like%20Gecko)%20Version%2F11.1.2%20Safari%2F605.1.15,,"(716) 753-2250","29 S Erie St",Mayville,NY,14757,"29 S Erie St,Mayville,NY 14757","Banks, ATM Locations, Commercial & Savings Banks, Mortgages, Savings & Loans",,,,42.25328,-79.503845,https://i2.ypcdn.com/blob/5110cf26188125443abfd765b874f7d60c4dcf04_100x100_crop.jpg?f9d23e1,"Northwest Bank is a bank headquartered in Warren, Pennsylvania. It operates 172 branches in central",,"Mon - Thu: 9:00 am - 4:00 pm Fri: 9:00 am - 5:30 pm Sat: 9:00 am - 12:00 am Sun Closed","Phone: (716) 664-2265",,debit,,,http://www.northwest.com,"Parking: Lot, Free Wheelchair Accessible: Yes",,,,,,,,
17498999,2553083,"2020-09-27 06:38:02","Savings Bank of Maine",http://www.thebankofmaine.com,heretohelp@camdennational.com,"(207) 443-3364","7 Chandler Dr",Bath,ME,04530,"7 Chandler Dr,Bath,ME 04530","Commercial & Savings Banks, ATM Locations, Banks, Financing Services, Loans, Mortgages, Savings & Loans",,,,43.90868,-69.82804,,,,"Mon - Fri: 8:00 am - 6:00 pm Sat: 8:00 am - 12:00 pm",,,,,"The Bank Of Maine The Bank of Maine ATM",http://www.thebankofmaine.com,,,,,,,,,
17499064,2553106,"2020-09-27 06:38:02",HSBC,http://www.us.hsbc.com,,"(212) 580-5533","2411 Broadway","New York",NY,10024,"2411 Broadway,New York,NY 10024","Banks, ATM Locations, Commercial & Savings Banks, Financial Services, Financing Services, Loans, Mortgages, Mutual Funds, Savings & Loans",,,,40.79019,-73.97526,,,,"Mon - Fri: 8:30 am - 5:00 pm Sat: 9:00 am - 1:00 pm",,,"master card, visa",,"HSBC Bank HSBC Bank USA",http://www.us.hsbc.com,,,,,,,,,
17499159,2553141,"2020-09-27 06:38:02","Northwest Bank",https://api.superpages.com/xml/search?SRC=ypintfeed&subaffiliate=DXC&PGID=e02.7182.8182845904523&SPGID=1581861865577.bdd32153&ADID=5898733&DEST=http%3A%2F%2Fwww.northwest.com&C=ATM%20Locations&T=Grove%20City&S=PA&PH=(724)%20450-1300&FL=url&TL=off&position=3&PS=30&PI=1&Results=FEED_CLCK&uid=bdd32153-efc3-4f7c-9fa6-7cab21c85d00&REF=&IP=179.183.162.71&UserAgent=Mozilla%2F5.0%20(Windows%20NT%206.1%3B%20Win64%3B%20x64)%20AppleWebKit%2F537.36%20(KHTML%2C%20like%20Gecko)%20Chrome%2F69.0.3497.100%20Safari%2F537.36,,"(724) 450-1300","200 S Center St","Grove City",PA,16127,"200 S Center St,Grove City,PA 16127","Banks, ATM Locations, Commercial & Savings Banks, Mortgages, Savings & Loans",,,,41.15961,-80.08757,https://i2.ypcdn.com/blob/6f01c8d5d8ad4ae2e5b81d92a6105c3a06582be6_100x100_crop.jpg?f9d23e1,"Northwest Bank is a bank headquartered in Warren, Pennsylvania. It operates 172 branches in central",,"Mon - Thu: 9:00 am - 5:00 pm Fri: 9:00 am - 6:00 pm Sat: 9:00 am - 12:00 pm","Primary Phone: (724) 450-0332",,debit,,,"http://www.northwest.com http://www.northwestsavingsbank.com",,,,,,,,,
17499175,2553147,"2020-09-27 06:38:02",HSBC,http://www.us.hsbc.com,,"(716) 896-2156","2911 Walden Ave",Depew,NY,14043,"2911 Walden Ave,Depew,NY 14043","Banks, ATM Locations, Commercial & Savings Banks, Financial Services, Financing Services, Loans, Mortgages, Mutual Funds, Savings & Loans",,,,42.90845,-78.72702,,,,,"TollFree: (800) 975-4722 TollFree: (800) 432-5632",,"debit, master card, visa",,"HSBC Bank",http://www.us.hsbc.com,,,,,,,,,
17499188,2553150,"2020-09-27 06:38:02",HSBC,http://www.us.hsbc.com,,"(914) 666-2700","600 Bedford Rd","Bedford Hills",NY,10507,"600 Bedford Rd,Bedford Hills,NY 10507","Banks, ATM Locations, Commercial & Savings Banks, Financial Services, Financing Services, Loans, Mortgages, Mutual Funds, Savings & Loans",,,,41.22762,-73.71138,,,,"Mon - Fri: 8:00 am - 10:00 pm Sat: 9:00 am - 5:00 pm",,,,,"Hsbc Bank",http://www.us.hsbc.com,,,,,,,,,
17499301,2553199,"2020-09-27 06:38:02","Citizens Bank",https://locations.citizensbank.com/ri/johnston/1495-hartford-ave.html,rick.frusher@citizensbank.com,"(401) 455-5899","1495 Hartford Ave",Johnston,RI,02919,"1495 Hartford Ave,Johnston,RI 02919","Commercial & Savings Banks, ATM Locations, Banks, Investments, Loans, Mortgages, Savings & Loans",,,,41.82502,-71.50341,,,"At Citizens Bank, we are here to help you bank better. So, if you have a question about buying a house, paying for college, saving for retirement, taking on debt in a smart way or any other question about money, donВ’t keep it to yourself. Ask a Citizen. We have approximately 1,150 Citizens Bank branches in 11 states and approximately 3,300 ATMs. In addition, our customers stay connected with us 24/7 online, through our award-winning mobile app and via our round-the-clock customer contact center. Member FDIC. Equal Housing Lender.","Mon - Thu: 9:00 am - 5:00 pm Fri: 9:00 am - 6:00 pm Sat: 9:00 am - 1:00 pm",,,"debit, master card, all major credit cards",,,https://locations.citizensbank.com/ri/johnston/1495-hartford-ave.html,,,,,,,,,
17499352,2553213,"2020-09-27 06:38:02",HSBC,http://www.us.hsbc.com,,"(800) 975-4722","6702 Bay Pkwy",Brooklyn,NY,11204,"6702 Bay Pkwy,Brooklyn,NY 11204","Banks, ATM Locations, Commercial & Savings Banks, Financial Services, Financing Services, Loans, Mortgages, Mutual Funds, Savings & Loans",,,,40.61268,-73.9829,,,,"Mon - Fri: 9:00 am - 4:00 pm Sat: 9:00 am - 1:00 pm","Phone: (718) 837-8401 Phone: (347) 554-2345 Fax: (718) 232-2423",,"debit, master card, visa, all major credit cards",,"HSBC Bank HSBC Bank USA",http://www.us.hsbc.com,,,,,,,,,
17499416,2553237,"2020-09-27 06:38:02",HSBC,http://www.us.hsbc.com,,"(800) 975-4722","1 E Fordham Rd",Bronx,NY,10468,"1 E Fordham Rd,Bronx,NY 10468","Banks, ATM Locations, Commercial & Savings Banks, Financial Services, Financing Services, Loans, Mortgages, Mutual Funds, Savings & Loans",,,,40.86277,-73.90059,,,,"Mon - Fri: 9:00 am - 4:00 pm","Phone: (718) 365-5654 Phone: (718) 220-2600 Fax: (718) 365-5654",,,,"HSBC Bank USA ATM HSBC Bank",http://www.us.hsbc.com,,,,,,,,,
17499614,2553328,"2020-09-27 06:38:02","Citizens Bank",https://locations.citizensbank.com/nh/north-hampton/65-lafayette-rd.html,,"(603) 964-5518","65 Lafayette Rd","North Hampton",NH,03862,"65 Lafayette Rd,North Hampton,NH 03862","Commercial & Savings Banks, ATM Locations, Banks, Investments, Mortgages, Savings & Loans",,,,42.97187,-70.83433,,,"At Citizens Bank, we are here to help you bank better. So, if you have a question about buying a house, paying for college, saving for retirement, taking on debt in a smart way or any other question about money, donВ’t keep it to yourself. Ask a Citizen. We have approximately 1,150 Citizens Bank branches in 11 states and approximately 3,300 ATMs. In addition, our customers stay connected with us 24/7 online, through our award-winning mobile app and via our round-the-clock customer contact center. Member FDIC. Equal Housing Lender.","Mon - Wed: 9:00 am - 4:30 pm Thu - Fri: 9:00 am - 5:00 pm Sat: 9:00 am - 12:00 pm Sun Closed",,,"debit, all major credit cards, master card",,,https://locations.citizensbank.com/nh/north-hampton/65-lafayette-rd.html,,,,,,,,,
17499764,2553390,"2020-09-27 06:38:02","Heritage Bank",https://local.heritagebanknw.com/wa/bellingham/920-w-bakerview-road,Support@HeritageBankNW.com,"(360) 527-9900","920 W Bakerview Rd",Bellingham,WA,98226,"920 W Bakerview Rd,Bellingham,WA 98226","Commercial & Savings Banks, ATM Locations, Banks, Financial Services, Loans, Savings & Loans",,,,48.78998,-122.5074,https://i2.ypcdn.com/blob/e2d86fd8d9b977c81199f365ce305cbf305962ff_100x100_crop.jpg?f9d23e1,,"Heritage Bank serves customers like you. Your neighbors. The couple who owns the storefront across town. The customers we serve bring their unique heritageВ—and unique needsВ—to our bank. To help our customers achieve their goals, we offer a complete array of banking services and tools for businesses as well as individuals. Our focus is on our communities: helping customers who haveВ—or will buildВ—their heritage in our local markets.","Mon - Thu: 9:00 am - 5:00 pm Fri: 9:00 am - 5:30 pm Sat - Sun Closed","Fax: (360) 240-4994 TollFree: (800) 455-6126",,visa,,,website,,,,,,,,,
17499918,2553447,"2020-09-27 06:38:02",HSBC,http://www.us.hsbc.com,info@hsbc.ca,"(716) 366-5522","401 Central Ave",Dunkirk,NY,14048,"401 Central Ave,Dunkirk,NY 14048","Banks, ATM Locations, Commercial & Savings Banks, Financial Services, Financing Services, Loans, Mortgages, Mutual Funds, Savings & Loans",,,,42.48297,-79.33475,,,,,"Phone: (716) 366-5523",,"debit, master card, visa",,"Hsbc Bank HSBC Bank USA N.A.",http://www.us.hsbc.com,,,,,,,,,
17500033,2553486,"2020-09-27 06:38:02","Bellco Credit Union",http://www.bellco.org,,"(720) 479-5275","2478 Highway 6 And 50 Unit A","Grand Junction",CO,81505,"2478 Highway 6 And 50 Unit A,Grand Junction,CO 81505","Credit Unions, ATM Locations, Alternative Loans, Banks, Financial Planning Consultants, Financial Services, Loans, Mortgages, Real Estate Loans, Savings & Loans",,,,39.08549,-108.59187,,,"The smartest place to bank isn't a bank. It's Bellco. Bellco is a progressive, member-owned credit union with a full range of financial services. Welcome to the Grand Junction Bellco Credit Union branch, where you'll find world-class customer service and the full range of financial services you need - from checking and savings accounts to credit cards and car loans. Stop by your convenient Grand Junction location today to see what makes Bellco so different. Bellco is different. While banks focus on their shareholders and their stock value, Bellco exists to serve our members, not ourselves. Which means we charge you less and give you more. Unlike a for-profit bank, we return our profits to our members in the form of lower rates on loans, higher interest on deposits, and better services. And you'll like knowing you re doing business with one of the largest credit unions in Colorado. Founded in 1936, Bellco has over 194,000 members and over $2 billion in assets. We actively support the community, donating funds and employee volunteer hours to many health and family-related causes.","Drive-Thru Hours Mon 9:00 am - 6:00 pm Tue - Thu 9:00 am - 5:00 pm Fri 9:00 am - 6:00 pm Sat 9:00 am - 2:00 pm",,,"debit, check, visa",,"Bellco Credit Union, Grand Junction Branch","http://www.bellco.org https://www.bellco.org/bellco-branches-and-atms/grand-junction-branch.aspx",,,,,,,,,
17500157,2553533,"2020-09-27 06:38:02","Independent Bank",http://www.independentbank.com,info@ibcp.com,"(800) 355-0641","194 S Main St",Vermontville,MI,49096,"194 S Main St,Vermontville,MI 49096","Commercial & Savings Banks, ATM Locations, Banks, Financial Services, Financing Services, Loans, Mortgages, Savings & Loans",,,,42.62764,-85.025,https://i2.ypcdn.com/blob/e9e810858443ed17527cdc149d2ed1098b6b24a2_100x100_crop.jpg?f9d23e1,,"Independent Bank is a Michigan-based bank that has served our customers and communities for over 150 years. As a full-service bank, we can assist with every aspect of banking, from opening a checking account, to buying a home, to planning your retirement.","Mon - Sun: Open 24 Hours","Phone: (517) 726-1408 Primary Phone: (517) 726-0651 Phone: (517) 726-0651 Phone: (517) 726-0650 Fax: (517) 726-0650 Fax: (517) 726-1408 Fax: (269) 763-9915",,"debit, company card, master card, visa",,"Independent Bank ATM Independent Bank (of MI)",http://www.independentbank.com,,,,,,,,,