business_x_category.id,business.id,business.ts,business.business_name,business.home_page,business.email_address,business.phone,business.street,business.city,business.state,business.zip_code,business.full_address,business.category,business.rating,business.number_of_reviews,business.bbb_rating_or_license,business.latitude,business.longitude,business.cover_image,business.slogan,business.general_info,business.regular_hours,business.extra_phones,business.services_products,business.payment,business.price_range,business.aka,business.other_links,business.other_information,business.review_1_name,business.review_1_date,business.review_1_rating,business.review_1_text,business.review_2_name,business.review_2_date,business.review_2_rating,business.review_2_text
103267,43539,"2020-09-27 02:34:01","Deans Pawning & Instant Cash",http://www.deanscoinsandpawning.com,dc2325@pacbell.net,"(559) 264-4653","2325 E Mckinley Ave",Fresno,CA,93703,"2325 E Mckinley Ave,Fresno,CA 93703","Diamonds, Check Cashing Service, Coin Dealers & Supplies, Collectibles, Diamond Buyers, Financial Services, Gold, Silver & Platinum Buyers & Dealers, Guns & Gunsmiths, Jewelry Buyers, Loans, Pawnbrokers, Self Storage",5,"1 Review",A+,36.76537,-119.78322,https://i1.ypcdn.com/blob/0a09bdcefb7aef4b1fa1ebb26fa68cb5a139115c_100x100_crop.jpg?cbd0284,"WHY SELL IT? When you can PAWN IT ! We Take EVERYTHING from BIG to SMALL","Need some cash? Need it fast? DEANS COINS & Pawning Instant Cash can help. We are a friendly, fast, private and confidential pawning service offering the lowest rates in Fresno for PayDay Loans.* We also offer PAWN loans on lots of items BIG or SMALL. If you've got something of value, whether it's a gold necklace, a guitar or an ATV, we are prepared to offer you cash for it. If your financial shortfall is only temporary, don't worry. Whatever your situation may be, we're sure we can work something out. If you're looking to buy, we carry an enormous, constantly changing inventory with everything from jewelry and watches to electronics, FIREARMS and more! Whatever it is you're looking for, DEANS Pawning & Instant Cash can probably help you find it. Come by today to peruse our selection of quality merchandise. *LICENCED BY DEPARTMENT OF BUSINESS OVERSIGHT PERSUANT TO DEFFERED DEPOSIT TRANSACTION LAW LIC.#100-1482 LIC.#1005-0996 We buy all forms of diamonds, gold jewelry, and sterling flatware. Pawning services and jewelry loans are available. We also buy all broken jewelry and dental gold. **** Don't toss it! We buy it!**** Call for quotes! Highest Prices Paid Instant Cash *WE BUY GIFT CARDS* *WE BUY & SELL DVD'S* Layaway Available Give us a call to see how we can help.","Mon - Fri: 9:00 am - 5:00 pm Sat: 9:00 am - 3:00 pm Sun Closed","Business FAX: (559) 495-0152",,"mastercard, debit, discover, visa",,"DEANS COINS DEANS",http://www.deanscoinsandpawning.com,"Parking: Lot","Jackilyn J.",02/06/2017,five,"True to their word... If you need it they'll help you find it???? Outstanding customer service skills!",,,,
202385,67438,"2020-09-27 02:36:03","Zengeler Cleaners",http://www.zengelercleaners.com,customercare@zengelercleaners.com,"(847) 362-1700","539 E Park Ave",Libertyville,IL,60048,"539 E Park Ave,Libertyville,IL 60048","Drapery & Curtain Cleaners, Dry Cleaners & Laundries, Fur Cleaning & Dyeing-Retail, Leather Cleaning, Self Storage, Tailors",,,,42.2821,-87.94646,,,"Founded in 1857, Zengeler Cleaners Inc. is one of the largest dry cleaning companies in the United States. Based in Libertyville, Ill., the company's tailors provides repairs and alterations as well as reweaving of tears, burns, or holes. It uses furrier method cleaning and glazing and also maintains its own cold storage vaults on premises. Zengeler Cleaners Inc. offers heirlooming of wedding and christening gowns. In addition, the company has the ability to store any item it cleans or launders for its customers.","Mon - Fri: 6:30 am - 6:30 pm Sat: 7:00 am - 5:00 pm","Phone: (847) 362-1748 Fax Number: (847) 362-1748 Fax: (847) 362-1748",,"check, debit, all major credit cards",,"A W Zengeler Cleaners","http://www.zengelercleaners.com https://www.zengelercleaners.com","Bike Parking: Yes",,,,,,,,
205049,68391,"2020-09-27 02:36:13","Zengeler Cleaners",http://www.zengelercleaners.com,zengeler1@gmail.com,"(847) 446-1200","754 Elm St",Winnetka,IL,60093,"754 Elm St,Winnetka,IL 60093","Delivery Service, Draperies, Curtains & Window Treatments, Dry Cleaners & Laundries, Fur Cleaning & Dyeing-Retail, Leather Cleaning, Self Storage, Tailors",,,,42.10574,-87.73267,https://i4.ypcdn.com/blob/8040c5d349af9363604efbe14ce89de1cbf1bf63_100x100_crop.jpg?912a958,,"A. W. Zengeler Cleaners is one of America's oldest and largest dry cleaning companies. It is owned and run by the fifth generation of the same family that started the business in 1857. Our seven stores are located in Deerfield, Hubbard Woods, Libertyville (with 2 stores), Northbrook, Northfield and Winnetka. Our professionals take great pride in helping you look your best, and we guarantee your satisfaction. We've earned the trust of generations of area families because we set a higher standard in fabric care. Zengeler Offers A Full Range of Professional Fabric Care Services... Home Pick-Up and Delivery! Let Zengeler quality & service come to you with our home pickup and delivery service! The Zengeler Perfect Shirt Once youВ’ve worn one, you wonВ’t settle for less. There isnВ’t a finer laundered and finished shirt В– anywhere! Suede and Leather Cleaning We use В“Suede LifeВ” to keep items soft, supple and beautiful.","Mon - Fri: 6:30 am - 6:30 pm Sat: 7:00 am - 5:00 pm Sun Closed",,,"mastercard, discover, visa",,,"http://www.zengelercleaners.com https://www.zengelercleaners.com",,,,,,,,,
259316,85214,"2020-09-27 02:38:13","Novello's Dry Cleaning Inc. - Endicott, NY",,janmnov@earthlink.net,"(607) 754-0400","3114 E Main St",Endicott,NY,13760,"3114 E Main St,Endicott,NY 13760","Home Furnishings, Bridal Gown Preservation, Dry Cleaners & Laundries, Fur Storage & Services, Self Storage, Wedding Supplies & Services",1,"1 Review",A,42.10612,-76.02531,https://i2.ypcdn.com/blob/837b0b095ccf339671cb02c6e9196c9b351691bc_100x100_crop.jpg?f9d23e1,,"Novello's Dry Cleaning Inc. - Endicott, NY, is a name you can trust when it comes to taking good care of your wardrobe! We always do high-quality work and take good care of our customers. Most importantly, we have a knowledgeable and friendly staff. We will get the stains out!","Mon - Fri: 6:30 am - 6:00 pm Sat: 8:00 am - 1:00 pm","Phone: (607) 785-8621",,"visa, master card, cash",,,,"Specialties: Drapes & Curtains, Clothing, Apparel, Garments",evitta.barr,04/06/2014,one,"who ever gave these 5 star reviews must be their friends or family.was way to expensive and was not even a average job.looked as if they put it in a washing machine and dryed it hanging up.i could have done that for free at home.very very dissatisfied .zero stars",,,,
276346,90731,"2020-09-27 02:38:40","Stacy's Cleaners Inc.",,m.stacy1128@yahoo.com,"(413) 526-7501","14 Allen St",Hampden,MA,01036,"14 Allen St,Hampden,MA 01036","Home Furnishings, Bridal Gown Preservation, Clothing Alterations, Drapery & Curtain Cleaners, Dry Cleaners & Laundries, Self Storage, Wedding Supplies & Services",,,,42.06062,-72.44261,,"Professional Dry Cleaning since 1958.","Family owned Dry Cleaning and Laundry service. In business over 60 years. Handles all types of cleaning for your clothing and household items. All work done on premise in East Longmeadow store. Fast service, expert alterations, comforter cleaning, leather and suede cleaning, wedding gown preservation, antique garment restoration, spot removal specialists.","Mon - Fri: 8:30 am - 5:30 pm Sat: 9:00 am - 1:00 pm Sun Closed","Phone: (413) 525-3980",,"master card, amex, apple pay, cash, check, debit, discover, paypal, travelers checks, visa",,,,,,,,,,,,
285259,93853,"2020-09-27 02:38:58","Mitchener Transport",https://www.mitchenertransport.com,bmitchener@suddenlinkmail.com,"(806) 381-4620","100 Rolling Trl",Amarillo,TX,79108,"100 Rolling Trl,Amarillo,TX 79108","Trucking, Bus Lines, Local Trucking Service, Self Storage, Trucking-Heavy Hauling, Trucking-Motor Freight",,,A+,35.29409,-101.86833,,,,"Mon - Fri: 8:00 am - 5:00 pm Sat - Sun Closed","Phone: (806) 381-4621 Fax: (806) 381-4632",,check,,"Mitchener Transport, LLC Mitchner Transport Mitchener Trucking","https://www.mitchenertransport.com http://mitchenertransport.com","Parking: Lot, Free Wheelchair Accessible: Yes",,,,,,,,
292004,96259,"2020-09-27 02:39:15","Transit Storage",http://storagetransit.com,info@storagetransit.com,"(706) 860-2141","1222 Sumter Landing Ln",Evans,GA,30809,"1222 Sumter Landing Ln,Evans,GA 30809","Bus Lines, Moving-Self Service, Self Storage",,,,33.58049,-82.10346,,,,"Mon - Sat: 8:00 am - 5:00 pm Sun Closed",,,"all major credit cards, visa, mastercard, amex, discover, check",,,http://storagetransit.com,,,,,,,,,
323054,107341,"2020-09-27 02:40:32","CubeSmart Self Storage",https://www.cubesmart.com,webleads@cubesmart.com,"(614) 539-8553","3300 Southwest Blvd","Grove City",OH,43123,"3300 Southwest Blvd,Grove City,OH 43123","Self Storage, Automobile Storage, Boat Storage, Boxes-Corrugated & Fiber, Boxes-Corrugated & Fiber-Wholesale & Manufacturers, Cold Storage Warehouses, Movers & Full Service Storage, Moving Boxes, Moving-Self Service, Packaging Materials, Paper Manufacturers, Paper Products-Wholesale & Manufacturers, Portable Storage Units, Recreational Vehicles & Campers-Storage, Storage Household & Commercial, Trailers-Camping & Travel-Storage, Truck Rental",,,,39.89285,-83.09044,,"It's What's Inside That Counts","With more than 900 locations around the country, CubeSmart is one of the most trusted names in storage. Our mission is to simplify the organizational challenges created by our over 1,000,000 customersВ’ many life events, through innovative solutions and genuine care. Our single most important goal is to provide exceptional service to our customers who need us. ThatВ’s why CubeSmart was named the Best Customer Service award winner from Inside Self-StorageВ’s (ISS) 2017 Best of Business reader-choice poll, and why our customers and partners voted to award us the 2017 PeopleВ’s Choice StevieВ® Award for Favorite Customer Service. We care deeply about the things that matter to our customers, and strive to offer the highest standards of service, security, and cleanliness. Our customers choose us because, at CubeSmart, itВ’s whatВ’s inside that counts.","Mon - Fri: 9:30 am - 6:00 pm Sat: 8:30 am - 5:00 pm Sun: 11:00 am - 3:00 pm",,,"mastercard, cash, discover, visa, amex",,,https://www.cubesmart.com,,,,,,,,,
324884,107809,"2020-09-27 02:40:32","Merchants Moving & Storage, Inc.",http://www.merchantsmovingandstorage.com,debbie@merchantsmoving.com,"(406) 363-4314","1350 N 1st St",Hamilton,MT,59840,"1350 N 1st St,Hamilton,MT 59840","Movers, Building Specialties, Cold Storage Warehouses, General Contractors, Local Trucking Service, Movers & Full Service Storage, Movers-Commercial & Industrial, Moving Equipment Rental, Moving Services-Labor & Materials, Packaging Machinery-Wholesale & Manufacturers, Packaging Materials, Packaging Materials-Wholesale & Manufacturers, Packing & Crating Service, Packing Materials-Shipping, Paper Manufacturers, Paper Products-Wholesale & Manufacturers, Piano & Organ Moving, Portable Storage Units, Public & Commercial Warehouses, Real Estate Agents, Relocation Service, Self Storage, Storage Household & Commercial, Trucking",,,A+,46.26499,-114.15626,,"We Move Your Life","We move your life. Call TODAY for a FREE, no obligation estimate! No time to call? Email us at wheatoncustomercare@wvlcorp.com or visit us on facebook, Twitter, Linkedin or Pinterest.","Mon - Fri: 8:00 am - 5:00 pm",,,"visa, mastercard, amex, discover",,,"http://www.merchantsmovingandstorage.com http://www.wheatonworldwide.com http://merchantsmands.com",,,,,,,,,
325141,107890,"2020-09-27 02:40:32","CubeSmart Self Storage",http://www.cubesmart.com/connecticut-self-storage/bristol-self-storage/160.html,webleads@cubesmart.com,"(860) 583-0020","201 Lake Ave",Bristol,CT,06010,"201 Lake Ave,Bristol,CT 06010","Self Storage, Automobile Storage, Boat Storage, Boxes-Corrugated & Fiber, Boxes-Corrugated & Fiber-Wholesale & Manufacturers, Cold Storage Warehouses, Movers & Full Service Storage, Moving Boxes, Moving-Self Service, Packaging Materials, Paper Manufacturers, Paper Products-Wholesale & Manufacturers, Portable Storage Units, Public & Commercial Warehouses, Recreational Vehicles & Campers-Storage, Storage Household & Commercial, Trailers-Camping & Travel-Storage, Truck Rental, Warehouses-Merchandise",,,,41.66038,-72.92263,https://i3.ypcdn.com/blob/e56a2dfe3198c7309d99a550956aa88f229dd240_100x100_crop.jpg?63f80dd,"Get Up To 15% Off & First Month Free","Rent an affordable storage space at CubeSmart Self Storage in Bristol, CT, at 201 Lake Avenue. Find storage units in a selection of sizes and enjoy up to 15% off and first month free on select units.","Mon - Fri: 9:30 am - 6:00 pm Sat: 8:30 am - 5:00 pm Sun: 11:00 am - 3:00 pm",,,"mastercard, discover, visa, amex, debit",,,http://www.cubesmart.com/,,,,,,,,,
325511,107987,"2020-09-27 02:40:32","CubeSmart Self Storage",https://www.cubesmart.com,webleads@cubesmart.com,"(908) 709-0001","601 South Ave E",Cranford,NJ,07016,"601 South Ave E,Cranford,NJ 07016","Self Storage, Automobile Storage, Boat Storage, Cold Storage Warehouses, Movers & Full Service Storage, Moving Boxes, Moving-Self Service, Packaging Materials, Paper Manufacturers, Paper Products-Wholesale & Manufacturers, Portable Storage Units, Recreational Vehicles & Campers-Storage, Storage Household & Commercial, Trailers-Camping & Travel-Storage, Truck Rental",,,,40.65699,-74.28941,https://i3.ypcdn.com/blob/d43468dc53da323f40187d5bc19938bb873054ed_100x100_crop.jpg?63f80dd,"It's What's Inside That Counts","With more than 900 locations around the country, CubeSmart is one of the most trusted names in storage. Our mission is to simplify the organizational challenges created by our over 1,000,000 customersВ’ many life events, through innovative solutions and genuine care. Our single most important goal is to provide exceptional service to our customers who need us. ThatВ’s why CubeSmart was named the Best Customer Service award winner from Inside Self-StorageВ’s (ISS) 2017 Best of Business reader-choice poll, and why our customers and partners voted to award us the 2017 PeopleВ’s Choice StevieВ® Award for Favorite Customer Service. We care deeply about the things that matter to our customers, and strive to offer the highest standards of service, security, and cleanliness. Our customers choose us because, at CubeSmart, itВ’s whatВ’s inside that counts.","Mon - Fri: 9:30 am - 6:00 pm Sat: 8:30 am - 5:00 pm Sun: 11:00 am - 3:00 pm",,,"discover, visa, cash, mastercard, amex",,,https://www.cubesmart.com,,,,,,,,,
326024,108134,"2020-09-27 02:40:40","Midtown Mini Storage and Shredding",http://www.uhaul.com/locations/rentals-near-charleston-wv-25301/054553,midtownministorage@yahoo.com,"(304) 342-3101","800 Piedmont Rd",Charleston,WV,25301,"800 Piedmont Rd,Charleston,WV 25301","Paper Products, Business Documents & Records-Storage & Management, Moving Boxes, Paper Manufacturers, Paper-Shredded, Public & Commercial Warehouses, Self Storage, Shredding-Paper, Storage Household & Commercial",5,"1 Review",,38.3535,-81.62708,https://i3.ypcdn.com/blob/bff1154698fff4a2fd78b2be351739b0bad7597e_100x100_crop.jpg?63f80dd,,,"Mon - Fri: 8:30 am - 5:00 pm Sat: 9:00 am - 1:00 pm Sun Closed",,,"check, cash, all major credit cards, debit",,,"Web Site","Parking: Lot, Free Wheelchair Accessible: Yes","Mary A.",04/01/2017,five,"Very helpful, I had several boxes of documents that had to be shredded. I watched it being shredded which was reassuring. It was quick and price was reasonable! A+",,,,
332366,109881,"2020-09-27 02:40:50","SWS Manufacturing, Co.",http://swsmfg.com,info@swsmfg.com,"(541) 223-7590","6523 Old Salem Rd NE",Albany,OR,97321,"6523 Old Salem Rd NE,Albany,OR 97321","Metal-Wholesale & Manufacturers, Aluminum, Automation Systems & Equipment, Brass, Bronze, Chemical Engineers, Construction Engineers, Copper, Fire Protection Engineers, Industrial Equipment & Supplies, Lead, Manufacturing Engineers, Material Handling & Processing Engineers, Material Handling Equipment, Mechanical Engineers, Metals, Movers, Oil & Gas Exploration & Development, Paper Manufacturers, Paper Products, Professional Engineers, Public & Commercial Warehouses, Scrap Metals, Self Storage, Smelters & Refiners-Precious Metals, Structural Engineers, Wood Products",,,A+,44.69802,-123.05498,https://i4.ypcdn.com/blob/964d9f9d0b27813c146fdca40f7ea6ae3618cc8a_100x100_crop.jpg?63f80dd,"Our Goal is to Exceed Our Customer's Need for Quality Products.","SWS Manufacturing, Co., is dedicated to the success of our clientele by providing innovative, yet practical, cost-effective solutions. Our 60,000-square foot facility is fully equipped with a rail spur, truck scales, and high-tech computer-aided machinery with a highly-trained staff that operates them 24 hours a day. Call us today for more details!","Mon - Fri: 8:00 am - 5:00 pm Sat - Sun Closed",,,"cash, check",,,http://swsmfg.com,,,,,,,,,
338664,111718,"2020-09-27 02:40:59","A-AAAKey Mini Storage",https://www.a-aaakey.com/our-promise/benefits/?utm_source=ypcom&utm_medium=listings&utm_campaign=mwiyp&utm_content=,warner@brundagemgt.com,"(504) 733-6860","5104 Jefferson Hwy","New Orleans",LA,70123,"5104 Jefferson Hwy,New Orleans,LA 70123","Self Storage, Automobile Storage, Boxes-Corrugated & Fiber-Wholesale & Manufacturers, Cold Storage Warehouses, Movers, Movers & Full Service Storage, Moving Boxes, Moving Services-Labor & Materials, Packaging Materials, Paper Manufacturers, Paper Products-Wholesale & Manufacturers, Storage Household & Commercial, Warehouses-Merchandise",,,,29.95018,-90.18115,,"PROUDLY SERVING HARAHAN, JEFFERSON, KENNER, METAIRIE!! Reliable storage whenever you need it. Personalized service for over 40 years!","A-AAAKey Mini Storage provides secure, convenient and clean self storage for our customers at a reasonable price. The key to our success is our storage facility managersВ’ commitment to excellent customer relationships. As a national leader and innovator in the self storage industry, A-AAAKey Mini Storage has grown to 42 self storage facilities in 9 states. As a three-time award winner of the Mini-Storage MessengerВ’s prestigious В“FACILITY OF THE YEARВ” award, we have shown that we know what you are looking for in self storage. If you need to un-clutter a garage, move a family member, store business records or equipment, join the many thousands of customers who have experienced the peace of mind that comes with storing your goods at an A-AAAKey Storage Facility! At A-AAAKey Mini Storage: - You do business directly with the actual self storage facility manager. - Our managers are empowered to provide you with all of your self storage needs. - We build and maintain only first-class facilities to further enhance your self storage experience. - Our level of commitment to you is what we believe will bring you back the next time you need storage. FAMILY-OWNED Brundage Management Company, Inc. (BMC) provides management services for A-AAAKey Mini Storage/Key Storage. Because we manage the properties we own thereВ’s no В“disconnectВ” between you and us. WeВ’ve based our business on providing our customers with superior service, features and management.","Mon - Sat: 9:00 am - 6:00 pm",,,"mastercard, amex, cash, discover, visa",,,"Benefits - Our Promise",,,,,,,,,
342976,112998,"2020-09-27 02:41:06","Southern Container Corp",,,"(252) 265-4049","2001 Stantonsburg Rd SE",Wilson,NC,27893,"2001 Stantonsburg Rd SE,Wilson,NC 27893","Boxes-Corrugated & Fiber, Paper Manufacturers, Self Storage, Storage Household & Commercial, Warehouses-Merchandise",,,,35.7028,-77.89548,,,,,,,,,"Southern Container Corporation",,,,,,,,,,
343543,113167,"2020-09-27 02:41:10","American Corrugated Box Co",https://www.americancorrugatedbox.com,,"(713) 224-4004","3801 Cherry St",Houston,TX,77026,"3801 Cherry St,Houston,TX 77026","Boxes-Corrugated & Fiber, Boxes-Corrugated & Fiber-Wholesale & Manufacturers, Movers, Movers & Full Service Storage, Moving Services-Labor & Materials, Paper Manufacturers, Self Storage, Storage Household & Commercial",,,,29.80356,-95.34529,,,,"Mon - Fri: 8:00 am - 5:00 pm Sat - Sun Closed","Phone: (713) 766-4381",,"all major credit cards",,,https://www.americancorrugatedbox.com,,,,,,,,,
345274,113681,"2020-09-27 02:41:10","DocuScan, LLC",,,"(240) 538-2291","36815 Fosters Neck Farm Ln",Bushwood,MD,20618,"36815 Fosters Neck Farm Ln,Bushwood,MD 20618","Paper Converting, Computer Online Services, Digital Printing & Imaging, Document Imaging, Self Storage",,,,38.26171,-76.80468,,,"DocuScan, LLC A Document Scanning Company We are dedicated to providing our clients with efficient and accurate scanning of business documents. We convert paper documents to a digital format. For example, we can convert documents to a .pdf, .tiff, .jpeg, .doc, and more. Data can be saved on dvd, cd, stick drive, hard drive, x-ternal hard drive, and or a cloud.","Mon - Fri: 9:00 am - 5:00 pm","Office: (301) 769-3770",,"check, paypal",,,,,,,,,,,,
347183,114261,"2020-09-27 02:41:15","CubeSmart Self Storage",https://www.cubesmart.com,webleads@cubesmart.com,"(954) 426-4477","349 W Hillsboro Blvd","Deerfield Beach",FL,33441,"349 W Hillsboro Blvd,Deerfield Beach,FL 33441","Self Storage, Automobile Storage, Boat Storage, Boxes-Corrugated & Fiber, Boxes-Corrugated & Fiber-Wholesale & Manufacturers, Cold Storage Warehouses, Marinas, Movers & Full Service Storage, Moving Boxes, Moving-Self Service, Packaging Materials, Paper Manufacturers, Paper Products-Wholesale & Manufacturers, Portable Storage Units, Public & Commercial Warehouses, Recreational Vehicles & Campers-Storage, Storage Household & Commercial, Trailers-Camping & Travel-Storage, Truck Rental",,,,26.3196,-80.10862,,"It's What's Inside That Counts","With more than 900 locations around the country, CubeSmart is one of the most trusted names in storage. Our mission is to simplify the organizational challenges created by our over 1,000,000 customersВ’ many life events, through innovative solutions and genuine care. Our single most important goal is to provide exceptional service to our customers who need us. ThatВ’s why CubeSmart was named the Best Customer Service award winner from Inside Self-StorageВ’s (ISS) 2017 Best of Business reader-choice poll, and why our customers and partners voted to award us the 2017 PeopleВ’s Choice StevieВ® Award for Favorite Customer Service. We care deeply about the things that matter to our customers, and strive to offer the highest standards of service, security, and cleanliness. Our customers choose us because, at CubeSmart, itВ’s whatВ’s inside that counts.","Mon - Fri: 9:30 am - 6:00 pm Sat: 8:30 am - 5:00 pm Sun: 11:00 am - 3:00 pm",,,"amex, discover, visa, cash, mastercard",,,https://www.cubesmart.com,,,,,,,,,