business_x_category.id,business.id,business.ts,business.business_name,business.home_page,business.email_address,business.phone,business.street,business.city,business.state,business.zip_code,business.full_address,business.category,business.rating,business.number_of_reviews,business.bbb_rating_or_license,business.latitude,business.longitude,business.cover_image,business.slogan,business.general_info,business.regular_hours,business.extra_phones,business.services_products,business.payment,business.price_range,business.aka,business.other_links,business.other_information,business.review_1_name,business.review_1_date,business.review_1_rating,business.review_1_text,business.review_2_name,business.review_2_date,business.review_2_rating,business.review_2_text
75473,32670,"2020-09-27 02:32:55","West Lawn Service",,jonwildwildwest34@yahoo.com,"(757) 816-1779","119 Esplanade Pl",Chesapeake,VA,23320,"119 Esplanade Pl,Chesapeake,VA 23320","Landscaping & Lawn Services, Aircraft-Hangars-Rental & Sales, Banquet Halls & Reception Facilities, Bingo Halls, Builders Hardware, Chemical Storage & Handling, City Halls, Coffee Roasting & Handling Equipment, Computer Hardware & Supplies, Concert Halls, Dance Halls, Electrical Wire Harnesses, Fish Hatcheries, Garment Hangers, Gutters & Downspouts Cleaning, Hair Braiding, Hair Removal, Hair Removing Equipment & Supplies, Hair Replacement, Hair Stylists, Hair Supplies & Accessories, Hair Weaving, Halls, Auditoriums & Ballrooms, Hamburgers & Hot Dogs, Hammocks, Hand Painting & Decorating, Hand Tools, Handbags, Handbags-Wholesale & Manufacturers, Handwriting Analysts & Experts, Handyman Services, Hang Gliding & Instruction, Hardware Stores, Hardware-Wholesale & Manufacturers, Hardwood Floors, Hardwoods, Harvesting-Contract, Hat Shops, Hats-Wholesale & Manufacturers, Hawaiian Goods, Hawaiian Restaurants, Hay, Hay Rides, Hazardous Material Control & Removal, Hazardous Waste Engineers, Landscape Contractors, Livestock Hauling, Marine Hardware, Material Handling & Processing Engineers, Material Handling Equipment, Material Handling Equipment-Wholesale & Manufacturers, Oil Field Hauling, Oil Handling Equipment, Physicians & Surgeons, Hand Surgery, Picture Hanging Service, Pipe Hangers, Pool Halls, Poultry Hatcheries, Saddlery & Harness, Sand & Gravel Handling Equipment, Second Hand Dealers, Sexual Harassment Attorneys, Signs-Erectors & Hangers, Trash Hauling, Trucking-Heavy Hauling, Trucking-Light Hauling, Wallpaper Hanging Equipment & Supplies, Wigs & Hair Pieces",,,,36.73466,-76.26674,,,,"Mon - Sun: Open 24 Hours",,,,,,,,,,,,,,,
1087867,344349,"2020-09-27 03:04:07","Leake & Andersson LLP",http://www.leakeandersson.com,Sclancy@leakeandersson.com,"(337) 233-7430","600 Jefferson St Ste 603",Lafayette,LA,70501,"600 Jefferson St Ste 603,Lafayette,LA 70501","Notaries Public, Accident & Property Damage Attorneys, Arbitration & Mediation Attorneys, Attorneys, Bankruptcy Law Attorneys, Business Law Attorneys, Business Litigation Attorneys, Construction Law Attorneys, Corporation & Partnership Law Attorneys, Employee Benefits & Worker Compensation Attorneys, Employment Discrimination Attorneys, General Practice Attorneys, Insurance, Insurance Attorneys, Labor & Employment Law Attorneys, Malpractice Law Attorneys, Medical Malpractice Attorneys, Patent, Trademark & Copyright Law Attorneys, Personal Injury Law Attorneys, Product Liability Law Attorneys, Professional Liability & Negligence Law Attorneys, Real Estate Attorneys, Sexual Harassment Attorneys, Workers Compensation Assistance, Wrongful Death Attorneys",,,,30.22339,-92.01931,,,"Leake & Andersson LLP represent clients involved in state and federal administrative proceedings, ranging from appearances before local governing bodies to adminstrative hearings and proceedings. Counsels clients on compliance with federal, state and local regulations, ordinances and procedures.","Mon - Fri: 9:00 am - 5:00 pm",,,"cash, check",,,http://www.leakeandersson.com,,,,,,,,,
1850616,562912,"2020-09-27 03:26:01","Oakland County Bar Association",,lrs@ocba.org,"(248) 334-3400","1760 S Telegraph Rd","Bloomfield Hills",MI,48302,"1760 S Telegraph Rd,Bloomfield Hills,MI 48302","Attorneys, Associations, Attorneys Referral & Information Service, Bankruptcy Law Attorneys, Business Law Attorneys, Child Custody Attorneys, Collection Law Attorneys, Contract Law Attorneys, Criminal Law Attorneys, Discrimination & Civil Rights Law Attorneys, Divorce Attorneys, Domestic Violence Attorneys, Elder Law Attorneys, Employment Discrimination Attorneys, Entertainment & Sports Law Attorneys, Estate Planning Attorneys, Family Law Attorneys, Immigration Law Attorneys, Juvenile Law Attorneys, Labor & Employment Law Attorneys, Landlord & Tenant Attorneys, Malpractice Law Attorneys, Military & Veterans Law Attorneys, Personal Injury Law Attorneys, Probate Law Attorneys, Real Estate Attorneys, Sexual Harassment Attorneys, Social Security & Disability Law Attorneys, Wrongful Death Attorneys",,,,42.61317,-83.30939,,"Need a lawyer? Call us today for a referral.","The attorneys on the Lawyer Referral Service are in good standing with the State Bar of Michigan and the Oakland County Bar Association and will offer a free 30-minute phone consultation. After 30 minutes, hourly rates may apply.","Mon - Fri: 9:30 am - 3:30 pm Sat - Sun Closed","Lawyer Referral Service direct line: (248) 338-2100",,,,,,"Parking: Lot",,,,,,,,
16561928,2233085,"2020-09-27 06:07:47","Reavey Law",http://www.reaveylaw.com,preavey@reaveylaw.com,"(816) 301-5738","1600 Genessee St","Kansas City",MO,64102,"1600 Genessee St,Kansas City,MO 64102","Employment Agencies, Attorneys, Discrimination & Civil Rights Law Attorneys, Employment Consultants, Employment Discrimination Attorneys, Employment Opportunities, Internet Marketing & Advertising, Internet Products & Services, Labor & Employment Law Attorneys, Sexual Harassment Attorneys, Social Security & Disability Law Attorneys",,,,39.09426,-94.60563,https://i3.ypcdn.com/blob/2746ada7312200f95d32c18244a5501be697af6c_100x100_crop.jpg?41e4770,"Kansas City Employment Law Attorney Licensed in Kansas & Missouri","Kansas City Employment Law Attorney","Mon - Fri: 9:00 am - 5:00 pm",,,,,"Reavey Law LLC",http://www.reaveylaw.com,"Specialties: Retaliation, Pregnancy Discrimination, Gender Discrimination, Age Discrimination, Employment Discrimination, Civil Rights, Disability, Discrimination & Harassment, Sexual Discrimination, Race Discrimination, Sex Discrimination, Racial Discrimination Free Consultation: Yes",,,,,,,,
16572969,2238029,"2020-09-27 06:08:07","Cashdan Kane",http://www.cashdankane.com,mkane@cashdankane.com,"(908) 264-2599","226 Saint Paul St",Westfield,NJ,07090,"226 Saint Paul St,Westfield,NJ 07090","Discrimination & Civil Rights Law Attorneys, Attorneys, Criminal Law Attorneys, Employee Benefits & Worker Compensation Attorneys, Employment Consultants, Employment Discrimination Attorneys, Employment Opportunities, Labor & Employment Law Attorneys, Sex Offense Attorneys, Sexual Harassment Attorneys, Social Security & Disability Law Attorneys",,,,40.65177,-74.3434,,,"Employment Law Attorneys With a National Reputation Cashdan & Kane represents clients in all aspects of employment law, including discrimination, retaliation, and contractual claims. The experience and success of the firm in a wide range of state and Federal employment law cases have earned it national recognition. With offices in Washington, D.C. and New Jersey, the advisory and litigation expertise of Cashdan & Kane includes: Wrongful Termination, Employment Contracts, Severance Negotiations, Race Discrimination, Gender and Sexual Orientation Discrimination, Sexual Harassment, Pregnancy Discrimination, Age Discrimination, Disability Discrimination, Religious Discrimination, National Origin Discrimination, Unpaid Commissions, Wage and Overtime, Whistleblower Litigation.","Mon - Fri: 9:00 am - 5:30 pm",,,"cash, check, debit, master card, visa",,,http://www.cashdankane.com,,,,,,,,,
16574337,2238646,"2020-09-27 06:08:08","Pilacek, Thomas J & Associates",http://www.pilaceklaw.com,dbrock@pilacek.com,"(407) 660-9595","158 Tuskawilla Rd Ste 2320","Winter Springs",FL,32708,"158 Tuskawilla Rd Ste 2320,Winter Springs,FL 32708","Attorneys, Administrative & Governmental Law Attorneys, Business Law Attorneys, Business Litigation Attorneys, Criminal Law Attorneys, Employment Consultants, Employment Contractors, Employment Discrimination Attorneys, Employment Opportunities, General Practice Attorneys, Labor & Employment Law Attorneys, Sex Offense Attorneys, Sexual Harassment Attorneys",,,,28.69824,-81.26162,,"Central Florida Labor and Employment Litigation Attorneys",,"Mon - Fri: 8:30 am - 5:00 pm Sat - Sun Closed","Fax: (407) 660-8343",,,,,http://www.pilaceklaw.com,,,,,,,,,
16574764,2238847,"2020-09-27 06:08:08","Favaro & Gorman Ltd",http://www.favarogorman.com,,"(847) 934-0060","835 N Sterling Ave",Palatine,IL,60067,"835 N Sterling Ave,Palatine,IL 60067","Employment Agencies, Attorneys, Career & Vocational Counseling, Criminal Law Attorneys, Employee Benefits & Worker Compensation Attorneys, Employment Consultants, Employment Opportunities, Executive Search Consultants, Labor & Employment Law Attorneys, Personal Injury Law Attorneys, Sex Offense Attorneys, Sexual Harassment Attorneys",,,A+,42.12524,-88.07086,https://i3.ypcdn.com/blob/7830c6c0d5318463d049bc24996e50ddd1617450_100x100_crop.jpg?d9a04b5,"Bringing Quality, Affordable Legal Services to Every Client.","If you're in the middle of a workplace dispute, don't settle for a ""general practice"" lawyer. Favaro & Gorman Ltd of Palatine focuses solely on the practice of employment and labor law, enabling us to bring you the most comprehensive representation available. Founded in 1986, we've been protecting the rights of northern Chicagoland workers with vigilance and honesty. We have experience with a variety of practice areas, including: В• Sexual harassment В• Age and racial discrimination В• Restrictive covenants and policies В• Wrongful discharge and severance agreements В• Whistle blowers and retaliation В• Overtime pay violations With a team of five lawyers each focusing on labor and employment law, we're able to bring your case to the best outcome for you. We work hard to try and settle your case without going to court, and fight hard should court time become necessary. Trust in our experience. Call Favaro & Gorman Ltd today.","Mon - Fri: 9:00 am - 5:00 pm Sat - Sun Closed","Fax: (847) 934-0060",,,,,http://www.favarogorman.com,"Specialties: Retaliation, Employment Agreements, Separation Agreements, Overtime, Contracts, Employers Representation, Sexual Harassment, Severance Agreements, Whistle Blower, Employment Discrimination, Sex Harassment, Non Competes, Discrimination & Harassment, Severance Negotiations",,,,,,,,
16575109,2239005,"2020-09-27 06:08:15","Favaro & Gorman Ltd",http://favarogorman.com,,"(815) 477-1110","9510 Turnberry Trl","Village Of Lakewood",IL,60014,"9510 Turnberry Trl,Village Of Lakewood,IL 60014","Sexual Harassment Attorneys, Adoption Law Attorneys, Attorneys, Career & Vocational Counseling, Child Custody Attorneys, Criminal Law Attorneys, Employee Benefits & Worker Compensation Attorneys, Employment Agencies, Employment Consultants, Employment Discrimination Attorneys, Employment Opportunities, Executive Search Consultants, Family Law Attorneys, General Practice Attorneys, Labor & Employment Law Attorneys, Personal Injury Law Attorneys, Sex Offense Attorneys",,,,42.22107,-88.38274,,"Bringing Quality, Affordable Legal Services to Every Client.","If you're in the middle of a workplace dispute, don't settle for a ""general practice"" lawyer. Favaro & Gorman Ltd of Palatine focuses solely on the practice of employment and labor law, enabling us to bring you the most comprehensive representation available. Founded in 1986, we've been protecting the rights of northern Chicagoland workers with vigilance and honesty. We have experience with a variety of practice areas, including: Sexual harassment Age and racial discrimination Restrictive covenants and policies Wrongful discharge and severance agreements Whistle blowers and retaliation Overtime pay violations With a team of five lawyers each focusing on labor and employment law, we're able to bring your case to the best outcome for you. We work hard to try and settle your case without going to court, and fight hard should court time become necessary. Trust in our experience. Call Favaro & Gorman Ltd today.","Mon - Sun: Open 24 Hours",,,"visa, master card",,,http://favarogorman.com,,,,,,,,,
16604401,2252379,"2020-09-27 06:09:25","Eskridge Law",http://www.eskridgelaw.net,geskridge@eskridgelaw.net,"(310) 303-3951","21250 Hawthorne Blvd",Torrance,CA,90503,"21250 Hawthorne Blvd,Torrance,CA 90503","Attorneys, Arbitration & Mediation Attorneys, Business Law Attorneys, Business Litigation Attorneys, Criminal Law Attorneys, Discrimination & Civil Rights Law Attorneys, Employment Contractors, Employment Discrimination Attorneys, General Practice Attorneys, Labor & Employment Law Attorneys, Real Estate Attorneys, Sex Offense Attorneys, Sexual Harassment Attorneys",5,"1 Review",,33.83606,-118.35223,//i1.ypcdn.com/videos/SP4200551260660/SP4200551260660.png?41e4770,,"Eskridge Law's Civil Litigation and Trial Practice Includes the Successful Handling of * Sexual Harassment * Employment Discrimination * Wrongful Termination * Real Estate * Business * Stock Fraud * Unfair Competition * Antitrust * Intellectual Property * Theft of Trade Secrets * Trade Libel * Breach of Contract Matters","Mon - Fri: 9:00 am - 5:30 pm Sat - Sun Closed","Fax: (310) 303-3952",,"mastercard, amex, check, visa",,,http://www.eskridgelaw.net,"Parking: Free Wheelchair Accessible: Yes Specialties: Employment Agreements, Gender Discrimination, Contracts, Breach Of Contract, Employers Representation, Defective Product Injuries, Civil Rights, Disability, Sexual Discrimination, Product Liability, Age Discrimination, Employment Discrimination, Sex Harassment, Discrimination & Harassment, Racial Discrimination",debreeka,01/08/2010,five,"Do not hesitate to contact Eskridge Law. They are the best!",,,,
16621440,2260303,"2020-09-27 06:10:21","BCG Attorney Search",http://www.bcgsearch.com/offices-29/legal-recruiter-Texas-Houston.php,jobs@bcgsearch.com,"(713) 270-1199","10777 Westheimer,Suite 1100",Houston,TX,77042,"10777 Westheimer,Suite 1100,Houston,TX 77042","Employment Opportunities, Attorneys, Attorneys Referral & Information Service, Bankruptcy Law Attorneys, Bankruptcy Services, Business Law Attorneys, Business Litigation Attorneys, Construction Law Attorneys, Corporation & Partnership Law Attorneys, Criminal Law Attorneys, Employment Consultants, Employment Contractors, Estate Planning, Probate, & Living Trusts, Immigration Law Attorneys, Labor & Employment Law Attorneys, Landlord & Tenant Attorneys, Malpractice Law Attorneys, Medical Malpractice Attorneys, Patent, Trademark & Copyright Law Attorneys, Real Estate Attorneys, Sexual Harassment Attorneys, Tax Attorneys, Trust Companies, Wills, Trusts & Estate Planning Attorneys",5,"7 Reviews",,29.73559,-95.56631,,,"BCG Attorney Search works with thousands of lawyers to place each candidate in the right attorney job in Houston. Each year BCG Attorney Search is approached by the best attorneys in Houston. Over the years, BCG Attorney Search has placed hundreds of candidates in Houston. BCG Attorney Search places attorneys with the top AM Law 100 Firms across the country. Additionally, BCG Attorney Search facilitates thousands of interviews. We know how to get you in the door.","Mon - Sun: Open 24 Hours","TollFree: (800) 298-6440",,"amex, debit, diners club, discover, visa, mastercard, check",,,http://www.bcgsearch.com/offices-29/legal-recruiter-Texas-Houston.php,,"Steven R.",02/01/2020,five,"BCG search was the perfect job portal for me because I was looking for something that would pay well and interest me too. Not a lot of that out there in my profession. Yet, IВ’m holding an offer letter right now that fits that description. All thanks to them.","Clinton W.",12/30/2019,five,"BCG search may not seem different from all the job recruiters out there, but it is. It listens to you, helps you get a great job, and lets you kick back through all of it."
16640235,2268910,"2020-09-27 06:11:04","Mann Law Firm",http://www.mannlaw.org,JPM@Mannlaw.org,"(864) 501-4739","512 E North St",Greenville,SC,29601,"512 E North St,Greenville,SC 29601","Employment Agencies, Attorneys, Criminal Law Attorneys, Employee Benefits & Worker Compensation Attorneys, Employment Discrimination Attorneys, Employment Opportunities, Family Law Attorneys, Labor & Employment Law Attorneys, Personal Injury Law Attorneys, Real Estate Attorneys, Sexual Harassment Attorneys, Workers Compensation Assistance",,,A+,34.85124,-82.39211,,"A Family Firm Standing Up For Workers","Mann Law Firm represents clients at every level of the South Carolina and U.S. court systems. Since 1991, John Mann has successfully settled more than a thousand claims and completed hundreds of trials. The firm's success stems from John Mann's considerable trial experience, excellent advocacy skills, intense preparation and research, and solemn commitment to provide you with high quality legal representation. Such success would be impossible without maintaining a harmonious, professional and cooperative relationship with clients.","Mon - Fri: 8:00 am - 5:00 pm Sat - Sun Closed",,,"visa, check, debit, mastercard",,"Mann Law Firm",http://www.mannlaw.org,"Wheelchair Accessible: Yes",,,,,,,,
17217980,2454204,"2020-09-27 06:29:21","Skane Wilcox LLP",http://www.skanewilcox.com,,"(213) 452-1200","1055 W 7th St Ste 1700","Los Angeles",CA,90017,"1055 W 7th St Ste 1700,Los Angeles,CA 90017","Attorneys, Construction & Building Equipment, Legal Service Plans, Product Liability Law Attorneys, Sexual Harassment Attorneys, Transportation Services, Trucking",,,,34.05091,-118.26332,,,,"Mon - Fri: 9:00 am - 5:00 pm","Fax: (213) 452-1201",,,,,http://www.skanewilcox.com,,,,,,,,,
26572958,4734489,"2020-09-27 10:14:37","Kauffman & Davis PC",http://www.davisanddavispc.com,,"(617) 742-6555","50 Congress St Ste 920",Boston,MA,02109,"50 Congress St Ste 920,Boston,MA 02109","Attorneys, Accountants-Certified Public, Business Law Attorneys, Business Litigation Attorneys, Child Custody Attorneys, Criminal Law Attorneys, Discrimination & Civil Rights Law Attorneys, Divorce Attorneys, Domestic Violence Attorneys, Employment Discrimination Attorneys, Family Law Attorneys, Immigration Law Attorneys, Labor & Employment Law Attorneys, Patent, Trademark & Copyright Law Attorneys, Sexual Harassment Attorneys",,,A+,42.35794,-71.05626,https://i1.ypcdn.com/blob/62161e44938282472ae0b857725eb6a91dd3b7e8_100x100_crop.jpg?f9d23e1,,,"Mon - Fri: 9:00 am - 5:00 pm","Phone: (617) 338-5770 Phone: (617) 933-3838 Fax: (617) 742-6336",,,,"Davis & Davis Davis And Davis Davis And Davis Pc Davis & Davis PC Kaufman & Davis PC Kauffman Davis & Hudson Davis and Davis Atty's","http://www.davisanddavispc.com http://www.kauffmananddavis.com",,,,,,,,,
26573179,4734572,"2020-09-27 10:14:37","Sanders & Sanders",http://www.wnyemploymentlaw.com,steve@buffalocpa.ws,"(716) 839-1489","401 Maryvale Dr",Buffalo,NY,14225,"401 Maryvale Dr,Buffalo,NY 14225","Attorneys, Accountants-Certified Public, Bankruptcy Law Attorneys, Bankruptcy Services, Business Litigation Attorneys, Sexual Harassment Attorneys, Tax Attorneys, Tax Return Preparation",,,A+,42.93225,-78.77395,,,,"Mon - Fri: 9:00 am - 5:00 pm","Phone: (716) 839-1512 Phone: (716) 839-0212",,visa,,"Saanders Steven Sanders, Steven Cpa Sanders, Harvey, JD Sanders Steven Steven Sanders, CPA",http://www.wnyemploymentlaw.com,"Parking: Lot Specialties: Federal Employee Issues, Union Issues, Separation Agreements, Gender Discrimination, Employers Representation, Disability, Sexual Discrimination, Severance Agreements, Sex Discrimination, Age Discrimination, Employment Discrimination, Discrimination & Harassment, Severance Negotiations, Race Discrimination, Racial Discrimination",,,,,,,,
26623776,4752287,"2020-09-27 10:16:42","Law Offices of James N. Papirmeister, Esq.",http://www.citysearch.com/profile/780290340/silver_spring_md/james_n_papirmeister.html,criminalfirm@yahoo.com,"(301) 589-2100","8630 Fenton St Ste 320","Silver Spring",MD,20910,"8630 Fenton St Ste 320,Silver Spring,MD 20910","Attorneys, Accountants-Certified Public, Business Law Attorneys, Criminal Law Attorneys, DUI & DWI Attorneys, Divorce Attorneys, Domestic Violence Attorneys, Drug Charges Attorneys, Family Law Attorneys, General Practice Attorneys, Juvenile Law Attorneys, Legal Service Plans, Litigation & Tort Attorneys, Personal Injury Law Attorneys, Sexual Harassment Attorneys",,,,38.99784,-77.0285,https://i1.ypcdn.com/blob/554be88a0e6e8d3b1d00c7f5bafcaeef9be02aee_100x100_crop.jpg?f9d23e1,,"Due to his experience as a former prosecutor with the Office of the State's Attorney for Prince George's County, James Papirmeister understands the need to have an aggressive voice on the side of a criminal defendant. He has tried thousands of criminal cases in his 30 years practicing criminal law. Our firm represents a wide variety of people, including doctors, psychologists, state and federal law enforcement personnel, politicians, teachers, construction workers, and musicians, among others.","Mon - Fri: 9:00 am - 5:00 pm","Phone: (301) 367-6500",,"master card, visa, discover, cash, check, amex",,,"http://www.citysearch.com/profile/780290340/silver_spring_md/james_n_papirmeister.html http://www.criminal-firm.com http://criminal-firm.com/#gn0jv http://criminal-firm.com/#8kd46",,,,,,,,,
26756029,4798500,"2020-09-27 10:21:06","William E Degen Atty",http://www.nhhco.com,,"(805) 966-1521","112 E Victoria St","Santa Barbara",CA,93101,"112 E Victoria St,Santa Barbara,CA 93101","Attorneys, Accident & Property Damage Attorneys, Accountants-Certified Public, Bankruptcy Law Attorneys, Bankruptcy Services, Business Law Attorneys, Business Litigation Attorneys, Construction Law Attorneys, Contract Law Attorneys, Corporation & Partnership Law Attorneys, Criminal Law Attorneys, Domestic Violence Attorneys, Employment Discrimination Attorneys, Estate Planning, Probate, & Living Trusts, Family Law Attorneys, General Practice Attorneys, Labor & Employment Law Attorneys, Landlord & Tenant Attorneys, Malpractice Law Attorneys, Medical Malpractice Attorneys, Personal Injury Law Attorneys, Personal Property Law Attorneys, Real Estate Attorneys, Sexual Harassment Attorneys, Tax Attorneys, Trust Companies, Wills, Trusts & Estate Planning Attorneys",,,,34.42584,-119.70401,,,,"Mon - Fri: 9:00 am - 5:00 pm","Phone: (805) 966-1501 Phone: (805) 730-1918",,,,"Degen William E Atty Degen William E","http://www.nhhco.com http://mullenlaw.com",,,,,,,,,