business_x_category.id,business.id,business.ts,business.business_name,business.home_page,business.email_address,business.phone,business.street,business.city,business.state,business.zip_code,business.full_address,business.category,business.rating,business.number_of_reviews,business.bbb_rating_or_license,business.latitude,business.longitude,business.cover_image,business.slogan,business.general_info,business.regular_hours,business.extra_phones,business.services_products,business.payment,business.price_range,business.aka,business.other_links,business.other_information,business.review_1_name,business.review_1_date,business.review_1_rating,business.review_1_text,business.review_2_name,business.review_2_date,business.review_2_rating,business.review_2_text
286010,94115,"2020-09-27 02:38:58","The Magic Shuttle Bus",https://www.magicshuttlebus.com,themagicshuttlebus@hotmail.com,"(231) 492-6144","8898 Wilderness Trl","Traverse City",MI,49684,"8898 Wilderness Trl,Traverse City,MI 49684","Buses-Charter & Rental, Bus Lines, Limousine Service, Tourist Information & Attractions, Tours-Operators & Promoters",,,,44.76058,-85.84898,https://i2.ypcdn.com/blob/f4842da9cfc3ba09240643b4c52a022b89d2e32e_100x100_crop.jpg?f9d23e1,,"The Magic Shuttle Bus is a Traverse City party bus and chauffeur service with an entire fleet of party buses ready to take your group on Traverse City brewery tours, Traverse City wine tours, bachelorette parties and more . It is one of the most unique and fun forms of hired transportation. So party down all night, or enjoy a family getaway to your own destination(s). The choice is yours. As a family business we pride ourselves on quality friendly service. Our name is attached to the business and we want only good reviews. Your driver will be responsible resource that will give you the best service available.","M-Sa 9am-9pm, Su Closed (Hours of operation can extend past normal business hours if needed)","Phone: (231) 883-7491 MobilePhone: (231) 492-6144",,"amex, cash, check, discover, master card, visa",,,https://www.magicshuttlebus.com,,,,,,,,,
286052,94131,"2020-09-27 02:38:58","American Dream Tours",http://www.americandreamtours.biz,,"(574) 936-5677","901 Lincolnway E",Plymouth,IN,46563,"901 Lincolnway E,Plymouth,IN 46563","Tours-Operators & Promoters, Buses-Charter & Rental, Tourist Information & Attractions, Travel Agencies",,,A+,41.34181,-86.2966,https://i2.ypcdn.com/blob/eba0777d43df2d567f1d499bf453d67630ebe5b2_100x100_crop.jpg?f9d23e1,"Specializing In Motor Coach Travel","American Dream Tours, in Plymouth, IN, has specialized in motor coach travel since 1985. We specialize in motor coach travel tours. For more information on group vacations and travel through bus tours, contact American Dream Tours in Plymouth today.","Mon - Fri: 9:00 am - 5:00 pm Sat - Sun Closed",,,"visa, check, amex, discover, master card",,,http://www.americandreamtours.biz,"Parking: Lot, Free Wheelchair Accessible: Yes",,,,,,,,
286926,94433,"2020-09-27 02:38:58","Ponce Inlet Excursions",,ponceinletexcursions@yahoo.com,"(386) 256-4726","5613 S Ridgewood Ave","Port Orange",FL,32127,"5613 S Ridgewood Ave,Port Orange,FL 32127","Transportation Providers, Buses-Charter & Rental, Shuttle Service, Tourist Information & Attractions, Transportation Services",,,,29.115107,-80.97376,,"Don't Miss The Bus!!!",,"Mon - Sun: 9:00 am - 8:30 pm",,,"all major credit cards",,,,,,,,,,,,
287367,94582,"2020-09-27 02:38:59","Karst Stage Inc",http://www.karststage.com,contact_airport@karststage.com,"(406) 556-3500","511 N Wallace Ave",Bozeman,MT,59715,"511 N Wallace Ave,Bozeman,MT 59715","Buses-Charter & Rental, Airport Transportation, Bus Lines, Tourist Information & Attractions, Tours-Operators & Promoters, Transportation Services",,,,45.68535,-111.0289,,,"Charter buses, regional airport shuttles, and everything in between. If you have a transportation need, we can fulfill it!","Mon - Fri: 8:00 am - 5:00 pm","Fax: (406) 556-3501 TollFree: (800) 257-4759 TollFree: (800) 287-4759",,,,"Karst Stage Lines",http://www.karststage.com,,,,,,,,,
287427,94604,"2020-09-27 02:38:59","Burl's Charter Service",http://burlstermite.com,,"(336) 856-0505","5265 Sweetwater Ct",Greensboro,NC,27407,"5265 Sweetwater Ct,Greensboro,NC 27407","Buses-Charter & Rental, Tourist Information & Attractions",,,,35.98152,-79.86113,,,,,,,,,,http://burlstermite.com,,,,,,,,,
287489,94627,"2020-09-27 02:38:59","Village Tours & Charters",,,"(918) 485-4595","2111 W Highway 51",Wagoner,OK,74467,"2111 W Highway 51,Wagoner,OK 74467","Sightseeing Tours, Buses-Charter & Rental, Tourist Information & Attractions, Tours-Operators & Promoters",,,,35.95861,-95.40672,,,,,,,,,,,,,,,,,,,
288333,94936,"2020-09-27 02:38:59","Mayo Tours Inc",http://www.mayotours.com,frogstoo@pawsplace.net,"(318) 325-4581","516 Martin St","West Monroe",LA,71292,"516 Martin St,West Monroe,LA 71292","Bus Lines, Buses-Charter & Rental, Tourist Information & Attractions",,,A+,32.46318,-92.15197,,,"ONE CALL DOES IT ALL! TEACHERS AND GROUP LEADERS Mayo Tours understands what it takes to get you and your group the best pricing and packages available! Allow us to arrange everything you want, get you the best prices and provide you with the 56 passenger bus to take you wherever you want to go! Fully equipped charter coaches. Wireless internet available, ADA Accessible Available, Insured, ICC Licensed, US DOT Licensed","Mon - Fri: 8:00 am - 5:00 pm",,,,,,http://www.mayotours.com,"Parking: Lot",,,,,,,,
288459,94984,"2020-09-27 02:38:59","San Diego Van Service",,,"(619) 646-4287","4138 Galt St","San Diego",CA,92117,"4138 Galt St,San Diego,CA 92117","Buses-Charter & Rental, Tourist Information & Attractions",,,,32.83859,-117.20269,https://i2.ypcdn.com/blob/0810aa139e46d8e4612e978c0626d9655342421d_100x100_crop.jpg?e66d351,,"If youВ’re visiting San Diego, you can rest assured that our drivers are very knowledgeable about local geography and attractions. We can make trips to amusement parks or other venues a more enjoyable experience for your group by eliminating the hassle of directions, driving, traffic, and parking If your group is heading to SeaWorld, the San Diego Zoo, Legoland, or to the beaches, or anywhere else in Southern California, we offer one-way and round trip service to all of San Diego County. For the locals, San Diego Van Service is the easiest and most efficient way to get your group around San Diego. If youВ’re heading out for a night on the town in the Gaslamp Quarter, or planning to play one of San DiegoВ’s many golf courses, let us do the driving and get your group to your destination for less than the price of multiple cabs. Need a wedding shuttle? Guest transportation and a ride for the bridal party? Rehearsal dinner transportation? No problem, San Diego Van Service has you covered. Especially with drivers that can make your Hotel to Venue, or Destination Wedding a breeze. What are you waiting for? Get a quote or make a reservation online right now!","Mon - Sun: 6:00 am - 12:00 am","Phone: (858) 876-8276",,"amex, discover, master card, visa",,"San Diego Van Svc",,,,,,,,,,
288565,95022,"2020-09-27 02:39:04","High Sunrise Charter",,,"(626) 940-5337","3360 Flair Dr","El Monte",CA,91731,"3360 Flair Dr,El Monte,CA 91731","Buses-Charter & Rental, Tourist Information & Attractions",,,,34.06933,-118.07093,,,,,,,,,"High Sunrise Charter Inc",,,,,,,,,,
289200,95249,"2020-09-27 02:39:04","Puget Sound Coach Lines",http://www.pscoachlines.com,yoshi@pscoachlines.com,"(253) 218-3508","809 W Main St",Auburn,WA,98001,"809 W Main St,Auburn,WA 98001","Bus Lines, Bus Distributors & Manufacturers, Shuttle Service, Sightseeing Tours, Tourist Information & Attractions, Tours-Operators & Promoters",,,,47.30782,-122.23909,,"Customer service and competitive pricing. Custom coach trips since 1984.","Puget Sound Coach Lines have been providing professional custom coach trips both locally and long distance. We can accommodate large groups in our sedans, vans, minibuses, and deluxe motor coaches. We offer custom charters for all occasions. Call us today for more information.","Mon - Fri: 9:00 am - 6:00 pm Sat - Sun Closed","Fax: (253) 939-5886 TollFree: (800) 460-6905",,"check, debit, amex, master card, visa, cash",,,http://www.pscoachlines.com,,,,,,,,,
289264,95271,"2020-09-27 02:39:04","Wagner Tours, Inc.",,tourswagner@aol.com,"(973) 427-4313","865 Belmont Ave","North Haledon",NJ,07508,"865 Belmont Ave,North Haledon,NJ 07508","Buses-Charter & Rental, Bus Lines, Tourist Information & Attractions, Tours-Operators & Promoters",,,,40.95217,-74.18928,https://i2.ypcdn.com/blob/1a7a08f14134326142712762f9ad72200d375171_100x100_crop.jpg?f9d23e1,,"Established in 1946, Wagner Tours Inc. provides transportation vehicles to a wide variety of clients. Based in North Haledon, N.J., the firm serves the corporation, travel groups, senior citizen, school and wedding guest markets. It maintains luxury motorcoaches, which can accommodate up to 49 passengers. Each coach is equipped with video home systems and digital video disc systems and also a lavatory. Wagner Tours Inc. provides transportation facility for single- as well as multiple-day trips.","Mon - Fri: 8:00 am - 4:00 pm Sat - Sun Closed","Phone: (973) 427-3942 Phone: (973) 427-1343 Fax: (973) 427-3942 Fax Number: (973) 427-3942",,,,"Wagner Tours Inc",,"Specialties: Weddings",,,,,,,,
289772,95452,"2020-09-27 02:39:04","Rockford Charter Coach",http://www.rockfordchartercoach.com,rmills@rockfordchartercoach.com,"(815) 387-9122","5855 Falcon Rd",Rockford,IL,61109,"5855 Falcon Rd,Rockford,IL 61109","Bus Lines, Sightseeing Tours, Tourist Information & Attractions",,,,42.1965,-89.08643,,"Local national tour and charter service.","Let Rockford Charter Coach take you where you want to go! We're proud to serve the Rockford, Illinois area, as well as the neighboring metro areas. Our dedicated drivers look forward to assisting you and answering any questions you may have. We have charters for all occasions, including: В• Sporting events В• Shopping В• Tours В• Church outings В• Conventions Our fleet of fully-equipped deluxe motor-coaches is ideal for any large group and we look forward to becoming a charter company that you can always depend on. Enjoy DVD players, restrooms, reclining seats and more! Get on the road with Rockford Charter Coach today.","Mon - Fri: 8:00 am - 4:30 pm",,,,,,http://www.rockfordchartercoach.com,,,,,,,,,
290124,95578,"2020-09-27 02:39:04","Blue Grass Tours",http://www.bluegrasstours.com,tours@bluegrasstours.com,"(859) 252-5744","817 Enterprise Dr",Lexington,KY,40510,"817 Enterprise Dr,Lexington,KY 40510","Tours-Operators & Promoters, Aircraft-Charter, Rental & Leasing, Buses-Charter & Rental, Sightseeing Tours, Tourist Information & Attractions",,,A+,38.06191,-84.55698,,,,"Mon - Fri: 8:00 am - 5:00 pm Sat - Sun: 8:00 am - 8:30 pm","Charter Department: (859) 233-2152 Tour Department: (859) 252-5744",,"debit, check, all major credit cards",,,http://www.bluegrasstours.com,"Parking: Lot",,,,,,,,
290242,95627,"2020-09-27 02:39:04","Cville Tours",http://www.cvilletours.com,info@cvilletransportation.com,"(434) 218-2416","1591 Delphi Ln",Charlottesville,VA,22911,"1591 Delphi Ln,Charlottesville,VA 22911","Buses-Charter & Rental, Tourist Information & Attractions, Transportation Services",,,,38.0943,-78.4232,,"Wedding Transportation","We are Charlottesville's First Tour Operator, we specialize in unique and behind the scenes experiences. We are the number one choice for group activities. Give us a try and experience Charlottesville like a local","Mon - Sat: 9:00 am - 9:00 pm Sun: 9:00 am - 5:00 pm",,,,,"Cville Transportation","http://www.cvilletours.com http://www.cvilletransportation.com",,,,,,,,,
290278,95641,"2020-09-27 02:39:04","The Beat",http://www.bexleybeat.net,bexleybeat@wowway.com,"(614) 237-4216","2700 E Main St",Columbus,OH,43209,"2700 E Main St,Columbus,OH 43209","Airport Transportation, Bus Lines, Buses-Charter & Rental, Convention Services & Facilities, Driving Service, Limousine Service, Party Planning, Public Transportation, Shuttle Service, Tourist Information & Attractions, Tours-Operators & Promoters, Transportation Providers, Transportation Services, Truck Rental",,,A+,39.95724,-82.92656,https://i2.ypcdn.com/blob/2b01d989168259c5452693a77895a7f2308e1c1e_100x100_crop.jpg?f9d23e1,,"Small Group Shuttle Charters - 14 to 22 passenger vehicles","Mon - Fri: 8:00 am - 5:00 pm",,,"discover, amex, visa, mastercard",,"BEAT Bus Bexley Beat",http://www.bexleybeat.net,"Specialties: Weddings, Concert Venues, Birthdays",,,,,,,,
290324,95650,"2020-09-27 02:39:04","Leave 2 Day Travel",http://www.leave2day.com,,"(314) 456-9655","12934 Partridge Run Dr",Florissant,MO,63033,"12934 Partridge Run Dr,Florissant,MO 63033","Travel Agencies, Airline Ticket Agencies, Bus Tours-Promoters, Buses-Charter & Rental, Car Rental, Cruises, Diving Excursions & Charters, Event Ticket Sales, Family & Business Entertainers, Hotels, Online & Mail Order Shopping, Passport Photo & Visa Information & Services, Resorts, Sports & Entertainment Ticket Sales, Tourist Information & Attractions, Travel Clubs, Travel Insurance, Wedding Reception Locations & Services",5,"1 Review",,38.81068,-90.24273,https://i2.ypcdn.com/blob/b0ab82e92aa1efe0ca51ca80f61597c7b0db759b_100x100_crop.jpg?e66d351,"Why Wait? Lets Go!",,"Mon - Fri: 9:00 am - 7:00 pm","TollFree: (888) 456-9733",,"all major credit cards, debit, paypal, visa, mastercard, company card",,,"http://www.leave2day.com http://bit.ly/1KoKout",,"Paula S.","Edited: 10/04/2018",five,"The thought of feeling free",,,,
290570,95741,"2020-09-27 02:39:04","Gateway Tours and Cruises",http://gatewaytravel.org,blackburnd@gatewaytravel.org,"(864) 585-7390","1023 Fernwood Glendale Rd",Spartanburg,SC,29307,"1023 Fernwood Glendale Rd,Spartanburg,SC 29307","Travel Agencies, Bus Tours-Promoters, Buses-Charter & Rental, Cruises, Museums, Places Of Interest, Tourist Information & Attractions",,,,34.96614,-81.89322,,,,"Mon - Fri: 9:00 am - 6:00 pm",,,"all major credit cards, cash, check",,,http://gatewaytravel.org,"Specialties: Cruiseliner, Cruises, Getaways, Holidays, Vacations",,,,,,,,
290886,95855,"2020-09-27 02:39:04","Classic Charter",http://www.classiccharter.com,info@classiccharter.com,"(559) 651-7745",,,,,,"Driving Service, Bus Lines, Bus Tours-Promoters, Buses-Charter & Rental, Educational Services, Limousine Service, School Bus Service, Sightseeing Tours, Tourist Information & Attractions, Transportation Services, Travel Agencies, Travel Services-Commercial",,,A+,,,https://i2.ypcdn.com/blob/be3f7756c226ba7c08dc86f67d8bb8dd49c34f2e_100x100_crop.jpg?f9d23e1,"""We Make Getting There Half the Fun""","*All Destinations*Modern Luxurious Motor Coaches*""Competitive in Price, Superior in Quality and Service""*Serving the Valley Over 30Years!","Mon - Fri: 8:00 am - 5:00 pm","Fresno - Clovis: (559) 299-9200 Visalia: (559) 738-1111 Bakersfield: (661) 861-9200 Merced: (559) 723-9200 Toll-Free: (877) 687-2345",,"amex, discover, master card, visa, check",,,"Serving All Groups in the Central Valley",,,,,,,,,
291219,95973,"2020-09-27 02:39:04","Mountain View Tours.",http://www.mountainviewtours.com,info@mountainviewtours.com,"(520) 838-9080","4995 N Casa Grande Hwy",Tucson,AZ,85743,"4995 N Casa Grande Hwy,Tucson,AZ 85743","Buses-Charter & Rental, Limousine Service, Shuttle Service, Sightseeing Tours, Tourist Information & Attractions, Tours-Operators & Promoters",,,,32.29759,-111.03447,,"Committed To High-quality Service.","As one of Arizonas leading charter bus companies, Mountain View Tours takes pride in providing our customers with the safest and most reliable chartered ground transportation. With over 25 years of experience we have rapidly become the preferred carrier of many major resorts, tour groups, corporations, and schools throughout Arizona and the Southwestern United States. We are a family owned and operated business and we are committed to your safety and satisfaction. Mountain View knows the value of quality service and top-grade equipment. Many years in the charter bus business allows for quick identification of each group's unique needs and priorities. We offer: Van Hool Motor Coaches Volvo Motor Coaches Mini Coaches Wheelchair accessible coaches With over 25 years covering the Highways, National Parks, Attractions, and Cities of the Southwestern U.S. and beyond, Mountain View has the experience, veteran drivers, and highway knowledge to accommodate travel anywhere in the West. All of our Coaches (including the mini-coaches) are equipped with flushing restrooms, PA/CD/DVD systems, arm and foot rests, window blinds, and strong overhead-controlled air conditioning. Our safety-award winning drivers are highly trained and average over 10 years of professional driving experience. Uniformed, personable, and always in communication with Nextel cell phones/radios on every coach, our drivers will get you there safely and on time. Let Mountain View Tours become your preferred charter service.","Mon - Fri: 8:00 am - 5:00 pm Sat - Sun Closed",,,"check, cash, amex, discover, master card, visa, debit",,,http://www.mountainviewtours.com,,,,,,,,,
291412,96046,"2020-09-27 02:39:15","Lexus Tours",http://www.lexus.com,,"(407) 996-7862","5613 Craindale Dr",Orlando,FL,32819,"5613 Craindale Dr,Orlando,FL 32819","Tours-Operators & Promoters, Bus Lines, Tourist Information & Attractions",,,A+,28.48214,-81.49379,,,,,"Phone: (407) 952-7394",,,,"Lexus Tours Inc",http://www.lexus.com,,,,,,,,,
292045,96274,"2020-09-27 02:39:15","Western Sky Helicopters",https://www.westernskyhelicopters.com,info@westernskyhelicopters.com,"(480) 416-6415","7305 E Greenway Rd",Scottsdale,AZ,85260,"7305 E Greenway Rd,Scottsdale,AZ 85260","Bus Lines, Aerial Photographers, Helicopter Charter & Rental Service, Photography & Videography, Portrait Photographers, Public Transportation, Sightseeing Tours, Tourist Information & Attractions, Tours-Operators & Promoters, Transit Lines, Transportation Services",,,,33.62529,-111.92174,,,"Welcome to Western Sky Helicopters, the Valley's premier helicopter sightseeing and charter company. When it comes to air tours, experience matters! Our pilots are all experienced, high time, professional pilots. We hold the FAA's highest level of certification, meaning our aircraft are maintained to the highest standards and our pilots are trained to the highest levels. We also offer the best helicopter charters in the Valley! Whether you need to get across town or across the state, Western Sky Helicopters can meet all you helicopter needs. Come fly with the best!","Mon - Fri: 9:00 am - 5:00 pm Sat - Sun Closed",,,"amex, discover, cash, check",,,https://www.westernskyhelicopters.com,,,,,,,,,
292266,96340,"2020-09-27 02:39:15","Great Falls Tour De",http://www.greatfallshistorictrolley.com,,"(406) 771-1100",,"Great Falls",MT,59401,"Great Falls,MT 59401","Tours-Operators & Promoters, Buses-Charter & Rental, Tourist Information & Attractions",,,,,,,,,"Tue - Thu: 10:00 am - 4:00 pm Fri - Sat: 10:00 am - 1:00 pm Sun: 10:00 am - 4:00 pm",,,,,"Tour De Great Falls/Historic Trolley Tour De Great Falls",http://www.greatfallshistorictrolley.com,,,,,,,,,
292352,96373,"2020-09-27 02:39:15","Star Travel & Tours",http://startravelandtours.com,startravelandtour@yahoo.com,"(585) 797-9044","308 Buell Rd",Rochester,NY,14624,"308 Buell Rd,Rochester,NY 14624","Buses-Charter & Rental, Tourist Information & Attractions, Tours-Operators & Promoters",,,A,43.13353,-77.66522,,,"Upstate NY best Travel and Tours company. We offer verity of Overnight and Day Trips as well as daily casino trips. Need transportation for your group? Star Travel and Tours also charters our buses. We operate late model motor coaches equipped with electrical plugs at every seat and WiFi onboard.","Mon - Fri: 9:00 am - 6:00 pm",,,"no credit cards",,,website,,,,,,,,,
292808,96541,"2020-09-27 02:39:15","Miami Jet Tours",http://www.miamijettours.com,info@miamijettours.com,"(305) 681-2407","12805 NW 42nd Ave","Opa Locka",FL,33054,"12805 NW 42nd Ave,Opa Locka,FL 33054","Bus Tours-Promoters, Airport Transportation, Buses-Charter & Rental, Sightseeing Tours, Tourist Information & Attractions, Tours-Operators & Promoters, Transportation Services",,,A+,25.89104,-80.26569,https://i2.ypcdn.com/blob/ef4935d533651796220373df2d21132110225290_100x100_crop.jpg?e66d351,"Your Choice for Tours and Transportation",,"Mon - Fri: 8:00 am - 5:00 pm",,,"amex, discover, master card, visa",,,http://www.miamijettours.com,,,,,,,,,
292823,96547,"2020-09-27 02:39:15","Alaska Bus Connections & Private Charters Inc.",,alaskabusconnections@gmail.com,"(907) 717-9150","5000 W Intl Airport Rd",Anchorage,AK,99502,"5000 W Intl Airport Rd,Anchorage,AK 99502","Buses-Charter & Rental, Airport Transportation, Public Transportation, Tourist Information & Attractions, Transportation Services",,,,61.096165,-150.09395,https://i2.ypcdn.com/blob/27de76bbc6ad6a1f91e8b7fb61ce4cf654644962_100x100_crop.jpg?f9d23e1,,"Alaska's economic shuttle connecting Whittier or Seward cruise ports with the ANC Anchorage Airport and hotels. A transportation company with high standards in customer service, local knowledge, integrity, and humor. Reliable, safe, fun to be with.",,,,,,,,,,,,,,,,
293095,96636,"2020-09-27 02:39:15","Fort Collins Charter Service, Inc.",http://fccharter.com,fococharter@outlook.com,"(970) 829-8040","1402 Sailcrest Ct","Fort Collins",CO,80526,"1402 Sailcrest Ct,Fort Collins,CO 80526","Bus Lines, Buses-Charter & Rental, Shuttle Service, Sightseeing Tours, Tourist Information & Attractions, Tours-Operators & Promoters",,,,40.53166,-105.10056,,"Colorado's friendly, professional motor coach charter service!","Fort Collins Charter Service, Inc., is locally owned business and located in Fort Collins, Colorado. It is the charter buses for all occasions, including local and cross country trips. Our motor coaches are equipped with comfortable reclining seats and armrests, rest rooms, generous cargo and overhead storage, PA systems, TV monitors and DVD players. We service all events, including: conventions, conferences, weddings, ski trips, athletic events, summer excursions, athletic trips, church groups, schools, senior groups, businesses, fraternities/sororities, special events. Contact us today for an estimate!","Mon - Fri: 9:00 am - 5:00 pm Sat - Sun Closed",,,"cash, check, amex, discover, master card, visa, debit",,,http://fccharter.com,,,,,,,,,
293104,96639,"2020-09-27 02:39:15","Hotard Coaches Inc",http://www.hotard.com,charters@hotard.com,"(800) 356-6831","2838 Touro St","New Orleans",LA,70122,"2838 Touro St,New Orleans,LA 70122","Buses-Charter & Rental, Tourist Information & Attractions",,,A+,29.98716,-90.06133,,,"Hotard Coaches is a charter motorcoach company, with headquarters in New Orleans, LA. Hotard also has offices in Lafayette and Baton Rouge, Louisiana and Ocean Spring Mississippi.","Mon - Fri: 8:00 am - 5:00 pm Sat - Sun Closed","Phone: (504) 944-0253",,"all major credit cards, amex, mastercard, visa, discover",,"Hotard Coaches Hotard Coaches",http://www.hotard.com,,,,,,,,,