business_x_category.id,business.id,business.ts,business.business_name,business.home_page,business.email_address,business.phone,business.street,business.city,business.state,business.zip_code,business.full_address,business.category,business.rating,business.number_of_reviews,business.bbb_rating_or_license,business.latitude,business.longitude,business.cover_image,business.slogan,business.general_info,business.regular_hours,business.extra_phones,business.services_products,business.payment,business.price_range,business.aka,business.other_links,business.other_information,business.review_1_name,business.review_1_date,business.review_1_rating,business.review_1_text,business.review_2_name,business.review_2_date,business.review_2_rating,business.review_2_text
16893811,2347896,"2020-09-27 06:18:30",Brookstone,http://www.brookstone.com,email@removed.com,"(513) 791-0052","7875 Montgomery Rd Spc 2331",Cincinnati,OH,45236,"7875 Montgomery Rd Spc 2331,Cincinnati,OH 45236","Gift Shops, Battery Charging Equipment, Battery Supplies, Bedding, Beds & Bedroom Sets, Chairs, Collectibles, Consumer Electronics, Desk Pads & Accessories, Furniture Stores, Futons, Garden Centers, Home Furnishings, House Cleaning Equipment & Supplies, Linens, Massage Equipment & Supplies, Mirrors, Novelties, Office Furniture & Equipment, Online & Mail Order Shopping, Patio & Outdoor Furniture, Protective Covers, Toy Stores",1,"1 Review",,39.20129,-84.37801,,,,"Mon - Sat: 10:00 am - 9:00 pm Sun: 12:30 pm - 6:00 pm","Phone: (513) 745-0205 Phone: (513) 745-9100 Phone: (513) 791-9866 Phone: (513) 791-1975",,"all major credit cards, master card, visa",,"Brook Bros",http://www.brookstone.com,,johnyou35,09/11/2011,one,"I would advise anyone to avoid this Brookstone location at all costs. After looking at one of their products, the manager kept referring to me as """"brother"""", and """"bro"""", and not making eye contact with me, and just treating me in a very disrespectful manner. I said to him, """"quit calling me brother, I am not your brother, please speak to me with respect"""". He then tried staring me down, and started yelling at me to get out. I told him I was leaving, and he followed me standing over me like a nightclub bouncer, and then after I was in the mall common area, continued to thereaten me with violence. I made a complaint to brookstone customer care, and the issue has not yet been resolved. The manager of this store is very dis-respectful of his customers, and it is because of this that I would advise anyone to not do business with this store.",,,,
16893902,2347917,"2020-09-27 06:18:30",Brookstone,http://www.brookstone.com,customerservice@brookstone.com,"(813) 289-3559","277 Westshore Plz",Tampa,FL,33609,"277 Westshore Plz,Tampa,FL 33609","Gift Shops, Battery Charging Equipment, Battery Supplies, Bedding, Beds & Bedroom Sets, Chairs, Collectibles, Consumer Electronics, Desk Pads & Accessories, Furniture Stores, Futons, Garden Centers, Home Furnishings, House Cleaning Equipment & Supplies, Linens, Massage Equipment & Supplies, Mirrors, Novelties, Office Furniture & Equipment, Online & Mail Order Shopping, Patio & Outdoor Furniture, Protective Covers, Toy Stores",,,,27.94487,-82.527405,,,,"Mon - Sat: 10:00 am - 9:00 pm Sun: 12:00 pm - 6:00 pm","Phone: (813) 287-8621",,,,"Brookstone Company Inc Brookstone Inc.",http://www.brookstone.com,"Specialties: Father's Day, Cabinetry, Pillows, Cumpleanos, Fountains, Furniture, Furnishings, Anniversaries, Luggage, Lighting, Timepieces, Dads, Couches, Batteries, S, Retirements, Mirrors, Xmas, Sofas, Chairs, Housewarming, Clocks, Christmas, Office Equipment, Love Seats, Cabinets, Appliances, Birthdays, Electronics",,,,,,,,
16894100,2347966,"2020-09-27 06:18:30",Brookstone,http://www.brookstone.com,customerservice@brookstone.com,"(704) 359-0033","5501 Josh Birmingham Pkwy",Charlotte,NC,28208,"5501 Josh Birmingham Pkwy,Charlotte,NC 28208","Gift Shops, Battery Charging Equipment, Battery Supplies, Bedding, Beds & Bedroom Sets, Chairs, Collectibles, Consumer Electronics, Desk Pads & Accessories, Furniture Stores, Futons, Garden Centers, Home Furnishings, House Cleaning Equipment & Supplies, Linens, Massage Equipment & Supplies, Mirrors, Novelties, Office Furniture & Equipment, Online & Mail Order Shopping, Patio & Outdoor Furniture, Protective Covers, Toy Stores",,,,35.235794,-80.896355,,,,"Mon - Sun: 6:00 am - 10:00 pm","Phone: (704) 359-0162 Phone: (704) 359-0034 Primary Phone: (704) 359-0173 Phone: (704) 359-0173 Phone: (603) 759-1517",,"master card, visa, diners club, discover, amex, debit, all major credit cards",,"Brookstone Co Brookstone Company Brookstone Inc.",http://www.brookstone.com,"Bike Parking: No Price Range : Average Specialties: Dads",,,,,,,,
16894219,2347990,"2020-09-27 06:18:30",Brookstone,http://www.brookstone.com,,"(919) 772-7404","7820 Old Baucom Rd",Raleigh,NC,27610,"7820 Old Baucom Rd,Raleigh,NC 27610","Gift Shops, Battery Charging Equipment, Battery Supplies, Bedding, Beds & Bedroom Sets, Chairs, Collectibles, Consumer Electronics, Desk Pads & Accessories, Furniture Stores, Futons, Garden Centers, Home Furnishings, House Cleaning Equipment & Supplies, Linens, Massage Equipment & Supplies, Mirrors, Novelties, Office Furniture & Equipment, Online & Mail Order Shopping, Patio & Outdoor Furniture, Protective Covers, Toy Stores",,,,35.69919,-78.50833,,,,,,,,,,http://www.brookstone.com,"Parking: Lot",,,,,,,,
16895851,2348438,"2020-09-27 06:18:31","Franklin's Ben Franklin",http://www.mnbenfranklin.com,franklinsbenfranklin@gmail.com,"(320) 245-2122","413 Commercial Ave N",Sandstone,MN,55072,"413 Commercial Ave N,Sandstone,MN 55072","General Merchandise, Battery Supplies, Candy & Confectionery, Cookware & Utensils, Craft Supplies, Cutlery, Department Stores, Fabric Shops, Furniture Stores, Greeting Cards, Home Furnishings, Housewares, Kitchen Accessories, News Stands, Office Equipment & Supplies, Plastic & Glass Jars, Religious Bookstores, Silverware, Sporting Goods, Toy Stores, Variety Stores",,,,46.13171,-92.86565,,,,"Mon - Sat: 9:00 am - 5:00 pm Sun: 10:00 am - 5:00 pm",,,"all major credit cards, master card, visa, amex, discover",,,http://www.mnbenfranklin.com,,,,,,,,,
16895954,2348464,"2020-09-27 06:18:31","Apple Core",,,"(337) 365-1633","1301 E Saint Peter St","New Iberia",LA,70560,"1301 E Saint Peter St,New Iberia,LA 70560","Art Supplies, Art Galleries, Dealers & Consultants, Craft Supplies, Gift Shops, Office Equipment & Supplies, School Supplies & Services, Toy Stores",,,A+,29.99456,-91.80041,,,,"Mon - Sat: 9:00 am - 5:00 pm Sun Closed",,,"amex, master card, visa",,,,,,,,,,,,
16896027,2348479,"2020-09-27 06:18:31",Brookstone,http://www.brookstone.com,,"(602) 992-9712","4550 E Cactus Rd",Phoenix,AZ,85032,"4550 E Cactus Rd,Phoenix,AZ 85032","Gift Shops, Battery Charging Equipment, Battery Supplies, Bedding, Beds & Bedroom Sets, Chairs, Collectibles, Consumer Electronics, Desk Pads & Accessories, Furniture Stores, Futons, Garden Centers, Home Furnishings, House Cleaning Equipment & Supplies, Linens, Massage Equipment & Supplies, Mirrors, Novelties, Office Furniture & Equipment, Online & Mail Order Shopping, Patio & Outdoor Furniture, Protective Covers, Toy Stores",,,,33.5999,-111.98387,,,,"Mon - Sat: 10:00 am - 9:00 pm Sun: 11:00 am - 6:00 pm",,,"all major credit cards",,,http://www.brookstone.com,"Parking: Garage, Self Wheelchair Accessible: Yes",,,,,,,,
16896142,2348502,"2020-09-27 06:18:31",Brookstone,http://www.brookstone.com,customerservice@brookstone.com,"(480) 726-6857","3111 W Chandler Blvd Ste 1056",Chandler,AZ,85226,"3111 W Chandler Blvd Ste 1056,Chandler,AZ 85226","Gift Shops, Battery Charging Equipment, Battery Supplies, Bedding, Beds & Bedroom Sets, Chairs, Collectibles, Consumer Electronics, Desk Pads & Accessories, Furniture Stores, Futons, Garden Centers, Home Furnishings, House Cleaning Equipment & Supplies, Linens, Massage Equipment & Supplies, Mirrors, Novelties, Office Furniture & Equipment, Online & Mail Order Shopping, Patio & Outdoor Furniture, Protective Covers, Toy Stores",,,,33.30528,-111.89655,,,,"Mon - Sat: 10:00 am - 9:00 pm Sun: 11:00 am - 6:00 pm","Phone: (480) 762-6859 Primary Phone: (603) 318-4216 Phone: (480) 821-7343",,"all major credit cards, master card, visa",,"Brookstone Brookstone Brookstone Inc.",http://www.brookstone.com,"Specialties: Dads",,,,,,,,
16896609,2348634,"2020-09-27 06:18:31",Brookstone,http://www.brookstone.com,affiliates@brookstone.com,"(248) 348-7185","27500 Novi Rd Space 207",Novi,MI,48377,"27500 Novi Rd Space 207,Novi,MI 48377","Gift Shops, Battery Charging Equipment, Battery Supplies, Bedding, Beds & Bedroom Sets, Chairs, Collectibles, Consumer Electronics, Desk Pads & Accessories, Furniture Stores, Futons, Garden Centers, Home Furnishings, House Cleaning Equipment & Supplies, Linens, Massage Equipment & Supplies, Mirrors, Novelties, Office Furniture & Equipment, Online & Mail Order Shopping, Patio & Outdoor Furniture, Protective Covers, Toy Stores",,,,42.48958,-83.47416,,,,"Mon - Sat: 10:00 am - 9:00 pm Sun: 11:00 am - 6:00 pm",,,"master card, visa",,,http://www.brookstone.com,,,,,,,,,
16896829,2348693,"2020-09-27 06:18:31",Brookstone,http://www.brookstone.com,,"(773) 601-8191","O'Hare Terminal 1 # C11",Chicago,IL,60666,"O'Hare Terminal 1 # C11,Chicago,IL 60666","Gift Shops, Battery Charging Equipment, Battery Supplies, Bedding, Beds & Bedroom Sets, Chairs, Collectibles, Consumer Electronics, Desk Pads & Accessories, Furniture Stores, Futons, Garden Centers, Home Furnishings, House Cleaning Equipment & Supplies, Linens, Massage Equipment & Supplies, Mirrors, Novelties, Office Furniture & Equipment, Online & Mail Order Shopping, Patio & Outdoor Furniture, Protective Covers, Toy Stores",,,,41.88415,-87.63241,,,,"Mon - Sun: 5:00 am - 10:00 pm","Phone: (773) 462-9201 Phone: (773) 462-0182 Fax: (773) 601-8192",,"visa, amex, debit, diners club, discover, master card",,,http://www.brookstone.com,,,,,,,,,
16897458,2348859,"2020-09-27 06:18:31",Brookstone,http://www.brookstone.com,,"(860) 644-1868","200 Evergreen Way Unit 264","South Windsor",CT,06074,"200 Evergreen Way Unit 264,South Windsor,CT 06074","Gift Shops, Battery Charging Equipment, Battery Supplies, Bedding, Beds & Bedroom Sets, Chairs, Collectibles, Consumer Electronics, Desk Pads & Accessories, Furniture Stores, Futons, Garden Centers, Home Furnishings, House Cleaning Equipment & Supplies, Linens, Massage Equipment & Supplies, Mirrors, Novelties, Office Furniture & Equipment, Online & Mail Order Shopping, Patio & Outdoor Furniture, Protective Covers, Toy Stores",,,,41.81162,-72.55653,,,,,,,,,,http://www.brookstone.com,,,,,,,,,
16897787,2348932,"2020-09-27 06:18:31",Brookstone,http://www.brookstone.com,,"(480) 941-6009","7014 E Camelback Rd Ste 590",Scottsdale,AZ,85251,"7014 E Camelback Rd Ste 590,Scottsdale,AZ 85251","Gift Shops, Battery Charging Equipment, Battery Supplies, Bedding, Beds & Bedroom Sets, Chairs, Collectibles, Consumer Electronics, Desk Pads & Accessories, Furniture Stores, Futons, Garden Centers, Home Furnishings, House Cleaning Equipment & Supplies, Linens, Massage Equipment & Supplies, Mirrors, Novelties, Office Furniture & Equipment, Online & Mail Order Shopping, Patio & Outdoor Furniture, Protective Covers, Toy Stores",1,"1 Review",,33.50237,-111.9293,,,,"Mon - Sat: 10:00 am - 9:00 pm Sun: 11:00 am - 6:00 pm",,,"discover, amex, all major credit cards",,,http://www.brookstone.com,"Parking: Lot, Free Wheelchair Accessible: Yes Bike Parking: Yes","Alec C.",08/15/2015,one,"I will not be going to this store again. I sat in a massage chair and immediately an employee by the name of KAJE asked me if I was going to buy it. A couple thousand dollar massage chair is something I would have to sleep on before spending. He told me to get up after sitting in the chair for less than 5 minutes. I was the only one in the store and there are multiple chairs. I was disgusted and left. He mumbled something under his breath to me as I was leaving. I will be contacting corporate about this employee. I do not recommend this store to any of my friends and family.",,,,
16898140,2349015,"2020-09-27 06:18:36",Brookstone,http://www.brookstone.com,customerservice@brookstone.com,"(214) 368-0473","8687 N Central Expy Ste 915",Dallas,TX,75225,"8687 N Central Expy Ste 915,Dallas,TX 75225","Gift Shops, Battery Charging Equipment, Battery Supplies, Bedding, Beds & Bedroom Sets, Chairs, Collectibles, Consumer Electronics, Desk Pads & Accessories, Furniture Stores, Futons, Garden Centers, Home Furnishings, House Cleaning Equipment & Supplies, Linens, Massage Equipment & Supplies, Mirrors, Novelties, Office Furniture & Equipment, Online & Mail Order Shopping, Patio & Outdoor Furniture, Protective Covers, Toy Stores",,,,32.86868,-96.77363,,,,"Mon - Thu: 10:00 am - 9:00 pm Fri - Sat: 10:00 am - 6:00 pm Sun: 12:00 pm - 6:00 pm","Phone: (214) 368-0481 Fax: (214) 368-0481",,"visa, master card, amex, debit, diners club, discover",,,http://www.brookstone.com,,,,,,,,,
16898784,2349186,"2020-09-27 06:18:36","Hasco Wholesale Inc",http://www.hascowholesale.us,customerservice@hascowholesale.com,"(909) 947-3300","2220 S Vineyard Ave",Ontario,CA,91761,"2220 S Vineyard Ave,Ontario,CA 91761","Liquidators, Clothing Stores, Consumer Electronics, Furniture Stores, General Merchandise, Office Equipment & Supplies, School Furniture & Equipment, Shoe Stores, Toy Stores",,,A+,34.03379,-117.61119,https://i3.ypcdn.com/blob/400c6c927fb3d8cbdb67f2d04b76799c88e71f39_100x100_crop.jpg?d9a04b5,,,"Mon - Sun: 10:00 am - 7:00 pm",,,"all major credit cards",,"Hasco Outlet Wholesale Warehouse","http://www.hascowholesale.us http://www.hascowholesale.com","Parking: Lot, Private Bike Parking: Yes Wheelchair Accessible: Yes",,,,,,,,
16898836,2349198,"2020-09-27 06:18:36",Brookstone,http://www.brookstone.com,,"(239) 481-7711","13499 Sea Tropic Ln","Fort Myers",FL,33908,"13499 Sea Tropic Ln,Fort Myers,FL 33908","Gift Shops, Battery Charging Equipment, Battery Supplies, Bedding, Beds & Bedroom Sets, Chairs, Collectibles, Consumer Electronics, Desk Pads & Accessories, Furniture Stores, Futons, Garden Centers, Home Furnishings, House Cleaning Equipment & Supplies, Linens, Massage Equipment & Supplies, Mirrors, Novelties, Office Furniture & Equipment, Online & Mail Order Shopping, Patio & Outdoor Furniture, Protective Covers, Toy Stores",,,,26.502518,-81.92759,,,,"Mon - Sat: 10:00 am - 9:00 pm Sun: 12:00 pm - 5:00 pm",,,,,,http://www.brookstone.com,,,,,,,,,
16898861,2349200,"2020-09-27 06:18:36",Brookstone,http://www.brookstone.com,,"(305) 871-1069","2100 NW 42nd Avenue,Central Terminal",Miami,FL,33126,"2100 NW 42nd Avenue,Central Terminal,Near Concourse E,Level 2,Before Security Checkpoint,Miami,FL 33126","Gift Shops, Battery Charging Equipment, Battery Supplies, Bedding, Beds & Bedroom Sets, Chairs, Collectibles, Consumer Electronics, Desk Pads & Accessories, Furniture Stores, Futons, Garden Centers, Home Furnishings, House Cleaning Equipment & Supplies, Linens, Massage Equipment & Supplies, Mirrors, Novelties, Office Furniture & Equipment, Online & Mail Order Shopping, Patio & Outdoor Furniture, Protective Covers, Toy Stores",,,,,,,,,,,,,,"Brookstone Company Miami International",http://www.brookstone.com,,,,,,,,,
16899050,2349259,"2020-09-27 06:18:36",Brookstone,http://www.brookstone.com,,"(732) 549-8188","Menlo Park",Edison,NJ,08837,"Menlo Park,Edison,NJ 08837","Gift Shops, Battery Charging Equipment, Battery Supplies, Bedding, Beds & Bedroom Sets, Chairs, Collectibles, Consumer Electronics, Desk Pads & Accessories, Furniture Stores, Futons, Garden Centers, Home Furnishings, House Cleaning Equipment & Supplies, Linens, Massage Equipment & Supplies, Mirrors, Novelties, Office Furniture & Equipment, Online & Mail Order Shopping, Patio & Outdoor Furniture, Protective Covers, Toy Stores",,,,40.565105,-74.33737,,,,,"Phone: (732) 549-6348",,"master card, visa",,"Brookstone Co",http://www.brookstone.com,,,,,,,,,
16899484,2349364,"2020-09-27 06:18:36",Brookstone,http://www.brookstone.com,customerservice@brookstone.com,"(410) 583-1550","2 Brookstone Ct","Lutherville Timonium",MD,21093,"2 Brookstone Ct,Lutherville Timonium,MD 21093","Gift Shops, Battery Charging Equipment, Battery Supplies, Bedding, Beds & Bedroom Sets, Chairs, Collectibles, Consumer Electronics, Desk Pads & Accessories, Furniture Stores, Futons, Garden Centers, Home Furnishings, House Cleaning Equipment & Supplies, Linens, Massage Equipment & Supplies, Mirrors, Novelties, Office Furniture & Equipment, Online & Mail Order Shopping, Patio & Outdoor Furniture, Protective Covers, Toy Stores",,,,39.43387,-76.6778,,,,"Mon - Fri: 9:00 am - 5:00 pm",,,,,"Brookstone Associates Brookstone Inc.",http://www.brookstone.com,"Specialties: Dads",,,,,,,,
16900186,2349557,"2020-09-27 06:18:36",Brookstone,http://www.brookstone.com,customerservice@brookstone.com,"(503) 460-0192","1037 Lloyd Ctr",Portland,OR,97232,"1037 Lloyd Ctr,Portland,OR 97232","Gift Shops, Battery Charging Equipment, Battery Supplies, Bedding, Beds & Bedroom Sets, Chairs, Collectibles, Consumer Electronics, Desk Pads & Accessories, Furniture Stores, Futons, Garden Centers, Home Furnishings, House Cleaning Equipment & Supplies, Linens, Massage Equipment & Supplies, Mirrors, Novelties, Office Furniture & Equipment, Online & Mail Order Shopping, Patio & Outdoor Furniture, Protective Covers, Toy Stores",,,,45.53362,-122.65531,,,,"Mon - Sat: 10:00 am - 9:00 pm Sun: 11:00 am - 6:00 pm","Fax Number: (503) 460-0193 TollFree: (800) 926-7000",,"all major credit cards, amex, discover, master card, visa",,"Brookstone Inc.",http://www.brookstone.com,"Parking: Lot Wheelchair Accessible: Yes Price Range : Average Specialties: Dads",,,,,,,,
16900229,2349563,"2020-09-27 06:18:36",Brookstone,http://www.brookstone.com,,"(603) 356-7782","Rte 16 & 302","North Conway",NH,03860,"Rte 16 & 302,North Conway,NH 03860","Gift Shops, Battery Charging Equipment, Battery Supplies, Bedding, Beds & Bedroom Sets, Chairs, Collectibles, Consumer Electronics, Desk Pads & Accessories, Furniture Stores, Futons, Garden Centers, Home Furnishings, House Cleaning Equipment & Supplies, Linens, Massage Equipment & Supplies, Mirrors, Novelties, Office Furniture & Equipment, Online & Mail Order Shopping, Patio & Outdoor Furniture, Protective Covers, Toy Stores",,,,44.05157,-71.12675,,,,,,,,,,http://www.brookstone.com,,,,,,,,,
16900748,2349716,"2020-09-27 06:18:36",Brookstone,http://www.brookstone.com,,"(205) 391-6000","1200 Greensboro Ave",Tuscaloosa,AL,35401,"1200 Greensboro Ave,Tuscaloosa,AL 35401","Gift Shops, Battery Charging Equipment, Battery Supplies, Bedding, Beds & Bedroom Sets, Chairs, Collectibles, Consumer Electronics, Desk Pads & Accessories, Furniture Stores, Futons, Garden Centers, Home Furnishings, House Cleaning Equipment & Supplies, Linens, Massage Equipment & Supplies, Mirrors, Novelties, Office Furniture & Equipment, Online & Mail Order Shopping, Patio & Outdoor Furniture, Protective Covers, Toy Stores",,,,33.20284,-87.56588,,,,,,,,,,http://www.brookstone.com,,,,,,,,,
16902353,2350174,"2020-09-27 06:18:45",Brookstone,http://www.brookstone.com,customerservice@brookstone.com,"(205) 391-6090","2300 5th Ave E",Tuscaloosa,AL,35401,"2300 5th Ave E,Tuscaloosa,AL 35401","Gift Shops, Battery Charging Equipment, Battery Supplies, Bedding, Beds & Bedroom Sets, Chairs, Collectibles, Consumer Electronics, Desk Pads & Accessories, Furniture Stores, Futons, Garden Centers, Home Furnishings, House Cleaning Equipment & Supplies, Linens, Massage Equipment & Supplies, Mirrors, Novelties, Office Furniture & Equipment, Online & Mail Order Shopping, Patio & Outdoor Furniture, Protective Covers, Toy Stores",,,,33.18996,-87.53123,,,,"Mon - Fri: 9:00 am - 6:00 pm","Primary Phone: (205) 614-3721 TollFree: (800) 557-3259",,"master card, visa",,"Brookstone Apartments Brookstone Inc. Brookstone Apts",http://www.brookstone.com,"Specialties: Dads",,,,,,,,
16902627,2350225,"2020-09-27 06:18:45",Brookstone,http://www.brookstone.com,,"(425) 453-1515","133 Bellevue Sq",Bellevue,WA,98004,"133 Bellevue Sq,Bellevue,WA 98004","Gift Shops, Battery Charging Equipment, Battery Supplies, Bedding, Beds & Bedroom Sets, Chairs, Collectibles, Consumer Electronics, Desk Pads & Accessories, Furniture Stores, Futons, Garden Centers, Home Furnishings, House Cleaning Equipment & Supplies, Linens, Massage Equipment & Supplies, Mirrors, Novelties, Office Furniture & Equipment, Online & Mail Order Shopping, Patio & Outdoor Furniture, Protective Covers, Toy Stores",,,,47.6166,-122.20486,,,,"Mon - Sun: 10:00 am - 10:00 pm",,,"amex, cash, debit, diners club, discover, master card, paypal, visa",,,http://www.brookstone.com,,,,,,,,,
16903009,2350320,"2020-09-27 06:18:45",Brookstone,http://www.brookstone.com,,"(760) 632-1013","1923 Calle Barcelona",Carlsbad,CA,92009,"1923 Calle Barcelona,Carlsbad,CA 92009","Gift Shops, Battery Charging Equipment, Battery Supplies, Bedding, Beds & Bedroom Sets, Chairs, Collectibles, Consumer Electronics, Desk Pads & Accessories, Furniture Stores, Futons, Garden Centers, Home Furnishings, House Cleaning Equipment & Supplies, Linens, Massage Equipment & Supplies, Mirrors, Novelties, Office Furniture & Equipment, Online & Mail Order Shopping, Patio & Outdoor Furniture, Protective Covers, Toy Stores",,,,33.07288,-117.26613,,,,"Mon - Fri: 10:00 am - 8:30 pm Sat: 10:00 am - 7:00 pm Sun: 12:30 pm - 6:00 pm",,,,,,http://www.brookstone.com,,,,,,,,,
16903065,2350328,"2020-09-27 06:18:45",Brookstone,http://www.brookstone.com,customerservice@brookstone.com,"(408) 247-6223","2855 Stevens Creek Blvd Ste 1143","Santa Clara",CA,95050,"2855 Stevens Creek Blvd Ste 1143,Santa Clara,CA 95050","Gift Shops, Battery Charging Equipment, Battery Supplies, Bedding, Beds & Bedroom Sets, Chairs, Collectibles, Consumer Electronics, Desk Pads & Accessories, Furniture Stores, Futons, Garden Centers, Home Furnishings, House Cleaning Equipment & Supplies, Linens, Massage Equipment & Supplies, Mirrors, Novelties, Office Furniture & Equipment, Online & Mail Order Shopping, Patio & Outdoor Furniture, Protective Covers, Toy Stores",,,,37.32551,-121.94462,,,,"Mon - Fri: 10:00 am - 9:30 pm Sat: 10:00 am - 9:00 pm Sun: 11:00 am - 7:00 pm",,,,,,http://www.brookstone.com,,,,,,,,,
16904156,2350609,"2020-09-27 06:18:45",Brookstone,http://www.brookstone.com,,"(415) 398-4400","2 Embarcadero Ctr","San Francisco",CA,94111,"2 Embarcadero Ctr,San Francisco,CA 94111","Gift Shops, Battery Charging Equipment, Battery Supplies, Bedding, Beds & Bedroom Sets, Chairs, Collectibles, Consumer Electronics, Desk Pads & Accessories, Furniture Stores, Futons, Garden Centers, Home Furnishings, House Cleaning Equipment & Supplies, Linens, Massage Equipment & Supplies, Mirrors, Novelties, Office Furniture & Equipment, Online & Mail Order Shopping, Patio & Outdoor Furniture, Protective Covers, Toy Stores",,,,37.79479,-122.39847,,,,,,,,,"Brooks Donald Donald Brooks DDS",http://www.brookstone.com,,,,,,,,,
16904299,2350643,"2020-09-27 06:18:45",Brookstone,http://www.brookstone.com,,"(412) 472-6750",Air,Pittsburgh,PA,15203,"Air,Pittsburgh,PA 15203","Gift Shops, Battery Charging Equipment, Battery Supplies, Bedding, Beds & Bedroom Sets, Chairs, Collectibles, Consumer Electronics, Desk Pads & Accessories, Furniture Stores, Futons, Garden Centers, Home Furnishings, House Cleaning Equipment & Supplies, Linens, Massage Equipment & Supplies, Mirrors, Novelties, Office Furniture & Equipment, Online & Mail Order Shopping, Patio & Outdoor Furniture, Protective Covers, Toy Stores",,,,40.493893,-80.233665,,,,"Mon - Fri: 5:00 am - 8:00 pm Sat: 5:00 am - 7:00 pm Sun: 5:00 am - 8:00 pm",,,"amex, debit, diners club, discover, master card, visa",,"Brookstone Co Pittsburgh International",http://www.brookstone.com,,,,,,,,,