business_x_category.id,business.id,business.ts,business.business_name,business.home_page,business.email_address,business.phone,business.street,business.city,business.state,business.zip_code,business.full_address,business.category,business.rating,business.number_of_reviews,business.bbb_rating_or_license,business.latitude,business.longitude,business.cover_image,business.slogan,business.general_info,business.regular_hours,business.extra_phones,business.services_products,business.payment,business.price_range,business.aka,business.other_links,business.other_information,business.review_1_name,business.review_1_date,business.review_1_rating,business.review_1_text,business.review_2_name,business.review_2_date,business.review_2_rating,business.review_2_text
17677111,2600100,"2020-09-27 06:42:22","Simmons Bank",http://simmonsbank.com,owen.mcnulty@raymondjames.com,"(479) 667-2111","100 W Commercial St",Ozark,AR,72949,"100 W Commercial St,Ozark,AR 72949","Commercial & Savings Banks, ATM Locations, Banks, Loans, Mortgages, Trust Companies",,,,35.48676,-93.82529,,,"Operational since 1903, Simmons First National Bank offers various financial services, such as checking, savings, money market, certificates of deposit and individual retirement accounts. The bank assists customers with a host of lending options, including consumer, mortgage, student, business and agricultural loans. Simmons First National Corporation, the holding company of Simmons First National Bank, owns eight community banks in Arkansas. In addition, Simmons First National Bank is a member of the Federal Deposit Insurance Corporation (FDIC) and is an Equal Housing Lender. The bank also provides trust and management services.","Drive-Thru Hours Mon - Thu 8:00 am - 5:00 pm Fri 8:00 am - 5:30 pm Sat 9:00 am - 12:00 pm","Phone: (479) 667-3010 Fax: (479) 667-3010 Toll Free: (866) 246-2400 TollFree: (866) 246-2400",,"financing available",,"Simmons First National Bank","http://simmonsbank.com https://simmonsbank.com http://simmonsfirst.com",,,,,,,,,
17677528,2600177,"2020-09-27 06:42:22","Simmons Bank",http://www.simmonsfirst.com,lhunter@simmonsfirst.com,"(870) 541-1281","3803 Camden Rd Ste 30","Pine Bluff",AR,71603,"3803 Camden Rd Ste 30,Pine Bluff,AR 71603","Commercial & Savings Banks, ATM Locations, Banks, Loans, Mortgages, Trust Companies",,,,34.19141,-92.06278,,,"Founded in 1903, Simmons First National Bank is a full-service financial institution that serves the needs of individuals and business clients in central and western Arkansas. The bank provides personal and commercial checking and savings accounts. It offers trust and fiduciary solutions through Simmons First Trust Company. Simmons First National Bank provides consumer, student, real estate, construction, residential, commercial and agricultural loans. It is a member of the Federal Deposit Insurance Corporation. The bank s wholly owned subsidiary, Simmons First Investment Group, is a member of the National Association of Securities Dealers. Simmons First National Bank is a subsidiary of Simmons First National Corporation, which operates more than five bank affiliates.","Mon - Thu: 9:00 am - 4:00 pm Fri: 9:00 am - 6:00 pm Sat - Sun: 9:00 am - 12:00 pm","Phone: (870) 541-8302 Primary Phone: (870) 541-8302 Phone: (870) 541-1166 Fax: (870) 541-1166 Toll Free: (866) 246-2400 TollFree: (866) 246-2400",,"mastercard, discover, visa, amex",,"Simmons First National Bank Simmons First National Bank Bank Locations Simmons First","http://www.simmonsfirst.com https://simmonsbank.com http://simmonsbank.com",,,,,,,,,
17678219,2600301,"2020-09-27 06:42:22","Simmons Bank",http://simmonsbank.com,,"(901) 840-1900","11300 Highway 51 S",Atoka,TN,38004,"11300 Highway 51 S,Atoka,TN 38004","Banks, ATM Locations, Commercial & Savings Banks, Financial Planning Consultants, Loans, Mortgages, Trust Companies",,,,35.44488,-89.78776,,,,"Mon - Thu: 8:30 am - 4:30 pm Fri: 8:30 am - 5:30 pm","Phone: (901) 840-1905 Phone: (901) 853-5100 Fax: (901) 840-1905 Toll Free: (866) 246-2400 TollFree: (866) 246-2400",,,,"Simmons Bank ATM","http://simmonsbank.com https://simmonsbank.com",,,,,,,,,
17680472,2600742,"2020-09-27 06:42:22","Washington Trust Bank",http://www.watrust.com,,"(208) 667-2521","218 E Lakeside Ave","Coeur D Alene",ID,83814,"218 E Lakeside Ave,Coeur D Alene,ID 83814","Commercial & Savings Banks, ATM Locations, Banks, Credit Unions, Financial Services, Financing Services, Investments, Loans, Mortgages, Real Estate Loans, Savings & Loans, Trust Companies",,,,47.6741,-116.78316,,,"Washington Trust Bank, also known as WTB, is a financial institution that offers a range of lending and depository products. It is one of the largest, privately-owned, commercial banks in the Pacific Northwest. The bank provides personal and business savings and checking accounts. Washington Trust Bank offers home equity and vehicle loans. The bank maintains offices in Washington, Idaho, Oregon and Utah. Operational since 1902, it manages a staff of more than 695 employees. Washington Trust Bank offers fraud prevention and retirement planning services. The bank also provides a line of investment products, such as mutual funds and annuities through PrimeVest Financial Services. It operates a portfolio management group.","Mon - Fri: 9:30 am - 5:00 pm","Fax: (208) 765-6532 TollFree: (800) 788-4578",,"debit, visa, master card",,"Washington Trust Bank ATM","http://www.watrust.com http://locations.watrust.com/id/coeur-d'alene/30 https://locations.watrust.com/id/coeur-d%27alene/30/?utm_source=Google&utm_medium=Maps&utm_campaign=Google+Places","Certifications: Certified Financial Planner",,,,,,,,
17681102,2600875,"2020-09-27 06:42:22","Simmons Bank",http://simmonsbank.com,,"(501) 221-7500","10300 N Rodney Parham Rd Ste L","Little Rock",AR,72227,"10300 N Rodney Parham Rd Ste L,Little Rock,AR 72227","Commercial & Savings Banks, ATM Locations, Banks, Loans, Mortgages, Trust Companies",,,,34.76787,-92.38758,,,,"Mon - Fri: 8:30 am - 6:00 pm Sat: 9:00 am - 12:00 pm","Phone: (501) 221-7502 Phone: (501) 221-6046 Fax: (501) 221-7502 Toll Free: (866) 246-2400 TollFree: (866) 246-2400",,"debit, master card, visa",,"Simmons First Bank Metropolitan National Bank","http://simmonsbank.com https://simmonsbank.com",,,,,,,,,
17681446,2600936,"2020-09-27 06:42:22","First Midwest Bank",https://www.firstmidwest.com/locations/il/dekalb/banking-732.html,,"(815) 754-2000","2290 Sycamore Rd",Dekalb,IL,60115,"2290 Sycamore Rd,Dekalb,IL 60115","Commercial & Savings Banks, ATM Locations, Banks, Credit Unions, Financial Services, Investments, Loans, Savings & Loans, Trust Companies",,,,41.95152,-88.72547,,,,"Mon - Thu: 8:45 am - 5:30 pm Fri: 8:45 am - 6:00 pm Sat: 8:45 am - 12:00 pm Sun Closed","TollFree: (800) 322-3623",,"debit, amex, discover, master card, visa",,,https://www.firstmidwest.com/locations/il/dekalb/banking-732.html,,,,,,,,,
17681625,2600971,"2020-09-27 06:42:22","Simmons Bank",http://simmonsbank.com,,"(405) 844-0110","1601 S Kelly Ave",Edmond,OK,73013,"1601 S Kelly Ave,Edmond,OK 73013","Commercial & Savings Banks, ATM Locations, Banks, Loans, Mortgages, Trust Companies",,,,35.63717,-97.49665,,,"First Commercial Bank is committed to creating value for customers, employees, shareholders and community. Since 1996, the goal of the bank has been to provide superior financial services to the citizens and businesses of central Oklahoma. The bank works with customers to understand and fulfill their financial needs through a comprehensive range of products, services and delivery methods. The bank contributes financial and human support to various groups and organizations that assist the communities of its customer base. Developing and rewarding employees to effectively manage customer relationships is yet another way the bank ensures success. Furthermore, First Commercial Bank has safeguards to prevent unauthorized access to customer account information online. The bank uses 128-bit encryption technology, which has been endorsed by computer specialists as sufficient to prevent security breaches. The bank has a location in Edmund, Okla.","Mon - Fri: 9:00 am - 5:00 pm","Primary Phone: (405) 427-4000 Phone: (405) 427-4000 Fax: (405) 844-9110 Toll Free: (866) 246-2400 TollFree: (866) 246-2400 TollFree: (800) 863-4500",,debit,,,"http://simmonsbank.com https://simmonsbank.com",,,,,,,,,
17681959,2601032,"2020-09-27 06:42:28","Simmons Bank",http://simmonsbank.com,,"(731) 479-3000","605 Broadway St","South Fulton",TN,38257,"605 Broadway St,South Fulton,TN 38257","Commercial & Savings Banks, ATM Locations, Banks, Loans, Mortgages, Trust Companies",,,,36.4939,-88.87529,,,,"Mon - Thu: 8:00 am - 4:30 pm Fri: 8:00 am - 5:00 pm","Phone: (731) 479-3001 Fax: (731) 479-3001 TollFree: (866) 246-2400 Toll Free: (866) 246-2400",,,,,"http://simmonsbank.com https://simmonsbank.com",,,,,,,,,
17682078,2601056,"2020-09-27 06:42:28","City National Bank",http://www.bankatcity.com,kelly.holt@cityholding.com,"(304) 255-7000","1 Park Ave",Beckley,WV,25801,"1 Park Ave,Beckley,WV 25801","Commercial & Savings Banks, ATM Locations, Banks, Loans, Mortgages, Real Estate Loans, Trust Companies",,,,37.77173,-81.18737,,,"City National Bank offers a wide range of financial, investment and trust services for consumers and businesses. The bank provides checking, savings and money market accounts, certificates of deposit, debit cards, overdraft protection and retirement plans. Its lending capabilities include home equity, mortgage, personal, automotive, construction and installment loans, as well as lines of credit. City National Bank assists businesses with wire transfers, cash management, commercial financing and merchant services. The bank s online module enables customers to access accounts, pay bills and customize financial activities. It is a member of the Federal Deposit Insurance Corporation. City National Bank is a subsidiary of City Holding Company. The bank maintains a branch office in Beckley, W.Va.","Mon - Fri: 9:00 am - 4:00 pm","Phone: (304) 255-7230 Phone: (304) 255-7285 Phone: (304) 255-7200 Phone: (304) 255-7239 Phone: (304) 255-7290 Phone: (304) 255-7329 Fax: (304) 255-7230 Fax: (304) 255-7329 TollFree: (800) 776-0541",,"master card, visa",,,"http://www.bankatcity.com http://www.citynational.com https://www.cityholding.com http://cityholding.com http://www.snl.com/IRWeblinkx/branchdetails.aspx?iid=100199&bankfacility=1731&Zip=25801&Street=1%20Park%20Ave&City=&State=",,,,,,,,,
17683585,2601343,"2020-09-27 06:42:29","Essex Savings Bank",http://essexsavings.com,essexsavings@essexsavings.com,"(860) 434-1646","101 Halls Rd","Old Lyme",CT,06371,"101 Halls Rd,Old Lyme,CT 06371","Banks, ATM Locations, Commercial & Savings Banks, Financial Services, Mortgages, Trust Companies",,,,41.32273,-72.33988,,,,"Mon - Thu: 8:30 am - 4:00 pm Fri: 8:30 am - 6:00 pm Sat: 8:30 am - 12:00 pm","Phone: (860) 767-4414 Phone: (860) 434-1649 Fax: (860) 434-1649",,"discover, master card, visa, amex",,"Essex Savings Bank Atm",http://essexsavings.com,,,,,,,,,
17686099,2601798,"2020-09-27 06:42:29","Bryn Mawr Trust",https://www.bmtc.com,,"(215) 735-6200","1230 Walnut St",Philadelphia,PA,19107,"1230 Walnut St,Philadelphia,PA 19107","Financial Services, ATM Locations, Banks, Commercial & Savings Banks, Escrow Service, Financial Planners, Loans, Mortgages, Trust Companies",,,,39.949,-75.1619,https://i2.ypcdn.com/blob/f55e4af87b04552b43124c1ce4e64c19f2e1fd43_100x100_crop.jpg?f9d23e1,,"Bryn Mawr Bank Corporation (NASDAQ: BMTC), including its principal subsidiary, The Bryn Mawr Trust Company (founded in 1889. headquartered in Bryn Mawr, Pa.), is a locally managed financial services company providing retail and commercial banking, trust administration and wealth management, and insurance solutions. BMT operates banking locations in Montgomery, Chester, Delaware, Philadelphia and Dauphin Counties in Pennsylvania, New Castle County in Delaware, and Camden County in New Jersey. For more information, visit bmtc.com.","Mon - Fri: 8:30 am - 5:30 pm Sat: 9:00 am - 12:00 pm Sun Closed","Fax Number: (215) 790-1111",,"atm, check, financing available, cash",,,"Primary Website",,,,,,,,,
17686317,2601847,"2020-09-27 06:42:29","Simmons Bank",http://simmonsbank.com,,"(901) 853-5100","3607 S Houston Levee Rd",Collierville,TN,38017,"3607 S Houston Levee Rd,Collierville,TN 38017","Banks, ATM Locations, Commercial & Savings Banks, Financial Planning Consultants, Loans, Mortgages, Trust Companies",,,,35.05054,-89.73273,,,,"Mon - Fri: 8:30 am - 5:00 pm","Fax: (901) 853-5133 TollFree: (866) 246-2400 Toll Free: (866) 246-2400",,debit,,,"http://simmonsbank.com https://simmonsbank.com http://simmonsfirst.com",,,,,,,,,
17687519,2602097,"2020-09-27 06:42:32","Simmons Bank",https://www.simmonsbank.com,,"(405) 372-2234","608 S Main St",Stillwater,OK,74074,"608 S Main St,Stillwater,OK 74074","Banks, ATM Locations, Commercial & Savings Banks, Financial Planning Consultants, Financial Services, Investment Securities, Investments, Loans, Mortgages, Savings & Loans, Trust Companies",,,,36.11519,-97.05904,,,"Stillwater National Bank and Trust Company is a subsidiary of Southwest Bancorp. Stillwater National Bank was founded in 1894. The bank and trust maintains its headquarters in Stillwater, Okla. It also maintains additional offices in Oklahoma, Kansas and Texas. Stillwater National Bank and Trust Company offers commercial and consumer lending, deposit, investment services, specialized cash management, consulting and other financial services. The bank and trust company also offers specialized consulting services that are deliver through affiliates that are subsidiaries of Southwest Bancorp. Business Consulting Group provides strategic planning, process analysis and assessment. Healthcare Strategic Support is a health care consulting company that specializing in helping health care organization streamline complex business processes.","Mon - Fri: 9:00 am - 5:00 pm","Phone: (918) 523-3600 Phone: (405) 742-1580 Fax: (405) 742-1820 Toll Free: (866) 246-2400 TollFree: (866) 246-2400 TollFree: (800) 727-2230",,debit,,,"https://www.simmonsbank.com http://simmonsbank.com",,,,,,,,,
17688953,2602399,"2020-09-27 06:42:32","Simmons Bank",https://www.simmonsbank.com,,"(405) 372-2234","1908 S Sangre Rd",Stillwater,OK,74074,"1908 S Sangre Rd,Stillwater,OK 74074","Commercial & Savings Banks, ATM Locations, Banks, Loans, Mortgages, Trust Companies",,,,36.1008,-97.10534,,,,"Mon - Fri: 9:00 am - 5:00 pm","Toll Free: (866) 246-2400 TollFree: (866) 246-2400 TollFree: (888) 762-4762",,debit,,,"https://www.simmonsbank.com http://simmonsbank.com",,,,,,,,,
17689001,2602413,"2020-09-27 06:42:32","Simmons Bank",http://simmonsbank.com,owen.mcnulty@raymondjames.com,"(870) 541-1360","1809 E Harding Ave","Pine Bluff",AR,71601,"1809 E Harding Ave,Pine Bluff,AR 71601","Commercial & Savings Banks, ATM Locations, Banks, Loans, Mortgages, Trust Companies",,,,34.21339,-91.9822,,,"Simmons First National Bank is a financial institution that provides a range of lending and depository products. The bank serves residential and business customers throughout central and western Arkansas. It offers checking, money market, individual retirement and savings accounts, as well as certificates of deposit. Simmons First National Bank also provides auto, student, agricultural, home equity and real estate loans. The bank offers gift, debit and credit cards. In addition, it provides merchant card, cash management, and Internet and telephone banking services. Simmons First National Bank s subsidiaries include Simmons First Trust Company and Simmons First Investment Group. The bank is a part of Simmons First National Corporation, which is a publicly traded financial holding company.","Mon - Fri: 9:00 am - 6:00 pm Sat: 9:00 am - 12:00 pm","Phone: (870) 541-1067 Fax: (870) 541-1067 TollFree: (866) 246-2400 Toll Free: (866) 246-2400",,"amex, mastercard, visa, discover",,"Simmons First National Bank-- Bank Locations-- Broadmoor Branch Simmons First National Bank","http://simmonsbank.com https://simmonsbank.com http://simmonsfirst.com",,,,,,,,,
17689270,2602460,"2020-09-27 06:42:32","Simmons Bank",http://simmonsbank.com,F.Mike@simmonsfirst.com,"(479) 785-4331","4200 Rogers Ave","Fort Smith",AR,72903,"4200 Rogers Ave,Fort Smith,AR 72903","Commercial & Savings Banks, ATM Locations, Banks, Loans, Mortgages, Savings & Loans, Trust Companies",,,,35.36903,-94.38571,,,,"Mon - Fri: 8:00 am - 5:00 pm","Phone: (479) 785-1998 Phone: (479) 782-1715 Toll Free: (866) 246-2400 TollFree: (866) 246-2400",,"debit, amex, discover, master card, visa",,"Simmons First National Bank Simmons First Bank","http://simmonsbank.com https://simmonsbank.com http://simmonsfirst.com",,,,,,,,,
17689544,2602517,"2020-09-27 06:42:32","Simmons Bank",https://www.simmonsbank.com,,"(615) 285-2265","117 Raymond Hirsch Pkwy","White House",TN,37188,"117 Raymond Hirsch Pkwy,White House,TN 37188","Banks, ATM Locations, Commercial & Savings Banks, Financial Planning Consultants, Loans, Mortgages, Trust Companies",,,,36.46696,-86.66508,,,,"Mon - Thu: 8:30 am - 4:00 pm Fri: 8:30 am - 5:30 pm","Toll Free: (866) 246-2400 TollFree: (866) 246-2400",,debit,,"Simmons Bank ATM Simmons First Bank","https://www.simmonsbank.com http://simmonsbank.com",,,,,,,,,
17691052,2602828,"2020-09-27 06:42:33","Simmons Bank",http://simmonsbank.com,,"(479) 549-4100","2000 W University St","Siloam Springs",AR,72761,"2000 W University St,Siloam Springs,AR 72761","Commercial & Savings Banks, ATM Locations, Banks, Loans, Mortgages, Trust Companies",,,,36.18721,-94.55854,,,,"Mon - Fri: 8:00 am - 5:00 pm","Toll Free: (866) 246-2400 TollFree: (866) 246-2400",,debit,,,"http://simmonsbank.com https://simmonsbank.com",,,,,,,,,
17691753,2602964,"2020-09-27 06:42:33","Heartland Bank and Trust Company",http://hbtbank.com,hbt@hbtbank.com,"(309) 527-4400","99 N Elm St","El Paso",IL,61738,"99 N Elm St,El Paso,IL 61738","Commercial & Savings Banks, ATM Locations, Banks, Mortgages, Trust Companies",,,,40.73906,-89.01747,https://i2.ypcdn.com/blob/dd90439447dff65df45bf92ab4995dd8bfa764e4_100x100_crop.jpg?f9d23e1,,"Heartland Bank and Trust Company is widely recognized as one of the strongest and most progressive banks in Illinois. We're a locally owned community bank whose roots are right here in the heartland. Getting to know our customers helps us become a better bank, but that alone isn't enough. We are capable of handling diverse customer needs. The phrase ""small enough to know you, big enough to serve you"" is what Heartland Bank is all about.","Mon Closed Tue - Fri: 8:30 am - 4:00 pm Sat: 8:30 am - 12:00 pm Sun Closed","Fax: (309) 527-4110 TollFree: (888) 897-2276",,,,,http://hbtbank.com,,,,,,,,,
17692214,2603054,"2020-09-27 06:42:37","Simmons Bank",http://simmonsbank.com,,"(731) 364-3235","8798 Highway 22",Dresden,TN,38225,"8798 Highway 22,Dresden,TN 38225","Banks, ATM Locations, Commercial & Savings Banks, Financial Planning Consultants, Loans, Mortgages, Trust Companies",,,,36.27871,-88.71324,,,,"Mon - Thu: 8:30 am - 4:00 pm Fri: 8:30 am - 5:00 pm","Phone: (901) 853-5100 Phone: (731) 364-3225 Fax: (731) 364-3225 TollFree: (866) 246-2400 Toll Free: (866) 246-2400",,,,"Simmons Bank ATM","http://simmonsbank.com https://simmonsbank.com",,,,,,,,,
17693266,2603267,"2020-09-27 06:42:37","Opus Bank",https://www.opusbank.com/location/51,,"(425) 369-8322","2902 228th Ave SE",Sammamish,WA,98075,"2902 228th Ave SE,Sammamish,WA 98075","Commercial & Savings Banks, ATM Locations, Banks, Loans, Mortgages, Trust Companies",,,,47.58409,-122.03541,,,,"Mon - Fri: 10:00 am - 6:00 pm Sat: 9:00 am - 1:00 pm",,,debit,,,https://www.opusbank.com/location/51,,,,,,,,,
17693494,2603307,"2020-09-27 06:42:37","Washington Trust Bank",http://watrust.com,washingtontrustbank@watrust.com,"(208) 442-0099","2200 N Cassia St",Nampa,ID,83651,"2200 N Cassia St,Nampa,ID 83651","Commercial & Savings Banks, ATM Locations, Banks, Financing Services, Loans, Mortgages, Real Estate Loans, Trust Companies",,,,43.60449,-116.60455,,,,"Mon - Thu: 9:00 am - 5:00 pm Fri: 9:00 am - 6:00 pm Sat: 10:00 am - 2:00 pm","Phone: (208) 442-1397 Fax: (208) 442-1397 TollFree: (800) 788-4578",,"debit, master card, visa",,"Washington Trust Bank ATM","http://watrust.com https://locations.watrust.com/id/nampa/45/?utm_source=Google&utm_medium=Maps&utm_campaign=Google+Places",,,,,,,,,
17696158,2603838,"2020-09-27 06:42:37","Simmons Bank",http://simmonsbank.com,,"(501) 320-0700","2800 Kavanaugh Blvd","Little Rock",AR,72205,"2800 Kavanaugh Blvd,Little Rock,AR 72205","Commercial & Savings Banks, ATM Locations, Banks, Loans, Mortgages, Trust Companies",,,,34.75805,-92.32449,,,,"Mon - Fri: 8:30 am - 6:00 pm","Phone: (501) 614-7808 Toll Free: (866) 246-2400 TollFree: (866) 246-2400",,debit,,"Simmons First Bank","http://simmonsbank.com https://simmonsbank.com",,,,,,,,,
17696228,2603850,"2020-09-27 06:42:37","City National Bank",http://www.bankatcity.com,,"(304) 645-2500","809 Jefferson St S",Lewisburg,WV,24901,"809 Jefferson St S,Lewisburg,WV 24901","Commercial & Savings Banks, ATM Locations, Banks, Financial Services, Loans, Mortgages, Trust Companies",,,,37.79261,-80.44601,,,"City National Bank is a full-service community bank that provides an array of financial services throughout West Virginia, Kentucky, Virginia and Ohio. One of the most highly-rated banks in the country, City serves both consumer and business customers at more than 85 branches.","Mon - Thu: 9:00 am - 4:00 pm Fri: 9:00 am - 5:00 pm","Phone: (304) 645-4765 Fax: (304) 645-4765",,"debit, master card, visa",,,"http://www.bankatcity.com http://www.citynational.com",,,,,,,,,
17698529,2604340,"2020-09-27 06:42:46","Johnson Financial Group",https://www.johnsonfinancialgroup.com,careers@johnsonbank.com,"(414) 287-6450","333 E Wisconsin Ave",Milwaukee,WI,53202,"333 E Wisconsin Ave,Milwaukee,WI 53202","Banks, ATM Locations, Commercial & Savings Banks, Financial Planning Consultants, Financial Services, Loans, Mortgages, Savings & Loan Associations, Savings & Loans, Trust Companies",,,,43.03864,-87.90661,,"For over 35 years Johnson Bank has measured our success by our ability to help our clients reach their financial goals","Johnson Financial Group is the largest privately held, family-owned financial services company in Wisconsin, offering banking, wealth and insurance solutions through Johnson Bank, Johnson Wealth, and Johnson Insurance. The $5 billion financial services company offers traditional banking services along with insurance and a full array of trust, estate and fiduciary services. Principal owners of Johnson Financial Group are members of the Samuel C. Johnson family. Helen Johnson-Leipold is Chairman of Johnson Financial Group.","Mon - Fri: 8:30 am - 5:00 pm Sat - Sun Closed",,,debit,,,https://www.johnsonfinancialgroup.com/,,,,,,,,,
17699028,2604441,"2020-09-27 06:42:46","Simmons Bank",,owen.mcnulty@raymondjames.com,"(913) 894-5400","15670 W 135th St",Olathe,KS,66062,"15670 W 135th St,Olathe,KS 66062","Banks, ATM Locations, Commercial & Savings Banks, Financial Planning Consultants, Loans, Mortgages, Trust Companies",,,,38.88431,-94.76718,,,,"Mon - Fri: 8:00 am - 5:00 pm","Phone: (913) 768-6164 Phone: (913) 768-0112 TollFree: (866) 246-2400 Toll Free: (866) 246-2400 TollFree: (800) 323-8958",,debit,,"Simmons First National Bank",,,,,,,,,,