business_x_category.id,business.id,business.ts,business.business_name,business.home_page,business.email_address,business.phone,business.street,business.city,business.state,business.zip_code,business.full_address,business.category,business.rating,business.number_of_reviews,business.bbb_rating_or_license,business.latitude,business.longitude,business.cover_image,business.slogan,business.general_info,business.regular_hours,business.extra_phones,business.services_products,business.payment,business.price_range,business.aka,business.other_links,business.other_information,business.review_1_name,business.review_1_date,business.review_1_rating,business.review_1_text,business.review_2_name,business.review_2_date,business.review_2_rating,business.review_2_text
17726901,2609988,"2020-09-27 06:43:10","Simmons Bank",http://simmonsbank.com,,"(417) 272-1288","21159 Main St","Reeds Spring",MO,65737,"21159 Main St,Reeds Spring,MO 65737","Commercial & Savings Banks, ATM Locations, Banks, Loans, Mortgages, Trust Companies",,,,36.7352,-93.38361,,,,"Mon - Thu: 8:30 am - 4:00 pm","Fax: (417) 272-1290 Toll Free: (866) 246-2400 TollFree: (866) 246-2400",,debit,,,"http://simmonsbank.com https://simmonsbank.com",,,,,,,,,
17728069,2610211,"2020-09-27 06:43:13","Happy State Bank ATM",https://www.happybank.com,locationsreports@happybank.com,"(800) 447-2265","312 E 2nd St",Dalhart,TX,79022,"312 E 2nd St,Dalhart,TX 79022","Commercial & Savings Banks, ATM Locations, Banks, Financing Services, Loans, Mortgages, Real Estate Loans, Trust Companies",,,,36.06421,-102.5199,,,,"Mon - Sun: Open 24 Hours","Phone: (806) 935-5681 Phone: (806) 249-2265 Primary Phone: (800) 447-2265",,"debit, insurance, financing available, visa, mastercard",,,https://www.happybank.com,,,,,,,,,
17730084,2610610,"2020-09-27 06:43:13","First National Bank of Huntsville",http://www.fnbhuntsvilletx.com,sah@fnbhuntsvilletx.com,"(936) 295-5701","1300 11th St Ste 200",Huntsville,TX,77340,"1300 11th St Ste 200,Huntsville,TX 77340","Banks, ATM Locations, Commercial & Savings Banks, Financing Services, Holding Companies, Investments, Loans, Mortgages, Real Estate Loans, Stock & Bond Brokers, Trust Companies",,,A+,30.72432,-95.55345,,,,"Mon - Thu: 9:00 am - 2:00 pm","Phone: (936) 294-8038 Phone: (936) 294-8082 Phone: (936) 294-8037 Fax: (936) 291-8366",,"all major credit cards",,"First National Bank Discount First National Bank Discount Brokerage First National Bancshares First National Bank of Huntsville ATM First National Bank-Huntsville","http://www.fnbhuntsvilletx.com https://www.fnbhuntsvilletx.com","Parking: Lot",,,,,,,,
17730722,2610724,"2020-09-27 06:43:13","Simmons Bank",https://www.simmonsbank.com,,"(405) 222-1272","500 W Grand Ave",Chickasha,OK,73018,"500 W Grand Ave,Chickasha,OK 73018","Commercial & Savings Banks, ATM Locations, Banks, Loans, Mortgages, Trust Companies",,,,35.02968,-97.93835,,,,"Mon - Fri: 9:00 am - 5:00 pm","Phone: (405) 427-4848 Fax: (405) 427-4848 TollFree: (866) 246-2400 Toll Free: (866) 246-2400",,debit,,,"https://www.simmonsbank.com http://simmonsbank.com",,,,,,,,,
17732012,2610990,"2020-09-27 06:43:13","Simmons Bank",http://simmonsbank.com,bankanywhere@simmonsbank.com,"(870) 933-3111","224 E Matthews Ave",Jonesboro,AR,72401,"224 E Matthews Ave,Jonesboro,AR 72401","Banks, ATM Locations, Commercial & Savings Banks, Financial Planning Consultants, Loans, Mortgages, Trust Companies",,,,35.83595,-90.70375,,,"Simmons First Bank of Jonesboro is a subsidiary of Simmons First National Bank. As a state chartered bank, Simmons First Bank of Jonesboro provides financial services to businesses and individuals in northeast Arkansas. The bank offers student, consumer, construction, single-family residential, commercial, agriculture and institutional loans. It also provides checking, savings and time deposits, credit cards, securities, and trust and investment management services. Established in 1903, Simmons First National Bank is a subsidiary of Simmons First National Corporation and has an asset base of more than $1 billion. Its wholly owned subsidiary, Simmons First Trust Company, performs trust and fiduciary business operations. Another wholly owned subsidiary of Simmons First National Bank, Simmons First Investment Group, is a broker-dealer registered with the United States Securities and Exchange Commission and a member of the National Association of Securities Dealers.",,"Phone: (870) 935-9024 Phone: (901) 853-5100 Fax: (870) 935-9024 TollFree: (866) 246-2400 Toll Free: (866) 246-2400 Primary Phone: (866) 246-2400",,"all major credit cards, amex, discover, master card, visa",,"Simmons First Bank-Jonesboro",http://simmonsbank.com,,,,,,,,,
17732232,2611039,"2020-09-27 06:43:17","Old National Bank",https://www.oldnational.com/bank-branch/1-n-indiana-st-greencastle-indiana,grantsandsponsorships@oldnational.com,"(765) 658-1200","1 N Indiana St",Greencastle,IN,46135,"1 N Indiana St,Greencastle,IN 46135","Commercial & Savings Banks, ATM Locations, Banks, Financial Services, Financing Services, Investments, Loans, Mortgages, Mutual Funds, Real Estate Loans, Savings & Loan Associations, Trust Companies",,,,39.64408,-86.86427,https://i2.ypcdn.com/blob/5af0a1c6a5a6f3b2a8ca8b2aa45f11941704f210_100x100_crop.jpg?f9d23e1,,"Old National Bank is your bank for Greencastle. Our focus is on helping you achieve your financial goals and working to strengthen the communities we serve in Indiana, Michigan, Wisconsin, Kentucky and Minnesota. At Old National, you will find financial services for all of life, including personal and business banking, mortgages, investments, wealth management, online & mobile banking and much more. We promise to listen, find the best solutions for you and work to exceed your expectations, because we want to be your bank for life.",Hours,,,"financing available",,,https://www.oldnational.com/bank-branch/1-n-indiana-st-greencastle-indiana,,,,,,,,,
17733071,2611203,"2020-09-27 06:43:17","Simmons Bank",http://simmonsbank.com,,"(866) 246-2400","710 S Foothills Plaza Dr",Maryville,TN,37801,"710 S Foothills Plaza Dr,Maryville,TN 37801","Banks, ATM Locations, Commercial & Savings Banks, Financial Planning Consultants, Loans, Mortgages, Trust Companies",5,"1 Review",,35.73795,-83.99237,,,,"Mon - Thu: 9:00 am - 5:00 pm Fri: 9:00 am - 6:00 pm",,,debit,,"Simmons First Bank","http://simmonsbank.com https://simmonsbank.com",,"Susan T.",08/28/2017,five,"Love this bank and the employees! VERY convenient...just a walk across the street from our business (Blount County Eye Center). GREAT bank to do business with. Highly recommend!!",,,,
17738305,2612313,"2020-09-27 06:43:27","Simmons Bank",http://simmonsbank.com,,"(423) 337-3571","805 New Highway 68",Sweetwater,TN,37874,"805 New Highway 68,Sweetwater,TN 37874","Banks, ATM Locations, Commercial & Savings Banks, Financial Planning Consultants, Loans, Mortgages, Trust Companies",,,,35.5914,-84.47711,,,,"Mon - Fri: 8:30 am - 5:00 pm","Toll Free: (866) 246-2400 TollFree: (866) 246-2400",,,,,"http://simmonsbank.com https://simmonsbank.com",,,,,,,,,
17738425,2612331,"2020-09-27 06:43:27","Community Trust Bank",,taylorca@ctbi.com,"(859) 389-5350","100 E Vine St Ste 501",Lexington,KY,40507,"100 E Vine St Ste 501,Lexington,KY 40507","Investment Management, ATM Locations, Banks, Commercial & Savings Banks, Financial Planners, Financial Planning Consultants, Financial Services, Investment Advisory Service, Investments, Trust Companies",,,A+,38.04533,-84.49803,https://i2.ypcdn.com/blob/5db6ea2eb0c5a394550568a486ea0cb041a49500_100x100_crop.jpg?f9d23e1,,"Community Trust and Investment Company is a brokerage and insurance services firm that offers a range of financial services. Its investment management services include the fundamental analysis of security selection, asset allocation, performance measurement, and taxable and tax-advantaged portfolio administration. The company also provides assistance with plan design and individual retirement document submissions, as well as generating administrative forms, disclosures and summary plan descriptions. Community Trust and Investment Company additionally offers enrollment packages, including deferral and investment elections and beneficiary designations, as well as coordinates transfers of existing plans with previous service providers. It is a part of Community Trust Bancorp.","Mon - Fri: 9:00 am - 4:00 pm Sat - Sun Closed","Primary Phone: (859) 389-5350 Phone: (859) 389-5300",,,,,,"Parking: Lot Wheelchair Accessible: Yes",,,,,,,,
17740699,2612824,"2020-09-27 06:43:28","Simmons Bank",https://www.1stsouth.com,ibcustomerserv@1stsouth.com,"(731) 658-5219","809 W Market St",Bolivar,TN,38008,"809 W Market St,Bolivar,TN 38008","Banks, ATM Locations, Commercial & Savings Banks, Financial Planning Consultants, Loans, Mortgages, Real Estate Loans, Trust Companies",,,,35.25595,-88.99819,,,,"Mon - Thu: 8:30 am - 4:30 pm Fri: 8:30 am - 5:00 pm","Phone: (731) 658-5230 Phone: (901) 853-5100 TollFree: (866) 246-2400 Toll Free: (866) 246-2400",,"debit, all major credit cards",,"First South Bank Simmons Bank ATM","https://www.1stsouth.com https://simmonsbank.com http://simmonsbank.com http://1stsouth.com http://falconhomesllc.com",,,,,,,,,
17740940,2612863,"2020-09-27 06:43:28","FineMark National Bank & Trust",http://finemarkbank.com,,"(480) 607-4860","7600 E Doubletree Ranch Rd Ste 100",Scottsdale,AZ,85258,"7600 E Doubletree Ranch Rd Ste 100,Scottsdale,AZ 85258","Commercial & Savings Banks, ATM Locations, Banks, Financial Planning Consultants, Financing Consultants, Financing Services, Internet Banking, Investments, Loans, Real Estate Loans, Retirement Planning Services, Safe Deposit Boxes, Trust Companies",,,,33.56525,-111.91771,https://i2.ypcdn.com/blob/336675815ad07f643cf24158f249d1ee99ecf1cd_100x100_crop.jpg?f9d23e1,,,"Mon - Fri: 8:30 am - 4:30 pm Sat - Sun Closed","Main Line: (480) 607-4860 TollFree: (844) 607-4860",,"amex, cash, debit, discover, master card, visa",,,http://finemarkbank.com,"Parking: Garage, On Site, Free",,,,,,,,
17741505,2612980,"2020-09-27 06:43:28","Simmons Bank",http://simmonsbank.com,,"(870) 269-2400","205 Sylamore Ave","Mountain View",AR,72560,"205 Sylamore Ave,Mountain View,AR 72560","Commercial & Savings Banks, ATM Locations, Banks, Loans, Mortgages, Trust Companies",,,,35.86603,-92.10678,,,,"Mon - Fri: 8:30 am - 6:00 pm Sat: 9:00 am - 12:00 pm","Phone: (870) 269-2413 TollFree: (877) 245-1234 TollFree: (866) 246-2400 Toll Free: (866) 246-2400",,"all major credit cards, debit, visa",,"Simmons First National Bank","http://simmonsbank.com http://www.simmonsfirst.com https://simmonsbank.com",,,,,,,,,
17741570,2612985,"2020-09-27 06:43:28","Greenfield Savings Bank",http://www.greenfieldsavings.com,customerservice@greenfieldsavings.com,"(413) 774-3191","400 Main St",Greenfield,MA,01301,"400 Main St,Greenfield,MA 01301","Banks, ATM Locations, Commercial & Savings Banks, Financial Planning Consultants, Financial Services, Loans, Mortgages, Real Estate Loans, Savings & Loans, Trust Companies",1,"1 Review",,42.58827,-72.59955,,,"Greenfield Savings Bank offers various personal and business banking services for individuals, families, corporations, and small and large businesses. The bank offers multiple banking options related to checking and savings accounts. home, personal and business loans. and insurance and retirement plans. It provides yearly renewable term, guaranteed premium, whole life, home mortgage protection and equity line coverage insurance, as well as education and business planning and management services. Greenfield Savings Bank operates Internet banking services that include instant account access, bill payment, e-statements, e-money transfers and e-notifications. The bank also provides various special promotions and offers. It is headquartered in Greenfield, Mass.","Mon - Fri: 9:00 am - 5:00 pm","Phone: (413) 584-4441 Phone: (413) 773-0859 Phone: (413) 772-0460 Primary Phone: (413) 772-0460 Primary Phone: (413) 774-1062 Phone: (413) 549-3660 Fax: (413) 774-6755 TollFree: (888) 324-3191",,debit,,"Greenfield Savings Bank Atm","http://www.greenfieldsavings.com https://www.greenfieldsavings.com",,molly.rupp.3,10/04/2012,one,"The trust department at Greenfield Savings Bank took over as trusties 10 years ago. They took there money but did not watch my assetts. After 10 years asked me how may apartments I owned from real estate owned in one trust and the rents for them. Did not know how much I was being charged for rent out of the profit from one trust. Lied and slandard my name to recover from there mistakes like lieing to the FDIC about me being one of two benificiarys to my trust, a trust of which I a 100% sole benifciary of. They have been abusive and bully me. send me to places with bad checks. They have once broken the ma. quite enjoyment law about chasing me from my home illegally. Telling me I much not return home for a week due to repair work that needed to be done regardless of haveing animals at home. then when that did not work they wanted to force me to get my apartment inspected early so they said the apartment was theres and they would TAKE my key or get it from the manager and let the health department in. They alow a manager to work in my building that has threatened to nail one of my doors shut to see how I would like living in a one bedroom. The manager has done creative book keeping and I am now seeking legal assistance to get justice and protection from all these people. Did I mention the bad checks??? or the finantial victomization? I'm so mad This is all my friends and strangers hear about. This is only a small peice of Greenfield Savings bank in my life. The have been so many injustices it has ruined my life. I'm hoping the judge will see it that way too. The are Finantial Emotional Terrorists.",,,,
17742098,2613096,"2020-09-27 06:43:31","Simmons Bank",http://simmonsbank.com,,"(316) 315-1600","10111 W 21st St N",Wichita,KS,67205,"10111 W 21st St N,Wichita,KS 67205","Commercial & Savings Banks, ATM Locations, Banks, Loans, Mortgages, Trust Companies",,,,37.72219,-97.4598,,,,"Mon - Fri: 9:00 am - 5:00 pm","Toll Free: (866) 246-2400 TollFree: (888) 762-4762 TollFree: (866) 246-2400",,"debit, android pay",,,"http://simmonsbank.com https://simmonsbank.com",,,,,,,,,
17742255,2613121,"2020-09-27 06:43:31","Simmons Bank",http://simmonsbank.com,,"(316) 315-1600","8415 E 21st St N Ste 150",Wichita,KS,67206,"8415 E 21st St N Ste 150,Wichita,KS 67206","Commercial & Savings Banks, ATM Locations, Banks, Loans, Mortgages, Trust Companies",,,,37.72289,-97.23961,,,"SNB Bank of Kansas is a subsidiary of Southwest Bancorp. The bank offers financial services designed for healthcare professionals, attorneys, executives and real estate entrepreneurs. The bank also offers a wide range of commercial and deposit services, such as checking accounts, savings accounts, asset protection programs, individual retirement accounts, brokerage accounts, managed asset services, mortgage loans, student loans, certificates of deposit, money markets, annuities, trust and estate planning services, overdraft allowance and online banking. SNB Bank of Kansas is located in Wichita, Kan","Mon - Fri: 9:00 am - 5:00 pm","Toll Free: (866) 246-2400 TollFree: (866) 246-2400",,,,,"http://simmonsbank.com https://simmonsbank.com",,,,,,,,,
17748750,2614470,"2020-09-27 06:43:36","Simmons Bank",http://simmonsbank.com,,"(866) 246-2400","435 N Garland Ave",Fayetteville,AR,72701,"435 N Garland Ave,Fayetteville,AR 72701","Commercial & Savings Banks, ATM Locations, Banks, Loans, Mortgages, Trust Companies",,,,36.06872,-94.17594,,,,,,,,,,"http://simmonsbank.com https://simmonsbank.com",,,,,,,,,
17748846,2614485,"2020-09-27 06:43:36","Simmons Bank",http://simmonsbank.com,,"(620) 728-3000","100 E 30th Ave",Hutchinson,KS,67502,"100 E 30th Ave,Hutchinson,KS 67502","Commercial & Savings Banks, ATM Locations, Banks, Investments, Loans, Mortgages, Trust Companies",,,,38.08704,-97.92966,,,,"Mon - Fri: 9:00 am - 4:00 pm","Fax: (620) 728-3032 TollFree: (866) 246-2400 Toll Free: (866) 246-2400",,debit,,,"http://simmonsbank.com https://simmonsbank.com",,,,,,,,,
17749389,2614599,"2020-09-27 06:43:36","Simmons Bank",http://simmonsbank.com,,"(501) 932-5000","1055 Steel Ave Ste 110",Conway,AR,72032,"1055 Steel Ave Ste 110,Conway,AR 72032","Commercial & Savings Banks, ATM Locations, Banks, Loans, Mortgages, Trust Companies",,,,35.10264,-92.43761,,,,"Mon - Fri: 8:00 am - 6:00 pm Sat: 8:00 am - 12:00 pm","Phone: (501) 504-2214 Toll Free: (866) 246-2400 TollFree: (866) 246-2400",,debit,,"Simmons First National Bank","http://simmonsbank.com https://simmonsbank.com",,,,,,,,,
17749921,2614703,"2020-09-27 06:43:36","Simmons Bank",http://simmonsbank.com,lhunter@simmonsfirst.com,"(870) 541-1382","2711 S Olive St","Pine Bluff",AR,71603,"2711 S Olive St,Pine Bluff,AR 71603","Commercial & Savings Banks, ATM Locations, Banks, Loans, Mortgages, Trust Companies",,,,34.20152,-92.00663,,,,"Mon - Fri: 9:00 am - 4:00 pm","Phone: (870) 541-1385 Fax: (870) 541-1385 TollFree: (866) 246-2400 Toll Free: (866) 246-2400",,"all major credit cards, amex, discover, master card, visa",,"Simmons First National Bank","http://simmonsbank.com https://simmonsbank.com http://simmonsfirst.com","Parking: Lot, Free Wheelchair Accessible: Yes",,,,,,,,
17751294,2614982,"2020-09-27 06:43:36","Northern Michigan Bank & Trust",http://www.nmbank.com,support@nmbank.com,"(906) 828-2731","600 S Carpenter Ave",Kingsford,MI,49802,"600 S Carpenter Ave,Kingsford,MI 49802","Commercial & Savings Banks, ATM Locations, Banks, Financial Services, Financing Services, Loans, Mortgages, Real Estate Loans, Trust Companies",,,,45.80175,-88.07017,,,,"Mon - Fri: 8:30 am - 5:00 pm Sat Closed","Phone: (906) 774-0255 Phone: (906) 774-6200 Primary Phone: (906) 774-0255 Fax: (906) 774-1703",,,,"Northern Michigan Bank & Trust ATM",http://www.nmbank.com,,,,,,,,,
17751318,2614983,"2020-09-27 06:43:36","Mauch Chunk Trust Company",http://www.mauchchunktrust.com,,"(570) 325-2762","1 Susquehanna Dr","Jim Thorpe",PA,18229,"1 Susquehanna Dr,Jim Thorpe,PA 18229","Banks, ATM Locations, Commercial & Savings Banks, Financial Planning Consultants, Financial Services, Investments, Loans, Mortgages, Real Estate Loans, Stock & Bond Brokers, Trust Companies",,,,40.98648,-75.67555,https://i2.ypcdn.com/blob/200c807f3a17696d4ba54422fdf2cafdc84824a1_100x100_crop.jpg?f9d23e1,"Neighbors you know, bankers you trust.",,"Mon - Thu: 9:00 am - 3:00 pm Fri: 9:00 am - 6:00 pm Sat - Sun Closed Holiday Hours 2020/01/01 Closed Holiday Hours 2020/11/26 Closed Holiday Hours 2018/12/31 9:00 am - 3:00 pm Holiday Hours 2020/12/25 Closed Holiday Hours 2020/10/12 Closed","TollFree: (877) 325-2265",,"cash, check, debit",,,"Primary Website Additional location info",,,,,,,,,
17751598,2615038,"2020-09-27 06:43:37","WesBanco Bank",https://locations.wesbanco.com/wv/weirton/333-penco-road,humanresources@wesbanco.com,"(800) 905-9043","333 Penco Rd",Weirton,WV,26062,"333 Penco Rd,Weirton,WV 26062","Commercial & Savings Banks, ATM Locations, Banks, Financial Services, Insurance, Investments, Mortgages, Mutual Funds, Trust Companies",,,,40.40827,-80.54663,https://i2.ypcdn.com/blob/f86844654fe1f65b104e2283c95b2db3379b8401_100x100_crop.jpg?f9d23e1,,"Founded in 1870, WesBanco is a diversified and well-balanced financial services institution, with a community bank at its core, built upon a strong legacy of credit and risk management. WesBancoВ’s customer-centric service culture is focused on building long-term customer relationships by pledging to serve your personal financial needs and help grow your business. WesBanco continues to strengthen its franchise by expanding into new and diversified markets with strong demographics to operate in six states within the Midwest and Mid-South, with top market share across all our major markets. The successful execution of our growth and diversification plans has enabled WesBanco to transform into a diversified, emerging regional financial institution built upon a century-old trust business and 150-year old community bank. WesBancoВ’s Trust and Investment Services Department has helped generations of individuals and corporations build and preserve wealth and achieve their financial goals for more than 100 years by providing trust, wealth management, and private banking services, as well as serving as the registered investment advisor to a proprietary mutual fund family, the WesMark Funds. In addition, WesBanco operates an insurance agency, WesBanco Insurance Services, Inc., and a full service broker/dealer, WesBanco Securities, Inc. WesBanco has maintained its strong community banking roots and commitment to the success of the communities in which we do business. As testament to this legacy, since 2001 WesBancoВ’s affiliate, WesBanco Bank, has earned consecutive Community Reinvestment Act (CRA) В“outstandingВ” ratings, the highest rating awarded, from bank regulators for the BankВ’s performance in meeting community credit needs. In addition, WesBanco Bank has again been named one of AmericaВ’s В“Best BanksВ” by a leading financial magazine В– the tenth year making the list since its inception during 2010. We invite you to see why WesBanco is, by all accounts, better.","Mon Closed Tue - Fri: 9:00 am - 4:00 pm Sat - Sun Closed",,,,,,https://locations.wesbanco.com/wv/weirton/333-penco-road,,,,,,,,,
17752277,2615186,"2020-09-27 06:43:37","Simmons Bank",https://www.simmonsbank.com,,"(417) 466-4442","500 E Mount Vernon Blvd","Mount Vernon",MO,65712,"500 E Mount Vernon Blvd,Mount Vernon,MO 65712","Commercial & Savings Banks, ATM Locations, Banks, Loans, Mortgages, Trust Companies",,,,37.0948,-93.81475,,,,"Mon - Fri: 8:30 am - 5:00 pm","Phone: (417) 466-4029 Fax: (417) 466-4029 Toll Free: (866) 246-2400 TollFree: (866) 246-2400 TollFree: (800) 522-0708",,debit,,"Simmons Bank ATM","https://www.simmonsbank.com http://simmonsbank.com",,,,,,,,,
17752659,2615262,"2020-09-27 06:43:37","Simmons Bank",http://simmonsbank.com,,"(870) 541-1329","1515 W 42nd Ave","Pine Bluff",AR,71603,"1515 W 42nd Ave,Pine Bluff,AR 71603","Commercial & Savings Banks, ATM Locations, Banks, Loans, Mortgages, Trust Companies",,,,34.18656,-92.0175,,,,,"TollFree: (866) 246-2400 Toll Free: (866) 246-2400",,debit,,,"http://simmonsbank.com https://simmonsbank.com",,,,,,,,,
17754341,2615594,"2020-09-27 06:43:37","Simmons Bank",http://simmonsbank.com,,"(731) 235-2690","302 N Front St",Greenfield,TN,38230,"302 N Front St,Greenfield,TN 38230","Banks, ATM Locations, Commercial & Savings Banks, Financial Planning Consultants, Loans, Mortgages, Trust Companies",,,,36.15634,-88.80014,,,,"Mon - Thu: 8:00 am - 4:00 pm Fri: 8:00 am - 5:00 pm","Phone: (731) 235-2692 Phone: (901) 853-5100 Fax: (731) 235-2692 Toll Free: (866) 246-2400 TollFree: (866) 246-2400",,debit,,"Simmons Bank ATM","http://simmonsbank.com https://simmonsbank.com",,,,,,,,,