business_x_category.id,business.id,business.ts,business.business_name,business.home_page,business.email_address,business.phone,business.street,business.city,business.state,business.zip_code,business.full_address,business.category,business.rating,business.number_of_reviews,business.bbb_rating_or_license,business.latitude,business.longitude,business.cover_image,business.slogan,business.general_info,business.regular_hours,business.extra_phones,business.services_products,business.payment,business.price_range,business.aka,business.other_links,business.other_information,business.review_1_name,business.review_1_date,business.review_1_rating,business.review_1_text,business.review_2_name,business.review_2_date,business.review_2_rating,business.review_2_text
1060339,337646,"2020-09-27 03:03:35","Independent Legal Solutions- Attorney Assisted & Registered",http://paralegaldocumentservices.com,rcparalegalservices@gmail.com,"(909) 451-9819","123 E 9th St Ste 100-a",Upland,CA,91786,"123 E 9th St Ste 100-a,Upland,CA 91786","Estate Planning, Probate, & Living Trusts, Child Custody Attorneys, Divorce Assistance, Legal Document Assistance, Legal Forms, Notaries Public, Paralegals, Process Servers, Wills, Trusts & Estate Planning Attorneys",5,"1 Review",,34.09633,-117.64929,https://i1.ypcdn.com/blob/54dd1c322ad366d4b295e317334646fd5d712ae3_100x100_crop.jpg?f9d23e1,"Attorney Assisted Paralegal Services","Independent Legal Solutions is a full service paralegal firm offering the self represented individual assistance in preparing legal documents for a variety of civil, small claims, family law, probate, divorce, custody and visitation, wills trusts and probate, name change, annulments, pre and post nuptial agreements, affidavits, judgments, writs, wage garnishments, motions and oppositions. All documents are attorney assisted and attorney reviewed. We also offer mobile notary public services and registered process servers.","Mon - Thu: 8:30 am - 6:00 pm Fri: 8:30 am - 3:00 pm",,,"amex, cash, check, debit, discover, visa, financing available, mastercard, paypal, all major credit cards, master card",,,http://paralegaldocumentservices.com,"Parking: Lot, Self, Free Wheelchair Accessible: Yes","Carol H.",03/04/2017,five,"Carol was great. We had used another paralegal to get a divorce but they closed their doors and ran off with our money before finishing. Highly recommended",,,,
1061307,337892,"2020-09-27 03:03:35","Notary Plus",,,"(318) 239-3861","104 E Jefferson Ave",Bastrop,LA,71220,"104 E Jefferson Ave,Bastrop,LA 71220","Real Estate Title Service, Divorce Assistance, Legal Document Assistance, Notaries Public, Wills, Trusts & Estate Planning Attorneys",5,"1 Review",,32.77699,-91.91409,https://i1.ypcdn.com/blob/2d7a006290a37ba2e271d65c0091c9b40254bc02_100x100_crop.jpg?f9d23e1,,,"Mon - Fri: 9:00 am - 5:00 pm Sat - Sun Closed",,,"debit, check, cash, all major credit cards",,,,"Parking: Lot",jonmtubbs,09/26/2013,five,"Very friendly, fast, and honest lady. Beautiful office and very affordable. Best thing is, its local!!",,,,
1062264,338109,"2020-09-27 03:03:42","DeBates Raymond P.C.",http://www.debateslaw.com,rdebates@colonialtitlecompany.com,"(586) 863-5270","27500 Harper Ave Ste 200","Saint Clair Shores",MI,48081,"27500 Harper Ave Ste 200,Saint Clair Shores,MI 48081","Notaries Public, Attorneys, Landlord & Tenant Attorneys, Real Estate Attorneys, Title Companies, Wills, Trusts & Estate Planning Attorneys",,,,42.49427,-82.89708,https://i1.ypcdn.com/blob/71e13a7d4723df5609cf8abfd5bbeee12e3b9ea9_100x100_crop.jpg?f9d23e1,,"Raymond DeBates has been a licensed practicing attorney in the state of Michigan since 1984. He obtained a degree from Michigan State University in Resource Development and a Juris Doctorate degree from MSU/Detroit College of Law. Mr. DeBates main focuses are: Real Estate, closing and documents, Business formation, Finance, Foreclosures, and Land-lord Tenant Law. He has worked in numerous counties throughout Michigan. Mr. DeBates is a Member of the Michigan State Bar & is admitted to practice in Federal Courts. He is a member of the real property ad business law sections of the State Bar of Michigan.",,"Fax: (586) 774-7040",,"check, cash, no credit cards",,"DeBates Raymond Esq.","http://www.debateslaw.com http://www.rdebates.com",,,,,,,,,
1063263,338366,"2020-09-27 03:03:42","Anderson & Anderson",,,"(985) 643-6443","2217 2nd St",Slidell,LA,70458,"2217 2nd St,Slidell,LA 70458","Notaries Public, Attorneys, Criminal Law Attorneys, Family Law Attorneys, Personal Injury Law Attorneys, Probate Law Attorneys, Wills, Trusts & Estate Planning Attorneys",,,,30.2738,-89.78183,,"""Since 1981""","Formed as a partnership of law corporations in 1985, Anderson & Anderson originated with the founding of Joseph P. Anderson, Jr., Ltd. in 1981. As so established, the firm has engaged in the practice of law continuously since 1981 in Slidell, Louisiana. The firm has sustained growth through maintaining its customary standards of hard work, professionalism and personalized service and has a well-established tradition of handling complex cases and advancing novel legal theories. The firm also has a well-established tradition of serving and financially supporting Slidell area civic, charitable and religious organizations.","Mon - Fri: 9:00 am - 5:00 pm",,,,,,,"Specialties: Workers Compensation, Partnerships, Divorce & Family",,,,,,,,
1064499,338651,"2020-09-27 03:03:42","Pickering Law Corporation",http://www.pickeringlawoffice.com,pickeringlaw@sbcglobal.net,"(530) 953-2787","1915 Placer St",Redding,CA,96001,"1915 Placer St,Redding,CA 96001","Attorneys, Administrative & Governmental Law Attorneys, Business Law Attorneys, Civil Litigation & Trial Law Attorneys, Construction Law Attorneys, Corporation & Partnership Law Attorneys, Employee Benefits & Worker Compensation Attorneys, Environment & Natural Resources Law Attorneys, Estate Planning Attorneys, Estate Planning, Probate, & Living Trusts, Family Law Attorneys, General Practice Attorneys, Insurance Attorneys, International Law Attorneys, Labor & Employment Law Attorneys, Litigation & Tort Attorneys, Notaries Public, Personal Injury Law Attorneys, Probate Law Attorneys, Real Estate Attorneys, Wills, Trusts & Estate Planning Attorneys, Wrongful Death Attorneys",,,,40.5805,-122.3967,https://i1.ypcdn.com/blob/223d7ca8c5df25ab2a9e790abae2e497ef0e4a27_100x100_crop.jpg?f9d23e1,,,"Mon - Thu: 8:30 am - 5:00 pm Fri: 8:30 am - 12:00 pm Sat - Sun Closed","Fax: (530) 241-3145",,,,,http://www.pickeringlawoffice.com,,,,,,,,,
1064946,338742,"2020-09-27 03:03:42","Carol Vincent Miller",http://www.millerhornlaw.com,carol.miller@millerhornlaw.com,"(336) 228-0735","412 Alamance Rd",Burlington,NC,27215,"412 Alamance Rd,Burlington,NC 27215","Arbitration Services, Attorneys, Business Law Attorneys, Child Custody Attorneys, Corporation & Partnership Law Attorneys, Criminal Law Attorneys, Divorce Attorneys, Domestic Violence Attorneys, Employment Discrimination Attorneys, Estate Planning Attorneys, Family Law Attorneys, General Practice Attorneys, Legal Service Plans, Mediation Services, Notaries Public, Probate Law Attorneys, Seals-Notary & Corporation, Tax Attorneys, Wills, Trusts & Estate Planning Attorneys",,,,36.07667,-79.4654,,,,"Mon - Fri: 8:30 am - 5:30 pm","Phone: (336) 227-8851",,,,,http://www.millerhornlaw.com,"Parking: Lot, Self, On Site, Free, Private Wheelchair Accessible: Yes",,,,,,,,
1068071,339506,"2020-09-27 03:03:45","Angelus, George G",http://www.angeluslaw.com,,"(504) 434-5481","700 Camp St","New Orleans",LA,70130,"700 Camp St,New Orleans,LA 70130","Notaries Public, Attorneys, Civil Litigation & Trial Law Attorneys, Criminal Law Attorneys, General Practice Attorneys, Wills, Trusts & Estate Planning Attorneys",,,,29.94676,-90.06948,,,"Landlord-Tenant *Notary Public *Fraud *Incorporation *Community Property *Civil Law *Criminal Law* Expungement *Trusts *Inheritance *Domestic Mon-Fri 8-5:30 Sat/Sun By Appointment only.","Mon - Fri: 8:00 am - 5:30 pm Sat - Sun Closed",,,"check, no credit cards",,,http://www.angeluslaw.com,"Specialties: Accidents, General Practice",,,,,,,,
1068742,339677,"2020-09-27 03:03:45","Mobile Notary",,btwprop@gmail.com,"(786) 385-5427","5238 SW 149th Ave",Miramar,FL,33027,"5238 SW 149th Ave,Miramar,FL 33027","Notaries Public, Legal Document Assistance, Legal Forms, Medical Records Service, Wills, Trusts & Estate Planning Attorneys",,,,25.96041,-80.34626,,"Fast Reliable Service !!!",,"Mon - Sun: 7:00 am - 9:00 pm",,,cash,,"Real Estate Closings",,,,,,,,,,
1068920,339719,"2020-09-27 03:03:45","24-Hour Legal, Mobile Notary, & Drug Testing",,,"(229) 638-1484","PO Box 3300",Albany,GA,31706,"PO Box 3300,Albany,GA 31706","Notaries Public, Drug Testing, Legal Document Assistance, Legal Forms, Process Servers, Wills, Trusts & Estate Planning Attorneys",,,,31.5783,-84.1558,,"""We're Here While Others Sleep",,"Mon - Fri: Open 24 Hours Sun: Open 24 Hours",,,"mastercard, visa, discover, all major credit cards, amex",,,,,,,,,,,,
1070239,340029,"2020-09-27 03:03:45","Josh's Mobile Notary service",,Oneoption.success@yahoo.com,"(682) 203-5676","7004 Parkland ct","Fort Worth",TX,76137,"7004 Parkland ct,Fort Worth,TX 76137","Wills, Trusts & Estate Planning Attorneys, Legal Document Assistance, Legal Forms, Legal Service Plans, Notaries Public",,,,32.86713,-97.286,,,,"Mon - Sun: 9:00 am - 9:00 pm","MobilePhone: (682) 203-5676",,"debit, cash, all major credit cards",,,,,,,,,,,,
1070348,340055,"2020-09-27 03:03:45","Carol A Newman Law Firm",http://carolanewmanlawfirm.com/,,"(225) 224-3258","10124 Jefferson Hwy","Baton Rouge",LA,70809,"10124 Jefferson Hwy,Baton Rouge,LA 70809","Notaries Public, Attorneys, Estate Planning Attorneys, Insurance, Property & Casualty Insurance, Real Estate Attorneys, Title & Mortgage Insurance, Title Companies, Wills, Trusts & Estate Planning Attorneys",,,,30.40896,-91.07114,,,,"Mon - Fri: 9:00 am - 5:00 pm",,,,,,"http://carolanewmanlawfirm.com http://www.murphylawfirm.com",,,,,,,,,
1070525,340101,"2020-09-27 03:03:45","D. Ian Allison -Notary Public",,,"(916) 342-2482","Po Box 160213",Sacramento,CA,95816,"Po Box 160213,Sacramento,CA 95816","Estate Planning, Probate, & Living Trusts, Mobile Offices & Commercial Units, Notaries Public, Real Estate Agents, Wills, Trusts & Estate Planning Attorneys",,,,38.57279,-121.46753,,"Notary Public, Signing Agent (Loans)","Notary Services, Inspections, Oaths of Office, CID Election Supervision, Advanced Health Care Directives, Legal Documents, Will Witnessing (Non-Notary Function)","Mon - Sun: Open 24 Hours",,,,,,,,,,,,,,,
1070859,340182,"2020-09-27 03:03:45","The Law Offices of Jennifer Gomez, P.A.",http://www.jennifergomez.com,jg@jennifergomez.com,"(561) 577-6136","140 S University Dr Ste A",Plantation,FL,33324,"140 S University Dr Ste A,Plantation,FL 33324","Estate Planning, Probate, & Living Trusts, Estate Planning Attorneys, Notaries Public, Wills, Trusts & Estate Planning Attorneys",,,,26.11876,-80.25165,,,,"Mon - Fri: 9:00 am - 5:00 pm",,,"debit, check, cash, all major credit cards",,,http://www.jennifergomez.com,,,,,,,,,
1072078,340498,"2020-09-27 03:03:45","Dotted Line Notary Service",,totalpackageprocessing@gmail.com,"(704) 713-2191","5015 Rivergreen Lane",Charlotte,NC,28227,"5015 Rivergreen Lane,Charlotte,NC 28227","Wills, Trusts & Estate Planning Attorneys, Notaries Public, Real Estate Loan Processing, Real Estate Loans, Title Companies",,,,35.1873,-80.71174,,,,"Mon - Sat: Open 24 Hours",,,"check, cash",,,,,,,,,,,,
1073825,340921,"2020-09-27 03:03:46","Clemmer's Notary",,ericaclemmer@hotmail.com,"(724) 366-7163",,Uniontown,PA,15401,"Uniontown,PA 15401","Wills, Trusts & Estate Planning Attorneys, Notaries Public, Real Estate Loan Processing",,,,,,,"Professional. Convenient. Reasonable.","I am a Notary Public and a Certified Signing Agent. I specialize in refinances (1st and 2nds), purchases, reverse mortgages, FHA, VA. No task is too big or too small so if you just need one simple document acknowledged I can do that too. Feel confident your documents will be handled by a true professional. I work out of my home office and I work for myself. So any time, day or night, I can get your Notary Needs done correctly. I will come to you. I travel anywhere in Fayette County, Allegheny County, Washington County, Greensburg, Beaver, and surrounding counties under special circumstances. Call me and we can work something out. I look forward to fulfilling your needs and helping you in anyway I can. Background checked, Notary Certified Loan Signer","Mon - Sun: Open 24 Hours",,,"cash only",,,,,,,,,,,,
1074004,340964,"2020-09-27 03:03:46","Robinson and Lauterbach, PLLC",http://www.robinsonlaw-gastonia.com,,"(704) 864-5728","246 W Main Ave",Gastonia,NC,28052,"246 W Main Ave,Gastonia,NC 28052","Attorneys, Accident & Property Damage Attorneys, Business Law Attorneys, Notaries Public, Paralegals, Personal Injury Law Attorneys, Real Estate Attorneys, Wills, Trusts & Estate Planning Attorneys",,,,35.264,-81.18467,https://i1.ypcdn.com/blob/d983b07f516cc42aa11ae224d5a1d5143c83de2c_100x100_crop.jpg?f9d23e1,,"Dealing with complex legal issues can be intimidating. So can choosing the right attorney. To make sure your rights are properly protected throughout the legal process, it is crucial to have an experienced, accomplished lawyer on your side. Gaston County Lawyer for Real Estate Closings, and Estate Planning. Our goal: to provide the highest standard of legal representation to all of our clients. Born and Raised in Gaston County our attorneys understand life in this area because they were born and raised here. We understand the local customs and are familiar with the local judicial system and know what it takes to achieve positive results for our clients. We look forward to helping you resolve your legal issues in a way that protects your best interests. To schedule a consultation with Robinson and Lauterbach Law Firm, call us at 980-989-1174","Mon - Fri: 8:00 am - 5:00 pm Sat - Sun Closed",,,,,,http://www.robinsonlaw-gastonia.com,,,,,,,,,
1074024,340968,"2020-09-27 03:03:46","Kellie Vasen, Vasen Legal Services",http://www.vasenlegalservices.com,,"(530) 626-4300","3062 Cedar Ravine Rd",Placerville,CA,95667,"3062 Cedar Ravine Rd,Placerville,CA 95667","Attorneys, Notaries Public, Wills, Trusts & Estate Planning Attorneys",,,,38.72742,-120.79575,,,,"Mon - Fri: 9:30 am - 5:00 pm Sat - Sun Closed",,,"check, cash, no credit cards",,,http://www.vasenlegalservices.com,,,,,,,,,
1074259,341026,"2020-09-27 03:03:53","Shah & Trivedi CPA, PLLC",http://shahandtrivedicpa.com,contactus@shahandtrivedicpa.com,"(980) 290-3600","3230 Prosperity Church Road,Suite 202",Charlotte,NC,28269,"3230 Prosperity Church Road,Suite 202,Charlotte,NC 28269","Business Management, Accountants-Certified Public, Accounting Services, Bookkeeping, Financial Planners, Health Insurance, Insurance, Life Insurance, Notaries Public, Payroll Service, Retirement Planning Services, Seals-Notary & Corporation, Wills, Trusts & Estate Planning Attorneys",5,"1 Review",,35.34394,-80.77078,,"Your financial success is our business!","Shah & Trivedi CPA, PLLC is a leading Charlotte, NC based CPA firm providing accounting, tax, wealth management and business advisory services. Our mission is to make a difference with our quality, integrity and knowledge in our clients, our people, and the communities we live in. Shah and Trivedi CPA, PLLC was founded by the partners having a combined experience of over 50 years. Our story is pretty simple - we love what we do and have the passion to unlock the potential. We make it our business to really know our clients. Whether that means knowing their plans for the future of their business, the best way to fund their children's education, personal retirement goals, or even re-designing their financial goals, our clients know they can count on us to help them guide through the process We are the member of the American Institute of Certified Public Accountants and the individuals of the professional staff holds membership within the North Carolina Board. We specialize in providing bookkeeping, payroll, tax, wealth management, retirement planning, college education funding, and business consultation for public, private, government and not-for-profit organizations. We believe in the value of developing personal relationships with our clients. These relationships are built on trust, integrity, following through with commitments, and being responsive to the needs of others. We understand your need for timely and accurate financial and tax reporting, and we will work to exceed your expectations. The core values we live up to are as follows: В•Honesty and Integrity - We meet our professional responsibilities in an ethical and fair manner В•Quality - We provide services of the highest quality to our clients that consistently exceed their expectations В•Professionalism and Knowledge - We ensure that we are continually learning, growing, and are recognized as thought leaders in the specialties В•Dignity and Respect - We treat every individual and relationship with dignity and respect В•Community - We support the communities in which we live, work and play with our collective human and financial resources","Mon - Fri: 9:00 am - 5:00 pm Sat - Sun Closed",,,"all major credit cards, check, debit, visa, discover, mastercard",,,"Primary Website",,"Yash P.",10/16/2019,five,"Very personable and professional. Will keep going back. They provide me with all my business services like payroll, bookkeeping, sales tax filing, addressing notices, supporting with my audit requests as well as filing our business and individual taxes for all the partners.",,,,
1075112,341235,"2020-09-27 03:03:53","Source Documents",http://sourcedocsinc.com,sourcedocsinc@gmail.com,"(805) 641-2010","2827 E Thompson Blvd",Ventura,CA,93003,"2827 E Thompson Blvd,Ventura,CA 93003","Legal Forms, Adoption Services, Attorneys Referral & Information Service, Divorce Assistance, Document Examiners, Estate Planning, Probate, & Living Trusts, Guardianship Services, Immigration & Naturalization Consultants, Incorporating Companies, Legal Document Assistance, Mediation Services, Notaries Public, Paralegals, Wills, Trusts & Estate Planning Attorneys",,,,34.27231,-119.25836,https://i2.ypcdn.com/blob/26aa9e773cd39f183caf4d5676ec67844caae6c3_100x100_crop.jpg?f9d23e1,,"Legal Document Assistant, authorized to prepare complete legal documents at the direction of the client. We assist the client to handle their legal matters without the cost of an attorney. helping clients avoid simple mistakes and ensuring all critical details on complex legal forms are correctly answered and complete.","Mon - Fri: 10:00 am - 6:00 pm",,,"visa, discover, mastercard, all major credit cards, debit, amex",,,http://sourcedocsinc.com,"Parking: Lot, Self, On Site, Free",,,,,,,,
1076099,341476,"2020-09-27 03:03:53","Riverside Document Services",http://www.prepmydocs.com,prepmydocs@yahoo.com,"(951) 684-7363","6117 Brockton Ave",Riverside,CA,92506,"6117 Brockton Ave,Riverside,CA 92506","Notaries Public, Attorneys, Bankruptcy Services, Divorce Assistance, Divorce Attorneys, Estate Planning Attorneys, Estate Planning, Probate, & Living Trusts, Family Law Attorneys, Guardianship Services, Investment Advisory Service, Legal Document Assistance, Mediation Services, Paralegals, Real Estate Agents, Real Estate Developers, Wills, Trusts & Estate Planning Attorneys",5,"1 Review",,33.95946,-117.39722,https://i1.ypcdn.com/blob/c342d0fa0e76ad8c656a8d3d37b759aa51e01211_100x100_crop.jpg?f9d23e1,,,"Mon - Fri: 8:30 am - 5:30 pm",,,,,"Riverside County Legal Services",http://www.prepmydocs.com,,"Maria T.",05/30/2019,five,"Im giving them 5 stars because they were very helpful. I needed help with a document at a very early time and Ivette, the owner, was able to help me. She was very professional and fast. Their fees are very reasonable compared to others that I called. Thank you Ivette. I highly recommended their office.",,,,
1076866,341682,"2020-09-27 03:03:53","Come To You Notary and Apostille",http://www.cometoyounotary.com,,"(425) 742-5931",,Mukilteo,WA,98275,"Mukilteo,WA 98275","Escrow Service, Adoption Services, Immigration & Naturalization Consultants, Notaries Public, Wills, Trusts & Estate Planning Attorneys",,,,,,,"If it's important, notarize it!","We have served the greater Seattle, Lynnwood, and Bellevue communities since 1997. Our notaries are insured to notarize all documents including deeds and powers of attorney.",,"24 Hour Phones: (800) 622-4030",,"master card, check, discover, debit, visa",,"Fast Apostille Service","Notary and Apostille Service",,,,,,,,,
1078369,342051,"2020-09-27 03:03:55","Darling's High Desert Signings Notary, Vehicle Registration & Live Scan",http://www.highdesertsignings.com,info@highdesertsignings.com,"(760) 646-8909","128 E. Buena Vista St.",Barstow,CA,92311,"128 E. Buena Vista St.,Barstow,CA 92311","Vehicle License & Registration, Divorce Assistance, Eviction Service, Fax Service, Fingerprinting, Legal Document Assistance, Notaries Public, Paralegals, Wills, Trusts & Estate Planning Attorneys",,,,34.89536,-117.02635,,"Customer Service Is Our Pride","Darling's High Desert Signings is licensed by the California Department of Motor Vehicle to perform Registration Services and Verification of Vehicle. Our organization is licensed by the Department of Justice and the California Department of Justice to perform Fingerprinting and Live Scan. Our staff is certified by the National Notary Association as Notary Public and Certified Signing Agents. Darling's High Desert Signings provides mobile Notary, copying and faxing.We look forward to serving you and your needs. Customer Service Is Our Pride","Mon - Thu: 9:00 am - 5:00 pm Fri: 9:00 am - 3:00 pm Sat: 9:00 am - 2:00 pm Sun Closed Holiday Hours 2020/01/01 Closed Holiday Hours 2020/05/25 Closed Holiday Hours 2020/09/07 Closed Holiday Hours 2020/11/26 Closed Holiday Hours 2020/07/04 Closed Holiday Hours 2020/12/25 Closed",,,"discover, visa, mastercard, all major credit cards, amex, company card, check, debit, paypal",,,http://www.highdesertsignings.com,,,,,,,,,
1078627,342111,"2020-09-27 03:03:55","Tulane Ave Law Center LLC",http://fastlendinghelp.com,,"(504) 822-4488","2735 Tulane Ave","New Orleans",LA,70119,"2735 Tulane Ave,New Orleans,LA 70119","Notaries Public, Attorneys, Criminal Law Attorneys, Divorce Attorneys, Family Law Attorneys, Probate Law Attorneys, Wills, Trusts & Estate Planning Attorneys",,,,29.96246,-90.09138,,,,"Mon - Fri: 9:00 am - 5:00 pm",,,,,,http://fastlendinghelp.com,,,,,,,,,
1081449,342798,"2020-09-27 03:03:55","Tillery And Tillery Attys",http://.,,"(504) 828-1768","701 Metairie Rd",Metairie,LA,70005,"701 Metairie Rd,Metairie,LA 70005","Notaries Public, Attorneys, Estate Planning Attorneys, Personal Injury Law Attorneys, Real Estate Attorneys, Wills, Trusts & Estate Planning Attorneys",,,,29.98886,-90.13084,,,,"Mon - Fri: 9:00 am - 5:00 pm",,,,,,"http://. http://tilleryandtillery.com http://tilleryandtillery.com/home.html",,,,,,,,,